IEC 60086-1
type: Concept
broader: 対応国際規格
in scheme: JIS⇔ISO/IEC対応規格
notation: IEC 60086-1
scope note: JISC整合性情報DBに現れる版: IEC 60086-1:2021

IEC 60086-2
type: Concept
broader: 対応国際規格
in scheme: JIS⇔ISO/IEC対応規格
notation: IEC 60086-2
scope note: JISC整合性情報DBに現れる版: IEC 60086-2:2021

IEC 60095-1
type: Concept
broader: 対応国際規格
in scheme: JIS⇔ISO/IEC対応規格
notation: IEC 60095-1
scope note: JISC整合性情報DBに現れる版: IEC/FDIS 60095-1:2018

IEC 60095-2
type: Concept
broader: 対応国際規格
in scheme: JIS⇔ISO/IEC対応規格
notation: IEC 60095-2
scope note: JISC整合性情報DBに現れる版: IEC 60095-2:2009

IEC 60095-4
type: Concept
broader: 対応国際規格
in scheme: JIS⇔ISO/IEC対応規格
notation: IEC 60095-4
scope note: JISC整合性情報DBに現れる版: IEC 60095-4:2008

IEC 60335-1
type: Concept
broader: 対応国際規格
in scheme: JIS⇔ISO/IEC対応規格
notation: IEC 60335-1
scope note: JISC整合性情報DBに現れる版: IEC 60335-1:2020

IEC 60584-1
type: Concept
broader: 対応国際規格
in scheme: JIS⇔ISO/IEC対応規格
notation: IEC 60584-1
scope note: JISC整合性情報DBに現れる版: IEC 60584-1:2013

IEC 60601-1
type: Concept
broader: 対応国際規格
in scheme: JIS⇔ISO/IEC対応規格
notation: IEC 60601-1
scope note: JISC整合性情報DBに現れる版: IEC 60601-1:2005

IEC 60601-1:2005
type: Concept
broader: 対応国際規格
in scheme: JIS⇔ISO/IEC対応規格
notation: IEC 60601-1:2005
scope note: JISC整合性情報DBに現れる版: IEC 60601-1:2005/AMD1:2012、IEC 60601-1:2005/AMD2:2020

IEC 60622
type: Concept
broader: 対応国際規格
in scheme: JIS⇔ISO/IEC対応規格
notation: IEC 60622
scope note: JISC整合性情報DBに現れる版: IEC 60622:2002

IEC 60825-1
type: Concept
broader: 対応国際規格
in scheme: JIS⇔ISO/IEC対応規格
notation: IEC 60825-1
scope note: JISC整合性情報DBに現れる版: IEC 60825-1:2014

IEC 61000-4-2
type: Concept
broader: 対応国際規格
in scheme: JIS⇔ISO/IEC対応規格
notation: IEC 61000-4-2
scope note: JISC整合性情報DBに現れる版: IEC 61000-4-2:2008

IEC 61951-1
type: Concept
broader: 対応国際規格
in scheme: JIS⇔ISO/IEC対応規格
notation: IEC 61951-1
scope note: JISC整合性情報DBに現れる版: IEC 61951-1 Amendment 1:2023、IEC 61951-1:2017

IEC 61951-2
type: Concept
broader: 対応国際規格
in scheme: JIS⇔ISO/IEC対応規格
notation: IEC 61951-2
scope note: JISC整合性情報DBに現れる版: IEC 61951-2 Amendment 1:2022、IEC 61951-2:2017

IEC 61960-3
type: Concept
broader: 対応国際規格
in scheme: JIS⇔ISO/IEC対応規格
notation: IEC 61960-3
scope note: JISC整合性情報DBに現れる版: IEC 61960-3:2017

IEC 62133-1
type: Concept
broader: 対応国際規格
in scheme: JIS⇔ISO/IEC対応規格
notation: IEC 62133-1
scope note: JISC整合性情報DBに現れる版: IEC 62133-1:2017

IEC 62133-2
type: Concept
broader: 対応国際規格
in scheme: JIS⇔ISO/IEC対応規格
notation: IEC 62133-2
scope note: JISC整合性情報DBに現れる版: IEC 62133-2:2017

IEC 62368-1
type: Concept
broader: 対応国際規格
in scheme: JIS⇔ISO/IEC対応規格
notation: IEC 62368-1
scope note: JISC整合性情報DBに現れる版: IEC 62368-1:2023

IEC 62619
type: Concept
broader: 対応国際規格
in scheme: JIS⇔ISO/IEC対応規格
notation: IEC 62619
scope note: JISC整合性情報DBに現れる版: IEC 62619:2022

IEC 62620
type: Concept
broader: 対応国際規格
in scheme: JIS⇔ISO/IEC対応規格
notation: IEC 62620
scope note: JISC整合性情報DBに現れる版: IEC 62620:2014

ISO 11664-4
type: Concept
broader: 対応国際規格
in scheme: JIS⇔ISO/IEC対応規格
notation: ISO 11664-4
scope note: JISC整合性情報DBに現れる版: ISO 11664-4:2008

ISO 12100
type: Concept
broader: 対応国際規格
in scheme: JIS⇔ISO/IEC対応規格
notation: ISO 12100
scope note: JISC整合性情報DBに現れる版: ISO 12100:2010

ISO 14001
type: Concept
broader: 対応国際規格
in scheme: JIS⇔ISO/IEC対応規格
notation: ISO 14001
scope note: JISC整合性情報DBに現れる版: ISO 14001 Amendment 1:2024、ISO 14001:2015

ISO 16895
type: Concept
broader: 対応国際規格
in scheme: JIS⇔ISO/IEC対応規格
notation: ISO 16895
scope note: JISC整合性情報DBに現れる版: ISO 16895:2016

ISO 1773
type: Concept
broader: 対応国際規格
in scheme: JIS⇔ISO/IEC対応規格
notation: ISO 1773
scope note: JISC整合性情報DBに現れる版: ISO 1773:1976

ISO 209
type: Concept
broader: 対応国際規格
in scheme: JIS⇔ISO/IEC対応規格
notation: ISO 209
scope note: JISC整合性情報DBに現れる版: ISO 209:2007

ISO 22196
type: Concept
broader: 対応国際規格
in scheme: JIS⇔ISO/IEC対応規格
notation: ISO 22196
scope note: JISC整合性情報DBに現れる版: ISO 22196:2007

ISO 22301
type: Concept
broader: 対応国際規格
in scheme: JIS⇔ISO/IEC対応規格
notation: ISO 22301
scope note: JISC整合性情報DBに現れる版: ISO 22301 Amendment 1:2024、ISO 22301:2019

ISO 23529
type: Concept
broader: 対応国際規格
in scheme: JIS⇔ISO/IEC対応規格
notation: ISO 23529
scope note: JISC整合性情報DBに現れる版: ISO 23529:2016

ISO 27769
type: Concept
broader: 対応国際規格
in scheme: JIS⇔ISO/IEC対応規格
notation: ISO 27769
scope note: JISC整合性情報DBに現れる版: ISO 27769:2016

ISO 286-1
type: Concept
broader: 対応国際規格
in scheme: JIS⇔ISO/IEC対応規格
notation: ISO 286-1
scope note: JISC整合性情報DBに現れる版: ISO 286-1:2010

ISO 31000
type: Concept
broader: 対応国際規格
in scheme: JIS⇔ISO/IEC対応規格
notation: ISO 31000
scope note: JISC整合性情報DBに現れる版: ISO 31000:2018

ISO 3819
type: Concept
broader: 対応国際規格
in scheme: JIS⇔ISO/IEC対応規格
notation: ISO 3819
scope note: JISC整合性情報DBに現れる版: ISO 3819:1985

ISO 383
type: Concept
broader: 対応国際規格
in scheme: JIS⇔ISO/IEC対応規格
notation: ISO 383
scope note: JISC整合性情報DBに現れる版: ISO 383:1976

ISO 45001
type: Concept
broader: 対応国際規格
in scheme: JIS⇔ISO/IEC対応規格
notation: ISO 45001
scope note: JISC整合性情報DBに現れる版: ISO 45001 Amendment 1:2024、ISO 45001:2018

ISO 4796
type: Concept
broader: 対応国際規格
in scheme: JIS⇔ISO/IEC対応規格
notation: ISO 4796
scope note: JISC整合性情報DBに現れる版: ISO 4796:1977

ISO 4797
type: Concept
broader: 対応国際規格
in scheme: JIS⇔ISO/IEC対応規格
notation: ISO 4797
scope note: JISC整合性情報DBに現れる版: ISO 4797:1981

ISO 4799
type: Concept
broader: 対応国際規格
in scheme: JIS⇔ISO/IEC対応規格
notation: ISO 4799
scope note: JISC整合性情報DBに現れる版: ISO 4799:1978

ISO 4800
type: Concept
broader: 対応国際規格
in scheme: JIS⇔ISO/IEC対応規格
notation: ISO 4800
scope note: JISC整合性情報DBに現れる版: ISO 4800:1977

ISO 630-1
type: Concept
broader: 対応国際規格
in scheme: JIS⇔ISO/IEC対応規格
notation: ISO 630-1
scope note: JISC整合性情報DBに現れる版: ISO 630-1:2021

ISO 630-2
type: Concept
broader: 対応国際規格
in scheme: JIS⇔ISO/IEC対応規格
notation: ISO 630-2
scope note: JISC整合性情報DBに現れる版: ISO 630-2:2021

ISO 6361-1
type: Concept
broader: 対応国際規格
in scheme: JIS⇔ISO/IEC対応規格
notation: ISO 6361-1
scope note: JISC整合性情報DBに現れる版: ISO 6361-1:2011

ISO 6361-2
type: Concept
broader: 対応国際規格
in scheme: JIS⇔ISO/IEC対応規格
notation: ISO 6361-2
scope note: JISC整合性情報DBに現れる版: ISO 6361-2:2014

ISO 6361-3
type: Concept
broader: 対応国際規格
in scheme: JIS⇔ISO/IEC対応規格
notation: ISO 6361-3
scope note: JISC整合性情報DBに現れる版: ISO 6361-3:2014

ISO 6361-4
type: Concept
broader: 対応国際規格
in scheme: JIS⇔ISO/IEC対応規格
notation: ISO 6361-4
scope note: JISC整合性情報DBに現れる版: ISO 6361-4:2014

ISO 6361-5
type: Concept
broader: 対応国際規格
in scheme: JIS⇔ISO/IEC対応規格
notation: ISO 6361-5
scope note: JISC整合性情報DBに現れる版: ISO 6361-5:2011

ISO 641
type: Concept
broader: 対応国際規格
in scheme: JIS⇔ISO/IEC対応規格
notation: ISO 641
scope note: JISC整合性情報DBに現れる版: ISO 641:1975

ISO 6892-1
type: Concept
broader: 対応国際規格
in scheme: JIS⇔ISO/IEC対応規格
notation: ISO 6892-1
scope note: JISC整合性情報DBに現れる版: ISO 6892-1:2019

ISO 719
type: Concept
broader: 対応国際規格
in scheme: JIS⇔ISO/IEC対応規格
notation: ISO 719
scope note: JISC整合性情報DBに現れる版: ISO 719:1985

ISO 7991
type: Concept
broader: 対応国際規格
in scheme: JIS⇔ISO/IEC対応規格
notation: ISO 7991
scope note: JISC整合性情報DBに現れる版: ISO 7991:1987

ISO 80000-1
type: Concept
broader: 対応国際規格
in scheme: JIS⇔ISO/IEC対応規格
notation: ISO 80000-1
scope note: JISC整合性情報DBに現れる版: ISO 80000-1:2022

ISO 8601
type: Concept
broader: 対応国際規格
in scheme: JIS⇔ISO/IEC対応規格
notation: ISO 8601
scope note: JISC整合性情報DBに現れる版: ISO 8601:2000

ISO 9001
type: Concept
broader: 対応国際規格
in scheme: JIS⇔ISO/IEC対応規格
notation: ISO 9001
scope note: JISC整合性情報DBに現れる版: ISO 9001 Amendment 1:2024、ISO 9001:2015

ISO/IEC 10646
type: Concept
broader: 対応国際規格
in scheme: JIS⇔ISO/IEC対応規格
notation: ISO/IEC 10646
scope note: JISC整合性情報DBに現れる版: ISO/IEC 10646 Amendment 1:2019、ISO/IEC 10646 Amendment 2:2019、ISO/IEC 10646:2017

ISO/IEC 17025
type: Concept
broader: 対応国際規格
in scheme: JIS⇔ISO/IEC対応規格
notation: ISO/IEC 17025
scope note: JISC整合性情報DBに現れる版: ISO/IEC 17025:2017

ISO/IEC 25010
type: Concept
broader: 対応国際規格
in scheme: JIS⇔ISO/IEC対応規格
notation: ISO/IEC 25010
scope note: JISC整合性情報DBに現れる版: ISO/IEC 25010:2023

ISO/IEC 27001
type: Concept
broader: 対応国際規格
in scheme: JIS⇔ISO/IEC対応規格
notation: ISO/IEC 27001
scope note: JISC整合性情報DBに現れる版: ISO/IEC 27001 Amendment 1:2024、ISO/IEC 27001:2022

繊維板
type: Concept
broader: JIS規格
in scheme: JIS⇔ISO/IEC対応規格
notation: JIS A 5905
related match: ISO 16895
related match: ISO 27769
scope note: 最新改正/制定年: 2022(追補の年である場合がある)。対応国際規格: ISO 16895:2016(MOD)、ISO 27769:2016(MOD)(JISC整合性情報DB 2026-07-13照会)

製品の幾何特性仕様（ＧＰＳ）－長さに関わるサイズ公差のＩＳＯコード方式－第１部：サイズ公差，サイズ差及びはめあいの基礎
type: Concept
broader: JIS規格
in scheme: JIS⇔ISO/IEC対応規格
notation: JIS B 0401-1
scope note: 最新改正/制定年: 2016(追補の年である場合がある)。対応国際規格: ISO 286-1:2010(IDT)(JISC整合性情報DB 2026-07-13照会)

機械類の安全性－設計のための一般原則－リスクアセスメント及びリスク低減
type: Concept
broader: JIS規格
in scheme: JIS⇔ISO/IEC対応規格
notation: JIS B 9700
scope note: 最新改正/制定年: 2013(追補の年である場合がある)。対応国際規格: ISO 12100:2010(IDT)(JISC整合性情報DB 2026-07-13照会)

熱電対
type: Concept
broader: JIS規格
in scheme: JIS⇔ISO/IEC対応規格
notation: JIS C 1602
related match: IEC 60584-1
scope note: 最新改正/制定年: 2015(追補の年である場合がある)。対応国際規格: IEC 60584-1:2013(MOD)(JISC整合性情報DB 2026-07-13照会)

電磁両立性－第４－２部：試験及び測定技術－静電気放電イミュニティ試験
type: Concept
broader: JIS規格
in scheme: JIS⇔ISO/IEC対応規格
notation: JIS C 61000-4-2
scope note: 最新改正/制定年: 2012(追補の年である場合がある)。対応国際規格: IEC 61000-4-2:2008(IDT)(JISC整合性情報DB 2026-07-13照会)

ポータブル機器用二次電池の安全性－第１部：アルカリ蓄電池
type: Concept
broader: JIS規格
in scheme: JIS⇔ISO/IEC対応規格
notation: JIS C 62133-1
related match: IEC 62133-1
scope note: 最新改正/制定年: 2020(追補の年である場合がある)。対応国際規格: IEC 62133-1:2017(MOD)(JISC整合性情報DB 2026-07-13照会)

ポータブル機器用二次電池の安全性－第２部：リチウム二次電池
type: Concept
broader: JIS規格
in scheme: JIS⇔ISO/IEC対応規格
notation: JIS C 62133-2
related match: IEC 62133-2
scope note: 最新改正/制定年: 2020(追補の年である場合がある)。対応国際規格: IEC 62133-2:2017(MOD)(JISC整合性情報DB 2026-07-13照会)

オーディオ・ビデオ，情報及び通信技術機器－第１部：安全性要求事項
type: Concept
broader: JIS規格
in scheme: JIS⇔ISO/IEC対応規格
notation: JIS C 62368-1
related match: IEC 62368-1
scope note: 最新改正/制定年: 2026(追補の年である場合がある)。対応国際規格: IEC 62368-1:2023(MOD)(JISC整合性情報DB 2026-07-13照会)

レーザ製品の安全－クラス分け及び要求事項
type: Concept
broader: JIS規格
in scheme: JIS⇔ISO/IEC対応規格
notation: JIS C 6802
scope note: 最新改正/制定年: 2025(追補の年である場合がある)。対応国際規格: IEC 60825-1:2014(IDT)(JISC整合性情報DB 2026-07-13照会)

一次電池通則
type: Concept
broader: JIS規格
in scheme: JIS⇔ISO/IEC対応規格
notation: JIS C 8500
related match: IEC 60086-1
scope note: 最新改正/制定年: 2022(追補の年である場合がある)。対応国際規格: IEC 60086-1:2021(MOD)(JISC整合性情報DB 2026-07-13照会)

一次電池個別製品仕様
type: Concept
broader: JIS規格
in scheme: JIS⇔ISO/IEC対応規格
notation: JIS C 8515
related match: IEC 60086-2
scope note: 最新改正/制定年: 2022(追補の年である場合がある)。対応国際規格: IEC 60086-2:2021(MOD)(JISC整合性情報DB 2026-07-13照会)

ポータブル機器用密閉型ニッケル・カドミウム蓄電池（単電池及び組電池）
type: Concept
broader: JIS規格
in scheme: JIS⇔ISO/IEC対応規格
notation: JIS C 8705
related match: IEC 61951-1
scope note: 最新改正/制定年: 2024(追補の年である場合がある)。対応国際規格: IEC 61951-1:2017(MOD)、IEC 61951-1 Amendment 1:2023(MOD)(JISC整合性情報DB 2026-07-13照会)

ポータブル機器用密閉型ニッケル・水素蓄電池（単電池及び組電池）
type: Concept
broader: JIS規格
in scheme: JIS⇔ISO/IEC対応規格
notation: JIS C 8708
related match: IEC 61951-2
scope note: 最新改正/制定年: 2024(追補の年である場合がある)。対応国際規格: IEC 61951-2:2017(MOD)、IEC 61951-2 Amendment 1:2022(MOD)(JISC整合性情報DB 2026-07-13照会)

シール形ニッケル・カドミウムアルカリ蓄電池
type: Concept
broader: JIS規格
in scheme: JIS⇔ISO/IEC対応規格
notation: JIS C 8709
related match: IEC 60622
scope note: 最新改正/制定年: 2004(追補の年である場合がある)。対応国際規格: IEC 60622:2002(MOD)(JISC整合性情報DB 2026-07-13照会)

ポータブル機器用リチウム二次電池
type: Concept
broader: JIS規格
in scheme: JIS⇔ISO/IEC対応規格
notation: JIS C 8711
related match: IEC 61960-3
scope note: 最新改正/制定年: 2019(追補の年である場合がある)。対応国際規格: IEC 61960-3:2017(MOD)(JISC整合性情報DB 2026-07-13照会)

産業用リチウム二次電池の単電池及び電池システム－第１部：性能要求事項
type: Concept
broader: JIS規格
in scheme: JIS⇔ISO/IEC対応規格
notation: JIS C 8715-1
related match: IEC 62620
scope note: 最新改正/制定年: 2018(追補の年である場合がある)。対応国際規格: IEC 62620:2014(MOD)(JISC整合性情報DB 2026-07-13照会)

産業用リチウム二次電池の単電池及び電池システム－第２部：安全性要求事項
type: Concept
broader: JIS規格
in scheme: JIS⇔ISO/IEC対応規格
notation: JIS C 8715-2
related match: IEC 62619
scope note: 最新改正/制定年: 2024(追補の年である場合がある)。対応国際規格: IEC 62619:2022(MOD)(JISC整合性情報DB 2026-07-13照会)

家庭用及びこれに類する電気機器の安全性－第１部：通則
type: Concept
broader: JIS規格
in scheme: JIS⇔ISO/IEC対応規格
notation: JIS C 9335-1
related match: IEC 60335-1
scope note: 最新改正/制定年: 2023(追補の年である場合がある)。対応国際規格: IEC 60335-1:2020(MOD)(JISC整合性情報DB 2026-07-13照会)

始動用鉛蓄電池
type: Concept
broader: JIS規格
in scheme: JIS⇔ISO/IEC対応規格
notation: JIS D 5301
related match: IEC 60095-1
related match: IEC 60095-2
related match: IEC 60095-4
scope note: 最新改正/制定年: 2019(追補の年である場合がある)。対応国際規格: IEC 60095-2:2009(MOD)、IEC 60095-4:2008(MOD)、IEC/FDIS 60095-1:2018(MOD)(JISC整合性情報DB 2026-07-13照会)

一般構造用圧延鋼材
type: Concept
broader: JIS規格
in scheme: JIS⇔ISO/IEC対応規格
notation: JIS G 3101
related match: ISO 630-1
related match: ISO 630-2
scope note: 最新改正/制定年: 2024(追補の年である場合がある)。対応国際規格: ISO 630-1:2021(MOD)、ISO 630-2:2021(MOD)(JISC整合性情報DB 2026-07-13照会)

アルミニウム及びアルミニウム合金の板及び条
type: Concept
broader: JIS規格
in scheme: JIS⇔ISO/IEC対応規格
notation: JIS H 4000
related match: ISO 209
related match: ISO 6361-1
related match: ISO 6361-2
related match: ISO 6361-3
related match: ISO 6361-4
related match: ISO 6361-5
scope note: 最新改正/制定年: 2022(追補の年である場合がある)。対応国際規格: ISO 209:2007(MOD)、ISO 6361-1:2011(MOD)、ISO 6361-2:2014(MOD)、ISO 6361-3:2014(MOD)、ISO 6361-4:2014(MOD)、ISO 6361-5:2011(MOD)(JISC整合性情報DB 2026-07-13照会)

ゴム－物理試験方法通則
type: Concept
broader: JIS規格
in scheme: JIS⇔ISO/IEC対応規格
notation: JIS K 6250
related match: ISO 23529
scope note: 最新改正/制定年: 2019(追補の年である場合がある)。対応国際規格: ISO 23529:2016(MOD)(JISC整合性情報DB 2026-07-13照会)

JIS規格
type: Concept
source: https://wik.jp/law/324AC0000000185/a/11
source: https://wik.jp/law/324AC0000000185/a/2
source: https://wik.jp/law/324AC0000000185/a/20
based on provision: https://wik.jp/law/324AC0000000185/a/11/p/1
based on provision: https://wik.jp/law/324AC0000000185/a/2/p/1
based on provision: https://wik.jp/law/324AC0000000185/a/20/p/1
preferred label: JIS standards @en
scope note: 日本産業規格(産業標準化法)。notationは規格番号
top concept of: JIS⇔ISO/IEC対応規格

環境マネジメントシステム－要求事項及び利用の手引
type: Concept
broader: JIS規格
in scheme: JIS⇔ISO/IEC対応規格
notation: JIS Q 14001
scope note: 最新改正/制定年: 2025(追補の年である場合がある)。対応国際規格: ISO 14001:2015(IDT)、ISO 14001 Amendment 1:2024(IDT)(JISC整合性情報DB 2026-07-13照会)

試験所及び校正機関の能力に関する一般要求事項
type: Concept
broader: JIS規格
in scheme: JIS⇔ISO/IEC対応規格
notation: JIS Q 17025
scope note: 最新改正/制定年: 2018(追補の年である場合がある)。対応国際規格: ISO/IEC 17025:2017(IDT)(JISC整合性情報DB 2026-07-13照会)

セキュリティ及びレジリエンス－事業継続マネジメントシステム－要求事項
type: Concept
broader: JIS規格
in scheme: JIS⇔ISO/IEC対応規格
notation: JIS Q 22301
scope note: 最新改正/制定年: 2025(追補の年である場合がある)。対応国際規格: ISO 22301:2019(IDT)、ISO 22301 Amendment 1:2024(IDT)(JISC整合性情報DB 2026-07-13照会)

情報セキュリティ，サイバーセキュリティ及びプライバシー保護－情報セキュリティマネジメントシステム－要求事項
type: Concept
broader: JIS規格
in scheme: JIS⇔ISO/IEC対応規格
notation: JIS Q 27001
scope note: 最新改正/制定年: 2025(追補の年である場合がある)。対応国際規格: ISO/IEC 27001:2022(IDT)、ISO/IEC 27001 Amendment 1:2024(IDT)(JISC整合性情報DB 2026-07-13照会)

リスクマネジメント－指針
type: Concept
broader: JIS規格
in scheme: JIS⇔ISO/IEC対応規格
notation: JIS Q 31000
scope note: 最新改正/制定年: 2019(追補の年である場合がある)。対応国際規格: ISO 31000:2018(IDT)(JISC整合性情報DB 2026-07-13照会)

労働安全衛生マネジメントシステム－要求事項及び利用の手引
type: Concept
broader: JIS規格
in scheme: JIS⇔ISO/IEC対応規格
notation: JIS Q 45001
scope note: 最新改正/制定年: 2026(追補の年である場合がある)。対応国際規格: ISO 45001:2018(IDT)、ISO 45001 Amendment 1:2024(IDT)(JISC整合性情報DB 2026-07-13照会)

品質マネジメントシステム－要求事項
type: Concept
broader: JIS規格
in scheme: JIS⇔ISO/IEC対応規格
notation: JIS Q 9001
scope note: 最新改正/制定年: 2025(追補の年である場合がある)。対応国際規格: ISO 9001:2015(IDT)、ISO 9001 Amendment 1:2024(IDT)(JISC整合性情報DB 2026-07-13照会)

化学分析用ガラス器具
type: Concept
broader: JIS規格
in scheme: JIS⇔ISO/IEC対応規格
notation: JIS R 3503
related match: ISO 1773
related match: ISO 3819
related match: ISO 383
related match: ISO 4796
related match: ISO 4797
related match: ISO 4799
related match: ISO 4800
related match: ISO 641
related match: ISO 719
related match: ISO 7991
scope note: 最新改正/制定年: 2007(追補の年である場合がある)。対応国際規格: ISO 1773:1976(MOD)、ISO 3819:1985(MOD)、ISO 383:1976(MOD)、ISO 4796:1977(MOD)、ISO 4797:1981(MOD)、ISO 4799:1978(MOD)、ISO 4800:1977(MOD)、ISO 641:1975(MOD)、ISO 719:1985(MOD)、ISO 7991:1987(MOD)(JISC整合性情報DB 2026-07-13照会)

医用電気機器－第１部：基礎安全及び基本性能に関する一般要求事項
type: Concept
broader: JIS規格
in scheme: JIS⇔ISO/IEC対応規格
notation: JIS T 0601-1
related match: IEC 60601-1
related match: IEC 60601-1:2005
scope note: 最新改正/制定年: 2023(追補の年である場合がある)。対応国際規格: IEC 60601-1:2005(MOD)、IEC 60601-1:2005/AMD1:2012(MOD)、IEC 60601-1:2005/AMD2:2020(MOD)(JISC整合性情報DB 2026-07-13照会)

国際符号化文字集合（ＵＣＳ）
type: Concept
broader: JIS規格
in scheme: JIS⇔ISO/IEC対応規格
notation: JIS X 0221
scope note: 最新改正/制定年: 2020(追補の年である場合がある)。対応国際規格: ISO/IEC 10646:2017(IDT)、ISO/IEC 10646 Amendment 1:2019(IDT)、ISO/IEC 10646 Amendment 2:2019(IDT)(JISC整合性情報DB 2026-07-13照会)

情報交換のためのデータ要素及び交換形式－日付及び時刻の表記
type: Concept
broader: JIS規格
in scheme: JIS⇔ISO/IEC対応規格
notation: JIS X 0301
related match: ISO 8601
scope note: 最新改正/制定年: 2019(追補の年である場合がある)。対応国際規格: ISO 8601:2000(MOD)(JISC整合性情報DB 2026-07-13照会)

システム及びソフトウェア技術－システム及びソフトウェア製品の品質要求及び評価（ＳＱｕａＲＥ）－製品品質モデル
type: Concept
broader: JIS規格
in scheme: JIS⇔ISO/IEC対応規格
notation: JIS X 25010
scope note: 最新改正/制定年: 2025(追補の年である場合がある)。対応国際規格: ISO/IEC 25010:2023(IDT)(JISC整合性情報DB 2026-07-13照会)

金属材料引張試験方法
type: Concept
broader: JIS規格
in scheme: JIS⇔ISO/IEC対応規格
notation: JIS Z 2241
related match: ISO 6892-1
scope note: 最新改正/制定年: 2023(追補の年である場合がある)。対応国際規格: ISO 6892-1:2019(MOD)(JISC整合性情報DB 2026-07-13照会)

抗菌加工製品－抗菌性試験方法・抗菌効果
type: Concept
broader: JIS規格
in scheme: JIS⇔ISO/IEC対応規格
notation: JIS Z 2801
related match: ISO 22196
scope note: 最新改正/制定年: 2012(追補の年である場合がある)。対応国際規格: ISO 22196:2007(MOD)(JISC整合性情報DB 2026-07-13照会)

量及び単位－第１部：一般
type: Concept
broader: JIS規格
in scheme: JIS⇔ISO/IEC対応規格
notation: JIS Z 8000-1
related match: ISO 80000-1
scope note: 最新改正/制定年: 2025(追補の年である場合がある)。対応国際規格: ISO 80000-1:2022(MOD)(JISC整合性情報DB 2026-07-13照会)

測色－第４部：ＣＩＥ １９７６ Ｌ＊ａ＊ｂ＊色空間
type: Concept
broader: JIS規格
in scheme: JIS⇔ISO/IEC対応規格
notation: JIS Z 8781-4
related match: ISO 11664-4
scope note: 最新改正/制定年: 2013(追補の年である場合がある)。対応国際規格: ISO 11664-4:2008(MOD)(JISC整合性情報DB 2026-07-13照会)

対応国際規格
type: Concept
preferred label: Corresponding international standards @en
scope note: ISO/IEC規格の書誌概念(公式永続URIが存在しないため本語彙内に発行)。notationは規格番号
top concept of: JIS⇔ISO/IEC対応規格

Terra-International OÜ (Team KitaSan)
type: Organization

JIS⇔ISO/IEC対応規格
type: Ontology
type: ConceptScheme
description: 日本産業規格(JIS)とISO/IEC国際規格の対応関係(IDT/MOD/NEQ)を機械可読化する語彙。JISC「JIS・国際規格の整合性情報」データベースで全対応を照合済み。調達仕様・規制対応・EU電池規則対応(denchi)等の基盤。
issued: 2026-07-13
modified: 2026-07-17
publisher: Terra-International OÜ (Team KitaSan)
source: GnrInternationalStandardConsistency.html
competent ministry: keizaisangyo-sho
editorial note: JIS⇔ISO/IEC対応の公式一括リストは存在しない(JISC整合性情報DBは照会型)ため、本語彙は全行をJISC DBで照合した検証済みシード(38規格・67対応)から開始し順次拡充する。対応の程度はISO/IEC Guide 21-1:2005(JIS Z 8301:2019第36条)のIDT/MOD/NEQによる。リンク規約: IDT=closeMatch、MOD=relatedMatch、NEQ=リンクなし。IDTでも産業標準化法に基づく別個の日本語正文であるため exactMatch は用いない。ISO/IEC規格には公式の永続URIが存在しないため、本語彙内に書誌概念を発行してリンク先とする。規格は年版ではなく規格番号(継続する系列)単位で1概念とし、年版・追補は scopeNote に記録する。
has top concept: JIS規格
has top concept: 対応国際規格
history note: URIホスト wik.jp は発行者から独立した永続識別子サービス。永続性ポリシー: https://wik.jp/.well-known/persistence
preferred label: JIS-ISO/IEC Standard Correspondence @en
preferred namespace prefix: kikaku
preferred namespace uri: https://wik.jp/kikaku/
data dump: dump.ttl
sparql endpoint: sparql.wik.jp