稚内
type: Concept
alternative label: 稚内（北海道旅客鉄道 宗谷線）
broader: g000001
in scheme: scheme
notation: 000001
scope note: 運営会社: 北海道旅客鉄道。路線名: 宗谷線。鉄道区分: 普通鉄道JR（11）。事業者種別: JR在来線（2）。

南稚内
type: Concept
alternative label: 南稚内（北海道旅客鉄道 宗谷線）
broader: g000002
in scheme: scheme
notation: 000002
scope note: 運営会社: 北海道旅客鉄道。路線名: 宗谷線。鉄道区分: 普通鉄道JR（11）。事業者種別: JR在来線（2）。

勇知
type: Concept
alternative label: 勇知（北海道旅客鉄道 宗谷線）
broader: g000004
in scheme: scheme
notation: 000004
scope note: 運営会社: 北海道旅客鉄道。路線名: 宗谷線。鉄道区分: 普通鉄道JR（11）。事業者種別: JR在来線（2）。

兜沼
type: Concept
alternative label: 兜沼（北海道旅客鉄道 宗谷線）
broader: g000005
in scheme: scheme
notation: 000005
scope note: 運営会社: 北海道旅客鉄道。路線名: 宗谷線。鉄道区分: 普通鉄道JR（11）。事業者種別: JR在来線（2）。

豊富
type: Concept
alternative label: 豊富（北海道旅客鉄道 宗谷線）
broader: g000006
in scheme: scheme
notation: 000006
scope note: 運営会社: 北海道旅客鉄道。路線名: 宗谷線。鉄道区分: 普通鉄道JR（11）。事業者種別: JR在来線（2）。

下沼
type: Concept
alternative label: 下沼（北海道旅客鉄道 宗谷線）
broader: g000007
in scheme: scheme
notation: 000007
scope note: 運営会社: 北海道旅客鉄道。路線名: 宗谷線。鉄道区分: 普通鉄道JR（11）。事業者種別: JR在来線（2）。

幌延
type: Concept
alternative label: 幌延（北海道旅客鉄道 宗谷線）
broader: g000008
in scheme: scheme
notation: 000008
scope note: 運営会社: 北海道旅客鉄道。路線名: 宗谷線。鉄道区分: 普通鉄道JR（11）。事業者種別: JR在来線（2）。

糠南
type: Concept
alternative label: 糠南（北海道旅客鉄道 宗谷線）
broader: g000010
in scheme: scheme
notation: 000010
scope note: 運営会社: 北海道旅客鉄道。路線名: 宗谷線。鉄道区分: 普通鉄道JR（11）。事業者種別: JR在来線（2）。

問寒別
type: Concept
alternative label: 問寒別（北海道旅客鉄道 宗谷線）
broader: g000011
in scheme: scheme
notation: 000011
scope note: 運営会社: 北海道旅客鉄道。路線名: 宗谷線。鉄道区分: 普通鉄道JR（11）。事業者種別: JR在来線（2）。

天塩中川
type: Concept
alternative label: 天塩中川（北海道旅客鉄道 宗谷線）
broader: g000013
in scheme: scheme
notation: 000013
scope note: 運営会社: 北海道旅客鉄道。路線名: 宗谷線。鉄道区分: 普通鉄道JR（11）。事業者種別: JR在来線（2）。

佐久
type: Concept
alternative label: 佐久（北海道旅客鉄道 宗谷線）
broader: g000014
in scheme: scheme
notation: 000014
scope note: 運営会社: 北海道旅客鉄道。路線名: 宗谷線。鉄道区分: 普通鉄道JR（11）。事業者種別: JR在来線（2）。

筬島
type: Concept
alternative label: 筬島（北海道旅客鉄道 宗谷線）
broader: g000015
in scheme: scheme
notation: 000015
scope note: 運営会社: 北海道旅客鉄道。路線名: 宗谷線。鉄道区分: 普通鉄道JR（11）。事業者種別: JR在来線（2）。

音威子府
type: Concept
alternative label: 音威子府（北海道旅客鉄道 宗谷線）
broader: g000016
in scheme: scheme
notation: 000016
scope note: 運営会社: 北海道旅客鉄道。路線名: 宗谷線。鉄道区分: 普通鉄道JR（11）。事業者種別: JR在来線（2）。

咲来
type: Concept
alternative label: 咲来（北海道旅客鉄道 宗谷線）
broader: g000017
in scheme: scheme
notation: 000017
scope note: 運営会社: 北海道旅客鉄道。路線名: 宗谷線。鉄道区分: 普通鉄道JR（11）。事業者種別: JR在来線（2）。

天塩川温泉
type: Concept
alternative label: 天塩川温泉（北海道旅客鉄道 宗谷線）
broader: g000018
in scheme: scheme
notation: 000018
scope note: 運営会社: 北海道旅客鉄道。路線名: 宗谷線。鉄道区分: 普通鉄道JR（11）。事業者種別: JR在来線（2）。

美深
type: Concept
alternative label: 美深（北海道旅客鉄道 宗谷線）
broader: g000021
in scheme: scheme
notation: 000021
scope note: 運営会社: 北海道旅客鉄道。路線名: 宗谷線。鉄道区分: 普通鉄道JR（11）。事業者種別: JR在来線（2）。

智北
type: Concept
alternative label: 智北（北海道旅客鉄道 宗谷線）
broader: g000022
in scheme: scheme
notation: 000022
scope note: 運営会社: 北海道旅客鉄道。路線名: 宗谷線。鉄道区分: 普通鉄道JR（11）。事業者種別: JR在来線（2）。

智恵文
type: Concept
alternative label: 智恵文（北海道旅客鉄道 宗谷線）
broader: g000023
in scheme: scheme
notation: 000023
scope note: 運営会社: 北海道旅客鉄道。路線名: 宗谷線。鉄道区分: 普通鉄道JR（11）。事業者種別: JR在来線（2）。

日進
type: Concept
alternative label: 日進（北海道旅客鉄道 宗谷線）
broader: g000024
in scheme: scheme
notation: 000024
scope note: 運営会社: 北海道旅客鉄道。路線名: 宗谷線。鉄道区分: 普通鉄道JR（11）。事業者種別: JR在来線（2）。

名寄
type: Concept
alternative label: 名寄（北海道旅客鉄道 宗谷線）
broader: g000025
in scheme: scheme
notation: 000025
scope note: 運営会社: 北海道旅客鉄道。路線名: 宗谷線。鉄道区分: 普通鉄道JR（11）。事業者種別: JR在来線（2）。

名寄高校
type: Concept
alternative label: 名寄高校（北海道旅客鉄道 宗谷線）
broader: g000026
in scheme: scheme
notation: 000026
scope note: 運営会社: 北海道旅客鉄道。路線名: 宗谷線。鉄道区分: 普通鉄道JR（11）。事業者種別: JR在来線（2）。

風連
type: Concept
alternative label: 風連（北海道旅客鉄道 宗谷線）
broader: g000027
in scheme: scheme
notation: 000027
scope note: 運営会社: 北海道旅客鉄道。路線名: 宗谷線。鉄道区分: 普通鉄道JR（11）。事業者種別: JR在来線（2）。

瑞穂
type: Concept
alternative label: 瑞穂（北海道旅客鉄道 宗谷線）
broader: g000028
in scheme: scheme
notation: 000028
scope note: 運営会社: 北海道旅客鉄道。路線名: 宗谷線。鉄道区分: 普通鉄道JR（11）。事業者種別: JR在来線（2）。

多寄
type: Concept
alternative label: 多寄（北海道旅客鉄道 宗谷線）
broader: g000029
in scheme: scheme
notation: 000029
scope note: 運営会社: 北海道旅客鉄道。路線名: 宗谷線。鉄道区分: 普通鉄道JR（11）。事業者種別: JR在来線（2）。

士別
type: Concept
alternative label: 士別（北海道旅客鉄道 宗谷線）
broader: g000030
in scheme: scheme
notation: 000030
scope note: 運営会社: 北海道旅客鉄道。路線名: 宗谷線。鉄道区分: 普通鉄道JR（11）。事業者種別: JR在来線（2）。

剣淵
type: Concept
alternative label: 剣淵（北海道旅客鉄道 宗谷線）
broader: g000031
in scheme: scheme
notation: 000031
scope note: 運営会社: 北海道旅客鉄道。路線名: 宗谷線。鉄道区分: 普通鉄道JR（11）。事業者種別: JR在来線（2）。

遠軽
type: Concept
alternative label: 遠軽（北海道旅客鉄道 石北線）
broader: g000032
in scheme: scheme
notation: 000032
scope note: 運営会社: 北海道旅客鉄道。路線名: 石北線。鉄道区分: 普通鉄道JR（11）。事業者種別: JR在来線（2）。

和寒
type: Concept
alternative label: 和寒（北海道旅客鉄道 宗谷線）
broader: g000033
in scheme: scheme
notation: 000033
scope note: 運営会社: 北海道旅客鉄道。路線名: 宗谷線。鉄道区分: 普通鉄道JR（11）。事業者種別: JR在来線（2）。

網走
type: Concept
alternative label: 網走（北海道旅客鉄道 釧網線）
broader: g000034
in scheme: scheme
notation: 000034
scope note: 運営会社: 北海道旅客鉄道。路線名: 釧網線。鉄道区分: 普通鉄道JR（11）。事業者種別: JR在来線（2）。

網走
type: Concept
alternative label: 網走（北海道旅客鉄道 石北線）
broader: g000034
in scheme: scheme
notation: 000035
scope note: 運営会社: 北海道旅客鉄道。路線名: 石北線。鉄道区分: 普通鉄道JR（11）。事業者種別: JR在来線（2）。

桂台
type: Concept
alternative label: 桂台（北海道旅客鉄道 釧網線）
broader: g000036
in scheme: scheme
notation: 000036
scope note: 運営会社: 北海道旅客鉄道。路線名: 釧網線。鉄道区分: 普通鉄道JR（11）。事業者種別: JR在来線（2）。

瀬戸瀬
type: Concept
alternative label: 瀬戸瀬（北海道旅客鉄道 石北線）
broader: g000037
in scheme: scheme
notation: 000037
scope note: 運営会社: 北海道旅客鉄道。路線名: 石北線。鉄道区分: 普通鉄道JR（11）。事業者種別: JR在来線（2）。

丸瀬布
type: Concept
alternative label: 丸瀬布（北海道旅客鉄道 石北線）
broader: g000038
in scheme: scheme
notation: 000038
scope note: 運営会社: 北海道旅客鉄道。路線名: 石北線。鉄道区分: 普通鉄道JR（11）。事業者種別: JR在来線（2）。

安国
type: Concept
alternative label: 安国（北海道旅客鉄道 石北線）
broader: g000039
in scheme: scheme
notation: 000039
scope note: 運営会社: 北海道旅客鉄道。路線名: 石北線。鉄道区分: 普通鉄道JR（11）。事業者種別: JR在来線（2）。

鱒浦
type: Concept
alternative label: 鱒浦（北海道旅客鉄道 釧網線）
broader: g000040
in scheme: scheme
notation: 000040
scope note: 運営会社: 北海道旅客鉄道。路線名: 釧網線。鉄道区分: 普通鉄道JR（11）。事業者種別: JR在来線（2）。

藻琴
type: Concept
alternative label: 藻琴（北海道旅客鉄道 釧網線）
broader: g000041
in scheme: scheme
notation: 000041
scope note: 運営会社: 北海道旅客鉄道。路線名: 釧網線。鉄道区分: 普通鉄道JR（11）。事業者種別: JR在来線（2）。

塩狩
type: Concept
alternative label: 塩狩（北海道旅客鉄道 宗谷線）
broader: g000042
in scheme: scheme
notation: 000042
scope note: 運営会社: 北海道旅客鉄道。路線名: 宗谷線。鉄道区分: 普通鉄道JR（11）。事業者種別: JR在来線（2）。

呼人
type: Concept
alternative label: 呼人（北海道旅客鉄道 石北線）
broader: g000043
in scheme: scheme
notation: 000043
scope note: 運営会社: 北海道旅客鉄道。路線名: 石北線。鉄道区分: 普通鉄道JR（11）。事業者種別: JR在来線（2）。

北浜
type: Concept
alternative label: 北浜（北海道旅客鉄道 釧網線）
broader: g000044
in scheme: scheme
notation: 000044
scope note: 運営会社: 北海道旅客鉄道。路線名: 釧網線。鉄道区分: 普通鉄道JR（11）。事業者種別: JR在来線（2）。

原生花園
type: Concept
alternative label: 原生花園（北海道旅客鉄道 釧網線）
broader: g000046
in scheme: scheme
notation: 000046
scope note: 運営会社: 北海道旅客鉄道。路線名: 釧網線。鉄道区分: 普通鉄道JR（11）。事業者種別: JR在来線（2）。

浜小清水
type: Concept
alternative label: 浜小清水（北海道旅客鉄道 釧網線）
broader: g000047
in scheme: scheme
notation: 000047
scope note: 運営会社: 北海道旅客鉄道。路線名: 釧網線。鉄道区分: 普通鉄道JR（11）。事業者種別: JR在来線（2）。

蘭留
type: Concept
alternative label: 蘭留（北海道旅客鉄道 宗谷線）
broader: g000048
in scheme: scheme
notation: 000048
scope note: 運営会社: 北海道旅客鉄道。路線名: 宗谷線。鉄道区分: 普通鉄道JR（11）。事業者種別: JR在来線（2）。

生田原
type: Concept
alternative label: 生田原（北海道旅客鉄道 石北線）
broader: g000049
in scheme: scheme
notation: 000049
scope note: 運営会社: 北海道旅客鉄道。路線名: 石北線。鉄道区分: 普通鉄道JR（11）。事業者種別: JR在来線（2）。

止別
type: Concept
alternative label: 止別（北海道旅客鉄道 釧網線）
broader: g000050
in scheme: scheme
notation: 000050
scope note: 運営会社: 北海道旅客鉄道。路線名: 釧網線。鉄道区分: 普通鉄道JR（11）。事業者種別: JR在来線（2）。

女満別
type: Concept
alternative label: 女満別（北海道旅客鉄道 石北線）
broader: g000051
in scheme: scheme
notation: 000051
scope note: 運営会社: 北海道旅客鉄道。路線名: 石北線。鉄道区分: 普通鉄道JR（11）。事業者種別: JR在来線（2）。

知床斜里
type: Concept
alternative label: 知床斜里（北海道旅客鉄道 釧網線）
broader: g000053
in scheme: scheme
notation: 000053
scope note: 運営会社: 北海道旅客鉄道。路線名: 釧網線。鉄道区分: 普通鉄道JR（11）。事業者種別: JR在来線（2）。

愛別
type: Concept
alternative label: 愛別（北海道旅客鉄道 石北線）
broader: g000054
in scheme: scheme
notation: 000054
scope note: 運営会社: 北海道旅客鉄道。路線名: 石北線。鉄道区分: 普通鉄道JR（11）。事業者種別: JR在来線（2）。

中愛別
type: Concept
alternative label: 中愛別（北海道旅客鉄道 石北線）
broader: g000055
in scheme: scheme
notation: 000055
scope note: 運営会社: 北海道旅客鉄道。路線名: 石北線。鉄道区分: 普通鉄道JR（11）。事業者種別: JR在来線（2）。

白滝
type: Concept
alternative label: 白滝（北海道旅客鉄道 石北線）
broader: g000057
in scheme: scheme
notation: 000057
scope note: 運営会社: 北海道旅客鉄道。路線名: 石北線。鉄道区分: 普通鉄道JR（11）。事業者種別: JR在来線（2）。

緋牛内
type: Concept
alternative label: 緋牛内（北海道旅客鉄道 石北線）
broader: g000058
in scheme: scheme
notation: 000058
scope note: 運営会社: 北海道旅客鉄道。路線名: 石北線。鉄道区分: 普通鉄道JR（11）。事業者種別: JR在来線（2）。

西女満別
type: Concept
alternative label: 西女満別（北海道旅客鉄道 石北線）
broader: g000059
in scheme: scheme
notation: 000059
scope note: 運営会社: 北海道旅客鉄道。路線名: 石北線。鉄道区分: 普通鉄道JR（11）。事業者種別: JR在来線（2）。

伊香牛
type: Concept
alternative label: 伊香牛（北海道旅客鉄道 石北線）
broader: g000060
in scheme: scheme
notation: 000060
scope note: 運営会社: 北海道旅客鉄道。路線名: 石北線。鉄道区分: 普通鉄道JR（11）。事業者種別: JR在来線（2）。

比布
type: Concept
alternative label: 比布（北海道旅客鉄道 宗谷線）
broader: g000061
in scheme: scheme
notation: 000061
scope note: 運営会社: 北海道旅客鉄道。路線名: 宗谷線。鉄道区分: 普通鉄道JR（11）。事業者種別: JR在来線（2）。

中斜里
type: Concept
alternative label: 中斜里（北海道旅客鉄道 釧網線）
broader: g000062
in scheme: scheme
notation: 000062
scope note: 運営会社: 北海道旅客鉄道。路線名: 釧網線。鉄道区分: 普通鉄道JR（11）。事業者種別: JR在来線（2）。

安足間
type: Concept
alternative label: 安足間（北海道旅客鉄道 石北線）
broader: g000065
in scheme: scheme
notation: 000065
scope note: 運営会社: 北海道旅客鉄道。路線名: 石北線。鉄道区分: 普通鉄道JR（11）。事業者種別: JR在来線（2）。

端野
type: Concept
alternative label: 端野（北海道旅客鉄道 石北線）
broader: g000066
in scheme: scheme
notation: 000066
scope note: 運営会社: 北海道旅客鉄道。路線名: 石北線。鉄道区分: 普通鉄道JR（11）。事業者種別: JR在来線（2）。

上川
type: Concept
alternative label: 上川（北海道旅客鉄道 石北線）
broader: g000069
in scheme: scheme
notation: 000069
scope note: 運営会社: 北海道旅客鉄道。路線名: 石北線。鉄道区分: 普通鉄道JR（11）。事業者種別: JR在来線（2）。

愛し野
type: Concept
alternative label: 愛し野（北海道旅客鉄道 石北線）
broader: g000070
in scheme: scheme
notation: 000070
scope note: 運営会社: 北海道旅客鉄道。路線名: 石北線。鉄道区分: 普通鉄道JR（11）。事業者種別: JR在来線（2）。

清里町
type: Concept
alternative label: 清里町（北海道旅客鉄道 釧網線）
broader: g000071
in scheme: scheme
notation: 000071
scope note: 運営会社: 北海道旅客鉄道。路線名: 釧網線。鉄道区分: 普通鉄道JR（11）。事業者種別: JR在来線（2）。

美幌
type: Concept
alternative label: 美幌（北海道旅客鉄道 石北線）
broader: g000072
in scheme: scheme
notation: 000072
scope note: 運営会社: 北海道旅客鉄道。路線名: 石北線。鉄道区分: 普通鉄道JR（11）。事業者種別: JR在来線（2）。

北永山
type: Concept
alternative label: 北永山（北海道旅客鉄道 宗谷線）
broader: g000074
in scheme: scheme
notation: 000074
scope note: 運営会社: 北海道旅客鉄道。路線名: 宗谷線。鉄道区分: 普通鉄道JR（11）。事業者種別: JR在来線（2）。

当麻
type: Concept
alternative label: 当麻（北海道旅客鉄道 石北線）
broader: g000075
in scheme: scheme
notation: 000075
scope note: 運営会社: 北海道旅客鉄道。路線名: 石北線。鉄道区分: 普通鉄道JR（11）。事業者種別: JR在来線（2）。

柏陽
type: Concept
alternative label: 柏陽（北海道旅客鉄道 石北線）
broader: g000076
in scheme: scheme
notation: 000076
scope note: 運営会社: 北海道旅客鉄道。路線名: 石北線。鉄道区分: 普通鉄道JR（11）。事業者種別: JR在来線（2）。

永山
type: Concept
alternative label: 永山（北海道旅客鉄道 宗谷線）
broader: g000077
in scheme: scheme
notation: 000077
scope note: 運営会社: 北海道旅客鉄道。路線名: 宗谷線。鉄道区分: 普通鉄道JR（11）。事業者種別: JR在来線（2）。

石狩沼田
type: Concept
alternative label: 石狩沼田（北海道旅客鉄道 留萌線）
broader: g000078
in scheme: scheme
notation: 000078
scope note: 運営会社: 北海道旅客鉄道。路線名: 留萌線。鉄道区分: 普通鉄道JR（11）。事業者種別: JR在来線（2）。

東相内
type: Concept
alternative label: 東相内（北海道旅客鉄道 石北線）
broader: g000079
in scheme: scheme
notation: 000079
scope note: 運営会社: 北海道旅客鉄道。路線名: 石北線。鉄道区分: 普通鉄道JR（11）。事業者種別: JR在来線（2）。

北見
type: Concept
alternative label: 北見（北海道旅客鉄道 石北線）
broader: g000080
in scheme: scheme
notation: 000080
scope note: 運営会社: 北海道旅客鉄道。路線名: 石北線。鉄道区分: 普通鉄道JR（11）。事業者種別: JR在来線（2）。

西北見
type: Concept
alternative label: 西北見（北海道旅客鉄道 石北線）
broader: g000081
in scheme: scheme
notation: 000081
scope note: 運営会社: 北海道旅客鉄道。路線名: 石北線。鉄道区分: 普通鉄道JR（11）。事業者種別: JR在来線（2）。

桜岡
type: Concept
alternative label: 桜岡（北海道旅客鉄道 石北線）
broader: g000082
in scheme: scheme
notation: 000082
scope note: 運営会社: 北海道旅客鉄道。路線名: 石北線。鉄道区分: 普通鉄道JR（11）。事業者種別: JR在来線（2）。

相内
type: Concept
alternative label: 相内（北海道旅客鉄道 石北線）
broader: g000083
in scheme: scheme
notation: 000083
scope note: 運営会社: 北海道旅客鉄道。路線名: 石北線。鉄道区分: 普通鉄道JR（11）。事業者種別: JR在来線（2）。

北秩父別
type: Concept
alternative label: 北秩父別（北海道旅客鉄道 留萌線）
broader: g000084
in scheme: scheme
notation: 000084
scope note: 運営会社: 北海道旅客鉄道。路線名: 留萌線。鉄道区分: 普通鉄道JR（11）。事業者種別: JR在来線（2）。

近文
type: Concept
alternative label: 近文（北海道旅客鉄道 函館線）
broader: g000085
in scheme: scheme
notation: 000085
scope note: 運営会社: 北海道旅客鉄道。路線名: 函館線。鉄道区分: 普通鉄道JR（11）。事業者種別: JR在来線（2）。

札弦
type: Concept
alternative label: 札弦（北海道旅客鉄道 釧網線）
broader: g000086
in scheme: scheme
notation: 000086
scope note: 運営会社: 北海道旅客鉄道。路線名: 釧網線。鉄道区分: 普通鉄道JR（11）。事業者種別: JR在来線（2）。

留辺蘂
type: Concept
alternative label: 留辺蘂（北海道旅客鉄道 石北線）
broader: g000087
in scheme: scheme
notation: 000087
scope note: 運営会社: 北海道旅客鉄道。路線名: 石北線。鉄道区分: 普通鉄道JR（11）。事業者種別: JR在来線（2）。

西留辺蘂
type: Concept
alternative label: 西留辺蘂（北海道旅客鉄道 石北線）
broader: g000088
in scheme: scheme
notation: 000088
scope note: 運営会社: 北海道旅客鉄道。路線名: 石北線。鉄道区分: 普通鉄道JR（11）。事業者種別: JR在来線（2）。

南永山
type: Concept
alternative label: 南永山（北海道旅客鉄道 石北線）
broader: g000089
in scheme: scheme
notation: 000089
scope note: 運営会社: 北海道旅客鉄道。路線名: 石北線。鉄道区分: 普通鉄道JR（11）。事業者種別: JR在来線（2）。

新旭川
type: Concept
alternative label: 新旭川（北海道旅客鉄道 宗谷線）
broader: g000090
in scheme: scheme
notation: 000090
scope note: 運営会社: 北海道旅客鉄道。路線名: 宗谷線。鉄道区分: 普通鉄道JR（11）。事業者種別: JR在来線（2）。

新旭川
type: Concept
alternative label: 新旭川（北海道旅客鉄道 石北線）
broader: g000090
in scheme: scheme
notation: 000091
scope note: 運営会社: 北海道旅客鉄道。路線名: 石北線。鉄道区分: 普通鉄道JR（11）。事業者種別: JR在来線（2）。

東旭川
type: Concept
alternative label: 東旭川（北海道旅客鉄道 石北線）
broader: g000092
in scheme: scheme
notation: 000092
scope note: 運営会社: 北海道旅客鉄道。路線名: 石北線。鉄道区分: 普通鉄道JR（11）。事業者種別: JR在来線（2）。

秩父別
type: Concept
alternative label: 秩父別（北海道旅客鉄道 留萌線）
broader: g000093
in scheme: scheme
notation: 000093
scope note: 運営会社: 北海道旅客鉄道。路線名: 留萌線。鉄道区分: 普通鉄道JR（11）。事業者種別: JR在来線（2）。

旭川四条
type: Concept
alternative label: 旭川四条（北海道旅客鉄道 宗谷線）
broader: g000094
in scheme: scheme
notation: 000094
scope note: 運営会社: 北海道旅客鉄道。路線名: 宗谷線。鉄道区分: 普通鉄道JR（11）。事業者種別: JR在来線（2）。

旭川
type: Concept
alternative label: 旭川（北海道旅客鉄道 宗谷線）
broader: g000095
in scheme: scheme
notation: 000095
scope note: 運営会社: 北海道旅客鉄道。路線名: 宗谷線。鉄道区分: 普通鉄道JR（11）。事業者種別: JR在来線（2）。

旭川
type: Concept
alternative label: 旭川（北海道旅客鉄道 函館線）
broader: g000095
in scheme: scheme
notation: 000096
scope note: 運営会社: 北海道旅客鉄道。路線名: 函館線。鉄道区分: 普通鉄道JR（11）。事業者種別: JR在来線（2）。

旭川
type: Concept
alternative label: 旭川（北海道旅客鉄道 富良野線）
broader: g000095
in scheme: scheme
notation: 000097
scope note: 運営会社: 北海道旅客鉄道。路線名: 富良野線。鉄道区分: 普通鉄道JR（11）。事業者種別: JR在来線（2）。

神楽岡
type: Concept
alternative label: 神楽岡（北海道旅客鉄道 富良野線）
broader: g000098
in scheme: scheme
notation: 000098
scope note: 運営会社: 北海道旅客鉄道。路線名: 富良野線。鉄道区分: 普通鉄道JR（11）。事業者種別: JR在来線（2）。

北一已
type: Concept
alternative label: 北一已（北海道旅客鉄道 留萌線）
broader: g000099
in scheme: scheme
notation: 000099
scope note: 運営会社: 北海道旅客鉄道。路線名: 留萌線。鉄道区分: 普通鉄道JR（11）。事業者種別: JR在来線（2）。

納内
type: Concept
alternative label: 納内（北海道旅客鉄道 函館線）
broader: g000100
in scheme: scheme
notation: 000100
scope note: 運営会社: 北海道旅客鉄道。路線名: 函館線。鉄道区分: 普通鉄道JR（11）。事業者種別: JR在来線（2）。

緑が丘
type: Concept
alternative label: 緑が丘（北海道旅客鉄道 富良野線）
broader: g000101
in scheme: scheme
notation: 000101
scope note: 運営会社: 北海道旅客鉄道。路線名: 富良野線。鉄道区分: 普通鉄道JR（11）。事業者種別: JR在来線（2）。

深川
type: Concept
alternative label: 深川（北海道旅客鉄道 函館線）
broader: g000102
in scheme: scheme
notation: 000102
scope note: 運営会社: 北海道旅客鉄道。路線名: 函館線。鉄道区分: 普通鉄道JR（11）。事業者種別: JR在来線（2）。

深川
type: Concept
alternative label: 深川（北海道旅客鉄道 留萌線）
broader: g000102
in scheme: scheme
notation: 000103
scope note: 運営会社: 北海道旅客鉄道。路線名: 留萌線。鉄道区分: 普通鉄道JR（11）。事業者種別: JR在来線（2）。

西御料
type: Concept
alternative label: 西御料（北海道旅客鉄道 富良野線）
broader: g000104
in scheme: scheme
notation: 000104
scope note: 運営会社: 北海道旅客鉄道。路線名: 富良野線。鉄道区分: 普通鉄道JR（11）。事業者種別: JR在来線（2）。

緑
type: Concept
alternative label: 緑（北海道旅客鉄道 釧網線）
broader: g000105
in scheme: scheme
notation: 000105
scope note: 運営会社: 北海道旅客鉄道。路線名: 釧網線。鉄道区分: 普通鉄道JR（11）。事業者種別: JR在来線（2）。

西瑞穂
type: Concept
alternative label: 西瑞穂（北海道旅客鉄道 富良野線）
broader: g000106
in scheme: scheme
notation: 000106
scope note: 運営会社: 北海道旅客鉄道。路線名: 富良野線。鉄道区分: 普通鉄道JR（11）。事業者種別: JR在来線（2）。

妹背牛
type: Concept
alternative label: 妹背牛（北海道旅客鉄道 函館線）
broader: g000107
in scheme: scheme
notation: 000107
scope note: 運営会社: 北海道旅客鉄道。路線名: 函館線。鉄道区分: 普通鉄道JR（11）。事業者種別: JR在来線（2）。

西神楽
type: Concept
alternative label: 西神楽（北海道旅客鉄道 富良野線）
broader: g000108
in scheme: scheme
notation: 000108
scope note: 運営会社: 北海道旅客鉄道。路線名: 富良野線。鉄道区分: 普通鉄道JR（11）。事業者種別: JR在来線（2）。

西聖和
type: Concept
alternative label: 西聖和（北海道旅客鉄道 富良野線）
broader: g000109
in scheme: scheme
notation: 000109
scope note: 運営会社: 北海道旅客鉄道。路線名: 富良野線。鉄道区分: 普通鉄道JR（11）。事業者種別: JR在来線（2）。

千代ヶ岡
type: Concept
alternative label: 千代ヶ岡（北海道旅客鉄道 富良野線）
broader: g000110
in scheme: scheme
notation: 000110
scope note: 運営会社: 北海道旅客鉄道。路線名: 富良野線。鉄道区分: 普通鉄道JR（11）。事業者種別: JR在来線（2）。

江部乙
type: Concept
alternative label: 江部乙（北海道旅客鉄道 函館線）
broader: g000111
in scheme: scheme
notation: 000111
scope note: 運営会社: 北海道旅客鉄道。路線名: 函館線。鉄道区分: 普通鉄道JR（11）。事業者種別: JR在来線（2）。

北美瑛
type: Concept
alternative label: 北美瑛（北海道旅客鉄道 富良野線）
broader: g000112
in scheme: scheme
notation: 000112
scope note: 運営会社: 北海道旅客鉄道。路線名: 富良野線。鉄道区分: 普通鉄道JR（11）。事業者種別: JR在来線（2）。

川湯温泉
type: Concept
alternative label: 川湯温泉（北海道旅客鉄道 釧網線）
broader: g000113
in scheme: scheme
notation: 000113
scope note: 運営会社: 北海道旅客鉄道。路線名: 釧網線。鉄道区分: 普通鉄道JR（11）。事業者種別: JR在来線（2）。

美瑛
type: Concept
alternative label: 美瑛（北海道旅客鉄道 富良野線）
broader: g000114
in scheme: scheme
notation: 000114
scope note: 運営会社: 北海道旅客鉄道。路線名: 富良野線。鉄道区分: 普通鉄道JR（11）。事業者種別: JR在来線（2）。

美留和
type: Concept
alternative label: 美留和（北海道旅客鉄道 釧網線）
broader: g000116
in scheme: scheme
notation: 000116
scope note: 運営会社: 北海道旅客鉄道。路線名: 釧網線。鉄道区分: 普通鉄道JR（11）。事業者種別: JR在来線（2）。

滝川
type: Concept
alternative label: 滝川（北海道旅客鉄道 根室線）
broader: g000117
in scheme: scheme
notation: 000117
scope note: 運営会社: 北海道旅客鉄道。路線名: 根室線。鉄道区分: 普通鉄道JR（11）。事業者種別: JR在来線（2）。

滝川
type: Concept
alternative label: 滝川（北海道旅客鉄道 函館線）
broader: g000117
in scheme: scheme
notation: 000118
scope note: 運営会社: 北海道旅客鉄道。路線名: 函館線。鉄道区分: 普通鉄道JR（11）。事業者種別: JR在来線（2）。

赤平
type: Concept
alternative label: 赤平（北海道旅客鉄道 根室線）
broader: g000119
in scheme: scheme
notation: 000119
scope note: 運営会社: 北海道旅客鉄道。路線名: 根室線。鉄道区分: 普通鉄道JR（11）。事業者種別: JR在来線（2）。

平岸
type: Concept
alternative label: 平岸（北海道旅客鉄道 根室線）
broader: g000120
in scheme: scheme
notation: 000120
scope note: 運営会社: 北海道旅客鉄道。路線名: 根室線。鉄道区分: 普通鉄道JR（11）。事業者種別: JR在来線（2）。

美馬牛
type: Concept
alternative label: 美馬牛（北海道旅客鉄道 富良野線）
broader: g000121
in scheme: scheme
notation: 000121
scope note: 運営会社: 北海道旅客鉄道。路線名: 富良野線。鉄道区分: 普通鉄道JR（11）。事業者種別: JR在来線（2）。

茂尻
type: Concept
alternative label: 茂尻（北海道旅客鉄道 根室線）
broader: g000122
in scheme: scheme
notation: 000122
scope note: 運営会社: 北海道旅客鉄道。路線名: 根室線。鉄道区分: 普通鉄道JR（11）。事業者種別: JR在来線（2）。

芦別
type: Concept
alternative label: 芦別（北海道旅客鉄道 根室線）
broader: g000123
in scheme: scheme
notation: 000123
scope note: 運営会社: 北海道旅客鉄道。路線名: 根室線。鉄道区分: 普通鉄道JR（11）。事業者種別: JR在来線（2）。

砂川
type: Concept
alternative label: 砂川（北海道旅客鉄道 函館線）
broader: g000124
in scheme: scheme
notation: 000124
scope note: 運営会社: 北海道旅客鉄道。路線名: 函館線。鉄道区分: 普通鉄道JR（11）。事業者種別: JR在来線（2）。

上芦別
type: Concept
alternative label: 上芦別（北海道旅客鉄道 根室線）
broader: g000125
in scheme: scheme
notation: 000125
scope note: 運営会社: 北海道旅客鉄道。路線名: 根室線。鉄道区分: 普通鉄道JR（11）。事業者種別: JR在来線（2）。

摩周
type: Concept
alternative label: 摩周（北海道旅客鉄道 釧網線）
broader: g000126
in scheme: scheme
notation: 000126
scope note: 運営会社: 北海道旅客鉄道。路線名: 釧網線。鉄道区分: 普通鉄道JR（11）。事業者種別: JR在来線（2）。

野花南
type: Concept
alternative label: 野花南（北海道旅客鉄道 根室線）
broader: g000127
in scheme: scheme
notation: 000127
scope note: 運営会社: 北海道旅客鉄道。路線名: 根室線。鉄道区分: 普通鉄道JR（11）。事業者種別: JR在来線（2）。

豊沼
type: Concept
alternative label: 豊沼（北海道旅客鉄道 函館線）
broader: g000128
in scheme: scheme
notation: 000128
scope note: 運営会社: 北海道旅客鉄道。路線名: 函館線。鉄道区分: 普通鉄道JR（11）。事業者種別: JR在来線（2）。

上富良野
type: Concept
alternative label: 上富良野（北海道旅客鉄道 富良野線）
broader: g000129
in scheme: scheme
notation: 000129
scope note: 運営会社: 北海道旅客鉄道。路線名: 富良野線。鉄道区分: 普通鉄道JR（11）。事業者種別: JR在来線（2）。

西中
type: Concept
alternative label: 西中（北海道旅客鉄道 富良野線）
broader: g000130
in scheme: scheme
notation: 000130
scope note: 運営会社: 北海道旅客鉄道。路線名: 富良野線。鉄道区分: 普通鉄道JR（11）。事業者種別: JR在来線（2）。

奈井江
type: Concept
alternative label: 奈井江（北海道旅客鉄道 函館線）
broader: g000131
in scheme: scheme
notation: 000131
scope note: 運営会社: 北海道旅客鉄道。路線名: 函館線。鉄道区分: 普通鉄道JR（11）。事業者種別: JR在来線（2）。

中富良野
type: Concept
alternative label: 中富良野（北海道旅客鉄道 富良野線）
broader: g000132
in scheme: scheme
notation: 000132
scope note: 運営会社: 北海道旅客鉄道。路線名: 富良野線。鉄道区分: 普通鉄道JR（11）。事業者種別: JR在来線（2）。

鹿討
type: Concept
alternative label: 鹿討（北海道旅客鉄道 富良野線）
broader: g000133
in scheme: scheme
notation: 000133
scope note: 運営会社: 北海道旅客鉄道。路線名: 富良野線。鉄道区分: 普通鉄道JR（11）。事業者種別: JR在来線（2）。

磯分内
type: Concept
alternative label: 磯分内（北海道旅客鉄道 釧網線）
broader: g000134
in scheme: scheme
notation: 000134
scope note: 運営会社: 北海道旅客鉄道。路線名: 釧網線。鉄道区分: 普通鉄道JR（11）。事業者種別: JR在来線（2）。

茶志内
type: Concept
alternative label: 茶志内（北海道旅客鉄道 函館線）
broader: g000135
in scheme: scheme
notation: 000135
scope note: 運営会社: 北海道旅客鉄道。路線名: 函館線。鉄道区分: 普通鉄道JR（11）。事業者種別: JR在来線（2）。

学田
type: Concept
alternative label: 学田（北海道旅客鉄道 富良野線）
broader: g000136
in scheme: scheme
notation: 000136
scope note: 運営会社: 北海道旅客鉄道。路線名: 富良野線。鉄道区分: 普通鉄道JR（11）。事業者種別: JR在来線（2）。

富良野
type: Concept
alternative label: 富良野（北海道旅客鉄道 根室線）
broader: g000137
in scheme: scheme
notation: 000137
scope note: 運営会社: 北海道旅客鉄道。路線名: 根室線。鉄道区分: 普通鉄道JR（11）。事業者種別: JR在来線（2）。

富良野
type: Concept
alternative label: 富良野（北海道旅客鉄道 富良野線）
broader: g000137
in scheme: scheme
notation: 000138
scope note: 運営会社: 北海道旅客鉄道。路線名: 富良野線。鉄道区分: 普通鉄道JR（11）。事業者種別: JR在来線（2）。

美唄
type: Concept
alternative label: 美唄（北海道旅客鉄道 函館線）
broader: g000139
in scheme: scheme
notation: 000139
scope note: 運営会社: 北海道旅客鉄道。路線名: 函館線。鉄道区分: 普通鉄道JR（11）。事業者種別: JR在来線（2）。

根室
type: Concept
alternative label: 根室（北海道旅客鉄道 根室線）
broader: g000140
in scheme: scheme
notation: 000140
scope note: 運営会社: 北海道旅客鉄道。路線名: 根室線。鉄道区分: 普通鉄道JR（11）。事業者種別: JR在来線（2）。

標茶
type: Concept
alternative label: 標茶（北海道旅客鉄道 釧網線）
broader: g000142
in scheme: scheme
notation: 000142
scope note: 運営会社: 北海道旅客鉄道。路線名: 釧網線。鉄道区分: 普通鉄道JR（11）。事業者種別: JR在来線（2）。

光珠内
type: Concept
alternative label: 光珠内（北海道旅客鉄道 函館線）
broader: g000143
in scheme: scheme
notation: 000143
scope note: 運営会社: 北海道旅客鉄道。路線名: 函館線。鉄道区分: 普通鉄道JR（11）。事業者種別: JR在来線（2）。

西和田
type: Concept
alternative label: 西和田（北海道旅客鉄道 根室線）
broader: g000145
in scheme: scheme
notation: 000145
scope note: 運営会社: 北海道旅客鉄道。路線名: 根室線。鉄道区分: 普通鉄道JR（11）。事業者種別: JR在来線（2）。

峰延
type: Concept
alternative label: 峰延（北海道旅客鉄道 函館線）
broader: g000146
in scheme: scheme
notation: 000146
scope note: 運営会社: 北海道旅客鉄道。路線名: 函館線。鉄道区分: 普通鉄道JR（11）。事業者種別: JR在来線（2）。

北海道医療大学
type: Concept
alternative label: 北海道医療大学（北海道旅客鉄道 札沼線）
broader: g000148
in scheme: scheme
notation: 000148
scope note: 運営会社: 北海道旅客鉄道。路線名: 札沼線。鉄道区分: 普通鉄道JR（11）。事業者種別: JR在来線（2）。

昆布盛
type: Concept
alternative label: 昆布盛（北海道旅客鉄道 根室線）
broader: g000149
in scheme: scheme
notation: 000149
scope note: 運営会社: 北海道旅客鉄道。路線名: 根室線。鉄道区分: 普通鉄道JR（11）。事業者種別: JR在来線（2）。

厚床
type: Concept
alternative label: 厚床（北海道旅客鉄道 根室線）
broader: g000150
in scheme: scheme
notation: 000150
scope note: 運営会社: 北海道旅客鉄道。路線名: 根室線。鉄道区分: 普通鉄道JR（11）。事業者種別: JR在来線（2）。

当別
type: Concept
alternative label: 当別（北海道旅客鉄道 札沼線）
broader: g000151
in scheme: scheme
notation: 000151
scope note: 運営会社: 北海道旅客鉄道。路線名: 札沼線。鉄道区分: 普通鉄道JR（11）。事業者種別: JR在来線（2）。

別当賀
type: Concept
alternative label: 別当賀（北海道旅客鉄道 根室線）
broader: g000152
in scheme: scheme
notation: 000152
scope note: 運営会社: 北海道旅客鉄道。路線名: 根室線。鉄道区分: 普通鉄道JR（11）。事業者種別: JR在来線（2）。

岩見沢
type: Concept
alternative label: 岩見沢（北海道旅客鉄道 室蘭線）
broader: g000153
in scheme: scheme
notation: 000153
scope note: 運営会社: 北海道旅客鉄道。路線名: 室蘭線。鉄道区分: 普通鉄道JR（11）。事業者種別: JR在来線（2）。

岩見沢
type: Concept
alternative label: 岩見沢（北海道旅客鉄道 函館線）
broader: g000153
in scheme: scheme
notation: 000154
scope note: 運営会社: 北海道旅客鉄道。路線名: 函館線。鉄道区分: 普通鉄道JR（11）。事業者種別: JR在来線（2）。

塩谷
type: Concept
alternative label: 塩谷（北海道旅客鉄道 函館線）
broader: g000155
in scheme: scheme
notation: 000155
scope note: 運営会社: 北海道旅客鉄道。路線名: 函館線。鉄道区分: 普通鉄道JR（11）。事業者種別: JR在来線（2）。

茅沼
type: Concept
alternative label: 茅沼（北海道旅客鉄道 釧網線）
broader: g000156
in scheme: scheme
notation: 000156
scope note: 運営会社: 北海道旅客鉄道。路線名: 釧網線。鉄道区分: 普通鉄道JR（11）。事業者種別: JR在来線（2）。

落石
type: Concept
alternative label: 落石（北海道旅客鉄道 根室線）
broader: g000157
in scheme: scheme
notation: 000157
scope note: 運営会社: 北海道旅客鉄道。路線名: 根室線。鉄道区分: 普通鉄道JR（11）。事業者種別: JR在来線（2）。

小樽
type: Concept
alternative label: 小樽（北海道旅客鉄道 函館線）
broader: g000159
in scheme: scheme
notation: 000159
scope note: 運営会社: 北海道旅客鉄道。路線名: 函館線。鉄道区分: 普通鉄道JR（11）。事業者種別: JR在来線（2）。

蘭島
type: Concept
alternative label: 蘭島（北海道旅客鉄道 函館線）
broader: g000160
in scheme: scheme
notation: 000160
scope note: 運営会社: 北海道旅客鉄道。路線名: 函館線。鉄道区分: 普通鉄道JR（11）。事業者種別: JR在来線（2）。

姉別
type: Concept
alternative label: 姉別（北海道旅客鉄道 根室線）
broader: g000161
in scheme: scheme
notation: 000161
scope note: 運営会社: 北海道旅客鉄道。路線名: 根室線。鉄道区分: 普通鉄道JR（11）。事業者種別: JR在来線（2）。

太美
type: Concept
alternative label: 太美（北海道旅客鉄道 札沼線）
broader: g000162
in scheme: scheme
notation: 000162
scope note: 運営会社: 北海道旅客鉄道。路線名: 札沼線。鉄道区分: 普通鉄道JR（11）。事業者種別: JR在来線（2）。

南小樽
type: Concept
alternative label: 南小樽（北海道旅客鉄道 函館線）
broader: g000163
in scheme: scheme
notation: 000163
scope note: 運営会社: 北海道旅客鉄道。路線名: 函館線。鉄道区分: 普通鉄道JR（11）。事業者種別: JR在来線（2）。

余市
type: Concept
alternative label: 余市（北海道旅客鉄道 函館線）
broader: g000164
in scheme: scheme
notation: 000164
scope note: 運営会社: 北海道旅客鉄道。路線名: 函館線。鉄道区分: 普通鉄道JR（11）。事業者種別: JR在来線（2）。

上幌向
type: Concept
alternative label: 上幌向（北海道旅客鉄道 函館線）
broader: g000165
in scheme: scheme
notation: 000165
scope note: 運営会社: 北海道旅客鉄道。路線名: 函館線。鉄道区分: 普通鉄道JR（11）。事業者種別: JR在来線（2）。

小樽築港
type: Concept
alternative label: 小樽築港（北海道旅客鉄道 函館線）
broader: g000166
in scheme: scheme
notation: 000166
scope note: 運営会社: 北海道旅客鉄道。路線名: 函館線。鉄道区分: 普通鉄道JR（11）。事業者種別: JR在来線（2）。

ロイズタウン
type: Concept
alternative label: ロイズタウン（北海道旅客鉄道 札沼線）
broader: g000167
in scheme: scheme
notation: 000167
scope note: 運営会社: 北海道旅客鉄道。路線名: 札沼線。鉄道区分: 普通鉄道JR（11）。事業者種別: JR在来線（2）。

朝里
type: Concept
alternative label: 朝里（北海道旅客鉄道 函館線）
broader: g000168
in scheme: scheme
notation: 000168
scope note: 運営会社: 北海道旅客鉄道。路線名: 函館線。鉄道区分: 普通鉄道JR（11）。事業者種別: JR在来線（2）。

あいの里公園
type: Concept
alternative label: あいの里公園（北海道旅客鉄道 札沼線）
broader: g000171
in scheme: scheme
notation: 000171
scope note: 運営会社: 北海道旅客鉄道。路線名: 札沼線。鉄道区分: 普通鉄道JR（11）。事業者種別: JR在来線（2）。

志文
type: Concept
alternative label: 志文（北海道旅客鉄道 室蘭線）
broader: g000172
in scheme: scheme
notation: 000172
scope note: 運営会社: 北海道旅客鉄道。路線名: 室蘭線。鉄道区分: 普通鉄道JR（11）。事業者種別: JR在来線（2）。

浜中
type: Concept
alternative label: 浜中（北海道旅客鉄道 根室線）
broader: g000173
in scheme: scheme
notation: 000173
scope note: 運営会社: 北海道旅客鉄道。路線名: 根室線。鉄道区分: 普通鉄道JR（11）。事業者種別: JR在来線（2）。

拓北
type: Concept
alternative label: 拓北（北海道旅客鉄道 札沼線）
broader: g000174
in scheme: scheme
notation: 000174
scope note: 運営会社: 北海道旅客鉄道。路線名: 札沼線。鉄道区分: 普通鉄道JR（11）。事業者種別: JR在来線（2）。

あいの里教育大
type: Concept
alternative label: あいの里教育大（北海道旅客鉄道 札沼線）
broader: g000175
in scheme: scheme
notation: 000175
scope note: 運営会社: 北海道旅客鉄道。路線名: 札沼線。鉄道区分: 普通鉄道JR（11）。事業者種別: JR在来線（2）。

仁木
type: Concept
alternative label: 仁木（北海道旅客鉄道 函館線）
broader: g000176
in scheme: scheme
notation: 000176
scope note: 運営会社: 北海道旅客鉄道。路線名: 函館線。鉄道区分: 普通鉄道JR（11）。事業者種別: JR在来線（2）。

塘路
type: Concept
alternative label: 塘路（北海道旅客鉄道 釧網線）
broader: g000177
in scheme: scheme
notation: 000177
scope note: 運営会社: 北海道旅客鉄道。路線名: 釧網線。鉄道区分: 普通鉄道JR（11）。事業者種別: JR在来線（2）。

幌向
type: Concept
alternative label: 幌向（北海道旅客鉄道 函館線）
broader: g000178
in scheme: scheme
notation: 000178
scope note: 運営会社: 北海道旅客鉄道。路線名: 函館線。鉄道区分: 普通鉄道JR（11）。事業者種別: JR在来線（2）。

篠路
type: Concept
alternative label: 篠路（北海道旅客鉄道 札沼線）
broader: g000179
in scheme: scheme
notation: 000179
scope note: 運営会社: 北海道旅客鉄道。路線名: 札沼線。鉄道区分: 普通鉄道JR（11）。事業者種別: JR在来線（2）。

銭函
type: Concept
alternative label: 銭函（北海道旅客鉄道 函館線）
broader: g000180
in scheme: scheme
notation: 000180
scope note: 運営会社: 北海道旅客鉄道。路線名: 函館線。鉄道区分: 普通鉄道JR（11）。事業者種別: JR在来線（2）。

豊幌
type: Concept
alternative label: 豊幌（北海道旅客鉄道 函館線）
broader: g000181
in scheme: scheme
notation: 000181
scope note: 運営会社: 北海道旅客鉄道。路線名: 函館線。鉄道区分: 普通鉄道JR（11）。事業者種別: JR在来線（2）。

ほしみ
type: Concept
alternative label: ほしみ（北海道旅客鉄道 函館線）
broader: g000183
in scheme: scheme
notation: 000183
scope note: 運営会社: 北海道旅客鉄道。路線名: 函館線。鉄道区分: 普通鉄道JR（11）。事業者種別: JR在来線（2）。

星置
type: Concept
alternative label: 星置（北海道旅客鉄道 函館線）
broader: g000184
in scheme: scheme
notation: 000184
scope note: 運営会社: 北海道旅客鉄道。路線名: 函館線。鉄道区分: 普通鉄道JR（11）。事業者種別: JR在来線（2）。

百合が原
type: Concept
alternative label: 百合が原（北海道旅客鉄道 札沼線）
broader: g000185
in scheme: scheme
notation: 000185
scope note: 運営会社: 北海道旅客鉄道。路線名: 札沼線。鉄道区分: 普通鉄道JR（11）。事業者種別: JR在来線（2）。

茶内
type: Concept
alternative label: 茶内（北海道旅客鉄道 根室線）
broader: g000186
in scheme: scheme
notation: 000186
scope note: 運営会社: 北海道旅客鉄道。路線名: 根室線。鉄道区分: 普通鉄道JR（11）。事業者種別: JR在来線（2）。

稲穂
type: Concept
alternative label: 稲穂（北海道旅客鉄道 函館線）
broader: g000187
in scheme: scheme
notation: 000187
scope note: 運営会社: 北海道旅客鉄道。路線名: 函館線。鉄道区分: 普通鉄道JR（11）。事業者種別: JR在来線（2）。

然別
type: Concept
alternative label: 然別（北海道旅客鉄道 函館線）
broader: g000188
in scheme: scheme
notation: 000188
scope note: 運営会社: 北海道旅客鉄道。路線名: 函館線。鉄道区分: 普通鉄道JR（11）。事業者種別: JR在来線（2）。

太平
type: Concept
alternative label: 太平（北海道旅客鉄道 札沼線）
broader: g000190
in scheme: scheme
notation: 000190
scope note: 運営会社: 北海道旅客鉄道。路線名: 札沼線。鉄道区分: 普通鉄道JR（11）。事業者種別: JR在来線（2）。

栗沢
type: Concept
alternative label: 栗沢（北海道旅客鉄道 室蘭線）
broader: g000191
in scheme: scheme
notation: 000191
scope note: 運営会社: 北海道旅客鉄道。路線名: 室蘭線。鉄道区分: 普通鉄道JR（11）。事業者種別: JR在来線（2）。

手稲
type: Concept
alternative label: 手稲（北海道旅客鉄道 函館線）
broader: g000192
in scheme: scheme
notation: 000192
scope note: 運営会社: 北海道旅客鉄道。路線名: 函館線。鉄道区分: 普通鉄道JR（11）。事業者種別: JR在来線（2）。

新琴似
type: Concept
alternative label: 新琴似（北海道旅客鉄道 札沼線）
broader: g000193
in scheme: scheme
notation: 000193
scope note: 運営会社: 北海道旅客鉄道。路線名: 札沼線。鉄道区分: 普通鉄道JR（11）。事業者種別: JR在来線（2）。

栄町
type: Concept
alternative label: 栄町（札幌市 東豊線）
broader: g000194
in scheme: scheme
notation: 000194
scope note: 運営会社: 札幌市。路線名: 東豊線。鉄道区分: 案内軌条式鉄道（16）。事業者種別: 公営鉄道（3）。

稲積公園
type: Concept
alternative label: 稲積公園（北海道旅客鉄道 函館線）
broader: g000195
in scheme: scheme
notation: 000195
scope note: 運営会社: 北海道旅客鉄道。路線名: 函館線。鉄道区分: 普通鉄道JR（11）。事業者種別: JR在来線（2）。

江別
type: Concept
alternative label: 江別（北海道旅客鉄道 函館線）
broader: g000196
in scheme: scheme
notation: 000196
scope note: 運営会社: 北海道旅客鉄道。路線名: 函館線。鉄道区分: 普通鉄道JR（11）。事業者種別: JR在来線（2）。

麻生
type: Concept
alternative label: 麻生（札幌市 南北線）
broader: g000197
in scheme: scheme
notation: 000197
scope note: 運営会社: 札幌市。路線名: 南北線。鉄道区分: 案内軌条式鉄道（16）。事業者種別: 公営鉄道（3）。

細岡
type: Concept
alternative label: 細岡（北海道旅客鉄道 釧網線）
broader: g000198
in scheme: scheme
notation: 000198
scope note: 運営会社: 北海道旅客鉄道。路線名: 釧網線。鉄道区分: 普通鉄道JR（11）。事業者種別: JR在来線（2）。

新道東
type: Concept
alternative label: 新道東（札幌市 東豊線）
broader: g000199
in scheme: scheme
notation: 000199
scope note: 運営会社: 札幌市。路線名: 東豊線。鉄道区分: 案内軌条式鉄道（16）。事業者種別: 公営鉄道（3）。

釧路湿原
type: Concept
alternative label: 釧路湿原（北海道旅客鉄道 釧網線）
broader: g000200
in scheme: scheme
notation: 000200
scope note: 運営会社: 北海道旅客鉄道。路線名: 釧網線。鉄道区分: 普通鉄道JR（11）。事業者種別: JR在来線（2）。

発寒
type: Concept
alternative label: 発寒（北海道旅客鉄道 函館線）
broader: g000201
in scheme: scheme
notation: 000201
scope note: 運営会社: 北海道旅客鉄道。路線名: 函館線。鉄道区分: 普通鉄道JR（11）。事業者種別: JR在来線（2）。

高砂
type: Concept
alternative label: 高砂（北海道旅客鉄道 函館線）
broader: g000202
in scheme: scheme
notation: 000202
scope note: 運営会社: 北海道旅客鉄道。路線名: 函館線。鉄道区分: 普通鉄道JR（11）。事業者種別: JR在来線（2）。

北34条
type: Concept
alternative label: 北34条（札幌市 南北線）
broader: g000203
in scheme: scheme
notation: 000203
scope note: 運営会社: 札幌市。路線名: 南北線。鉄道区分: 案内軌条式鉄道（16）。事業者種別: 公営鉄道（3）。

新川
type: Concept
alternative label: 新川（北海道旅客鉄道 札沼線）
broader: g000204
in scheme: scheme
notation: 000204
scope note: 運営会社: 北海道旅客鉄道。路線名: 札沼線。鉄道区分: 普通鉄道JR（11）。事業者種別: JR在来線（2）。

元町
type: Concept
alternative label: 元町（札幌市 東豊線）
broader: g000205
in scheme: scheme
notation: 000205
scope note: 運営会社: 札幌市。路線名: 東豊線。鉄道区分: 案内軌条式鉄道（16）。事業者種別: 公営鉄道（3）。

野幌
type: Concept
alternative label: 野幌（北海道旅客鉄道 函館線）
broader: g000206
in scheme: scheme
notation: 000206
scope note: 運営会社: 北海道旅客鉄道。路線名: 函館線。鉄道区分: 普通鉄道JR（11）。事業者種別: JR在来線（2）。

北24条
type: Concept
alternative label: 北24条（札幌市 南北線）
broader: g000207
in scheme: scheme
notation: 000207
scope note: 運営会社: 札幌市。路線名: 南北線。鉄道区分: 案内軌条式鉄道（16）。事業者種別: 公営鉄道（3）。

宮の沢
type: Concept
alternative label: 宮の沢（札幌市 東西線）
broader: g000208
in scheme: scheme
notation: 000208
scope note: 運営会社: 札幌市。路線名: 東西線。鉄道区分: 案内軌条式鉄道（16）。事業者種別: 公営鉄道（3）。

発寒中央
type: Concept
alternative label: 発寒中央（北海道旅客鉄道 函館線）
broader: g000209
in scheme: scheme
notation: 000209
scope note: 運営会社: 北海道旅客鉄道。路線名: 函館線。鉄道区分: 普通鉄道JR（11）。事業者種別: JR在来線（2）。

八軒
type: Concept
alternative label: 八軒（北海道旅客鉄道 札沼線）
broader: g000210
in scheme: scheme
notation: 000210
scope note: 運営会社: 北海道旅客鉄道。路線名: 札沼線。鉄道区分: 普通鉄道JR（11）。事業者種別: JR在来線（2）。

栗丘
type: Concept
alternative label: 栗丘（北海道旅客鉄道 室蘭線）
broader: g000211
in scheme: scheme
notation: 000211
scope note: 運営会社: 北海道旅客鉄道。路線名: 室蘭線。鉄道区分: 普通鉄道JR（11）。事業者種別: JR在来線（2）。

環状通東
type: Concept
alternative label: 環状通東（札幌市 東豊線）
broader: g000212
in scheme: scheme
notation: 000212
scope note: 運営会社: 札幌市。路線名: 東豊線。鉄道区分: 案内軌条式鉄道（16）。事業者種別: 公営鉄道（3）。

新得
type: Concept
alternative label: 新得（北海道旅客鉄道 根室線）
broader: g000213
in scheme: scheme
notation: 000213
scope note: 運営会社: 北海道旅客鉄道。路線名: 根室線。鉄道区分: 普通鉄道JR（11）。事業者種別: JR在来線（2）。

新得
type: Concept
alternative label: 新得（北海道旅客鉄道 石勝線）
broader: g000213
in scheme: scheme
notation: 000214
scope note: 運営会社: 北海道旅客鉄道。路線名: 石勝線。鉄道区分: 普通鉄道JR（11）。事業者種別: JR在来線（2）。

北18条
type: Concept
alternative label: 北18条（札幌市 南北線）
broader: g000215
in scheme: scheme
notation: 000215
scope note: 運営会社: 札幌市。路線名: 南北線。鉄道区分: 案内軌条式鉄道（16）。事業者種別: 公営鉄道（3）。

発寒南
type: Concept
alternative label: 発寒南（札幌市 東西線）
broader: g000216
in scheme: scheme
notation: 000216
scope note: 運営会社: 札幌市。路線名: 東西線。鉄道区分: 案内軌条式鉄道（16）。事業者種別: 公営鉄道（3）。

琴似
type: Concept
alternative label: 琴似（北海道旅客鉄道 函館線）
broader: g000217
in scheme: scheme
notation: 000217
scope note: 運営会社: 北海道旅客鉄道。路線名: 函館線。鉄道区分: 普通鉄道JR（11）。事業者種別: JR在来線（2）。

東区役所前
type: Concept
alternative label: 東区役所前（札幌市 東豊線）
broader: g000218
in scheme: scheme
notation: 000218
scope note: 運営会社: 札幌市。路線名: 東豊線。鉄道区分: 案内軌条式鉄道（16）。事業者種別: 公営鉄道（3）。

北13条東
type: Concept
alternative label: 北13条東（札幌市 東豊線）
broader: g000219
in scheme: scheme
notation: 000219
scope note: 運営会社: 札幌市。路線名: 東豊線。鉄道区分: 案内軌条式鉄道（16）。事業者種別: 公営鉄道（3）。

琴似
type: Concept
alternative label: 琴似（札幌市 東西線）
broader: g000220
in scheme: scheme
notation: 000220
scope note: 運営会社: 札幌市。路線名: 東西線。鉄道区分: 案内軌条式鉄道（16）。事業者種別: 公営鉄道（3）。

北12条
type: Concept
alternative label: 北12条（札幌市 南北線）
broader: g000221
in scheme: scheme
notation: 000221
scope note: 運営会社: 札幌市。路線名: 南北線。鉄道区分: 案内軌条式鉄道（16）。事業者種別: 公営鉄道（3）。

大麻
type: Concept
alternative label: 大麻（北海道旅客鉄道 函館線）
broader: g000222
in scheme: scheme
notation: 000222
scope note: 運営会社: 北海道旅客鉄道。路線名: 函館線。鉄道区分: 普通鉄道JR（11）。事業者種別: JR在来線（2）。

桑園
type: Concept
alternative label: 桑園（北海道旅客鉄道 札沼線）
broader: g000223
in scheme: scheme
notation: 000223
scope note: 運営会社: 北海道旅客鉄道。路線名: 札沼線。鉄道区分: 普通鉄道JR（11）。事業者種別: JR在来線（2）。

桑園
type: Concept
alternative label: 桑園（北海道旅客鉄道 函館線）
broader: g000223
in scheme: scheme
notation: 000224
scope note: 運営会社: 北海道旅客鉄道。路線名: 函館線。鉄道区分: 普通鉄道JR（11）。事業者種別: JR在来線（2）。

二十四軒
type: Concept
alternative label: 二十四軒（札幌市 東西線）
broader: g000225
in scheme: scheme
notation: 000225
scope note: 運営会社: 札幌市。路線名: 東西線。鉄道区分: 案内軌条式鉄道（16）。事業者種別: 公営鉄道（3）。

苗穂
type: Concept
alternative label: 苗穂（北海道旅客鉄道 函館線）
broader: g000226
in scheme: scheme
notation: 000226
scope note: 運営会社: 北海道旅客鉄道。路線名: 函館線。鉄道区分: 普通鉄道JR（11）。事業者種別: JR在来線（2）。

札幌
type: Concept
alternative label: 札幌（北海道旅客鉄道 函館線）
broader: g000227
in scheme: scheme
notation: 000227
scope note: 運営会社: 北海道旅客鉄道。路線名: 函館線。鉄道区分: 普通鉄道JR（11）。事業者種別: JR在来線（2）。

さっぽろ
type: Concept
alternative label: さっぽろ（札幌市 東豊線）
broader: g000228
in scheme: scheme
notation: 000228
scope note: 運営会社: 札幌市。路線名: 東豊線。鉄道区分: 案内軌条式鉄道（16）。事業者種別: 公営鉄道（3）。

さっぽろ
type: Concept
alternative label: さっぽろ（札幌市 南北線）
broader: g000228
in scheme: scheme
notation: 000229
scope note: 運営会社: 札幌市。路線名: 南北線。鉄道区分: 案内軌条式鉄道（16）。事業者種別: 公営鉄道（3）。

バスセンター前
type: Concept
alternative label: バスセンター前（札幌市 東西線）
broader: g000230
in scheme: scheme
notation: 000230
scope note: 運営会社: 札幌市。路線名: 東西線。鉄道区分: 案内軌条式鉄道（16）。事業者種別: 公営鉄道（3）。

西28丁目
type: Concept
alternative label: 西28丁目（札幌市 東西線）
broader: g000231
in scheme: scheme
notation: 000231
scope note: 運営会社: 札幌市。路線名: 東西線。鉄道区分: 案内軌条式鉄道（16）。事業者種別: 公営鉄道（3）。

大通
type: Concept
alternative label: 大通（札幌市 東豊線）
broader: g000233
in scheme: scheme
notation: 000232
scope note: 運営会社: 札幌市。路線名: 東豊線。鉄道区分: 案内軌条式鉄道（16）。事業者種別: 公営鉄道（3）。

大通
type: Concept
alternative label: 大通（札幌市 東西線）
broader: g000233
in scheme: scheme
notation: 000233
scope note: 運営会社: 札幌市。路線名: 東西線。鉄道区分: 案内軌条式鉄道（16）。事業者種別: 公営鉄道（3）。

大通
type: Concept
alternative label: 大通（札幌市 南北線）
broader: g000233
in scheme: scheme
notation: 000234
scope note: 運営会社: 札幌市。路線名: 南北線。鉄道区分: 案内軌条式鉄道（16）。事業者種別: 公営鉄道（3）。

西4丁目
type: Concept
alternative label: 西4丁目（一般社団法人札幌市交通事業振興公社 1条線）
broader: g000235
in scheme: scheme
notation: 000235
scope note: 運営会社: 一般社団法人札幌市交通事業振興公社。路線名: 1条線。鉄道区分: 軌道（21）。事業者種別: 第三セクター（5）。

西4丁目
type: Concept
alternative label: 西4丁目（一般社団法人札幌市交通事業振興公社 都心線）
broader: g000235
in scheme: scheme
notation: 000236
scope note: 運営会社: 一般社団法人札幌市交通事業振興公社。路線名: 都心線。鉄道区分: 軌道（21）。事業者種別: 第三セクター（5）。

西11丁目
type: Concept
alternative label: 西11丁目（札幌市 東西線）
broader: g000237
in scheme: scheme
notation: 000237
scope note: 運営会社: 札幌市。路線名: 東西線。鉄道区分: 案内軌条式鉄道（16）。事業者種別: 公営鉄道（3）。

西8丁目
type: Concept
alternative label: 西8丁目（一般社団法人札幌市交通事業振興公社 1条線）
broader: g000238
in scheme: scheme
notation: 000238
scope note: 運営会社: 一般社団法人札幌市交通事業振興公社。路線名: 1条線。鉄道区分: 軌道（21）。事業者種別: 第三セクター（5）。

栗山
type: Concept
alternative label: 栗山（北海道旅客鉄道 室蘭線）
broader: g000239
in scheme: scheme
notation: 000239
scope note: 運営会社: 北海道旅客鉄道。路線名: 室蘭線。鉄道区分: 普通鉄道JR（11）。事業者種別: JR在来線（2）。

門静
type: Concept
alternative label: 門静（北海道旅客鉄道 根室線）
broader: g000240
in scheme: scheme
notation: 000240
scope note: 運営会社: 北海道旅客鉄道。路線名: 根室線。鉄道区分: 普通鉄道JR（11）。事業者種別: JR在来線（2）。

中央区役所前
type: Concept
alternative label: 中央区役所前（一般社団法人札幌市交通事業振興公社 1条線）
broader: g000241
in scheme: scheme
notation: 000241
scope note: 運営会社: 一般社団法人札幌市交通事業振興公社。路線名: 1条線。鉄道区分: 軌道（21）。事業者種別: 第三セクター（5）。

狸小路
type: Concept
alternative label: 狸小路（一般社団法人札幌市交通事業振興公社 都心線）
broader: g000242
in scheme: scheme
notation: 000242
scope note: 運営会社: 一般社団法人札幌市交通事業振興公社。路線名: 都心線。鉄道区分: 軌道（21）。事業者種別: 第三セクター（5）。

菊水
type: Concept
alternative label: 菊水（札幌市 東西線）
broader: g000243
in scheme: scheme
notation: 000243
scope note: 運営会社: 札幌市。路線名: 東西線。鉄道区分: 案内軌条式鉄道（16）。事業者種別: 公営鉄道（3）。

西18丁目
type: Concept
alternative label: 西18丁目（札幌市 東西線）
broader: g000244
in scheme: scheme
notation: 000244
scope note: 運営会社: 札幌市。路線名: 東西線。鉄道区分: 案内軌条式鉄道（16）。事業者種別: 公営鉄道（3）。

森林公園
type: Concept
alternative label: 森林公園（北海道旅客鉄道 函館線）
broader: g000245
in scheme: scheme
notation: 000245
scope note: 運営会社: 北海道旅客鉄道。路線名: 函館線。鉄道区分: 普通鉄道JR（11）。事業者種別: JR在来線（2）。

厚岸
type: Concept
alternative label: 厚岸（北海道旅客鉄道 根室線）
broader: g000246
in scheme: scheme
notation: 000246
scope note: 運営会社: 北海道旅客鉄道。路線名: 根室線。鉄道区分: 普通鉄道JR（11）。事業者種別: JR在来線（2）。

西15丁目
type: Concept
alternative label: 西15丁目（一般社団法人札幌市交通事業振興公社 1条線）
broader: g000247
in scheme: scheme
notation: 000247
scope note: 運営会社: 一般社団法人札幌市交通事業振興公社。路線名: 1条線。鉄道区分: 軌道（21）。事業者種別: 第三セクター（5）。

西15丁目
type: Concept
alternative label: 西15丁目（一般社団法人札幌市交通事業振興公社 山鼻西線）
broader: g000247
in scheme: scheme
notation: 000248
scope note: 運営会社: 一般社団法人札幌市交通事業振興公社。路線名: 山鼻西線。鉄道区分: 軌道（21）。事業者種別: 第三セクター（5）。

トマム
type: Concept
alternative label: トマム（北海道旅客鉄道 石勝線）
broader: g000249
in scheme: scheme
notation: 000249
scope note: 運営会社: 北海道旅客鉄道。路線名: 石勝線。鉄道区分: 普通鉄道JR（11）。事業者種別: JR在来線（2）。

円山公園
type: Concept
alternative label: 円山公園（札幌市 東西線）
broader: g000250
in scheme: scheme
notation: 000250
scope note: 運営会社: 札幌市。路線名: 東西線。鉄道区分: 案内軌条式鉄道（16）。事業者種別: 公営鉄道（3）。

すすきの
type: Concept
alternative label: すすきの（一般社団法人札幌市交通事業振興公社 山鼻線）
broader: g000251
in scheme: scheme
notation: 000251
scope note: 運営会社: 一般社団法人札幌市交通事業振興公社。路線名: 山鼻線。鉄道区分: 軌道（21）。事業者種別: 第三セクター（5）。

すすきの
type: Concept
alternative label: すすきの（一般社団法人札幌市交通事業振興公社 都心線）
broader: g000251
in scheme: scheme
notation: 000252
scope note: 運営会社: 一般社団法人札幌市交通事業振興公社。路線名: 都心線。鉄道区分: 軌道（21）。事業者種別: 第三セクター（5）。

すすきの
type: Concept
alternative label: すすきの（札幌市 南北線）
broader: g000251
in scheme: scheme
notation: 000253
scope note: 運営会社: 札幌市。路線名: 南北線。鉄道区分: 案内軌条式鉄道（16）。事業者種別: 公営鉄道（3）。

資生館小学校前
type: Concept
alternative label: 資生館小学校前（一般社団法人札幌市交通事業振興公社 山鼻線）
broader: g000254
in scheme: scheme
notation: 000254
scope note: 運営会社: 一般社団法人札幌市交通事業振興公社。路線名: 山鼻線。鉄道区分: 軌道（21）。事業者種別: 第三セクター（5）。

白石
type: Concept
alternative label: 白石（北海道旅客鉄道 千歳線）
broader: g000255
in scheme: scheme
notation: 000255
scope note: 運営会社: 北海道旅客鉄道。路線名: 千歳線。鉄道区分: 普通鉄道JR（11）。事業者種別: JR在来線（2）。

白石
type: Concept
alternative label: 白石（北海道旅客鉄道 函館線）
broader: g000255
in scheme: scheme
notation: 000256
scope note: 運営会社: 北海道旅客鉄道。路線名: 函館線。鉄道区分: 普通鉄道JR（11）。事業者種別: JR在来線（2）。

豊水すすきの
type: Concept
alternative label: 豊水すすきの（札幌市 東豊線）
broader: g000257
in scheme: scheme
notation: 000257
scope note: 運営会社: 札幌市。路線名: 東豊線。鉄道区分: 案内軌条式鉄道（16）。事業者種別: 公営鉄道（3）。

東札幌
type: Concept
alternative label: 東札幌（札幌市 東西線）
broader: g000258
in scheme: scheme
notation: 000258
scope note: 運営会社: 札幌市。路線名: 東西線。鉄道区分: 案内軌条式鉄道（16）。事業者種別: 公営鉄道（3）。

東本願寺前
type: Concept
alternative label: 東本願寺前（一般社団法人札幌市交通事業振興公社 山鼻線）
broader: g000259
in scheme: scheme
notation: 000259
scope note: 運営会社: 一般社団法人札幌市交通事業振興公社。路線名: 山鼻線。鉄道区分: 軌道（21）。事業者種別: 第三セクター（5）。

西線6条
type: Concept
alternative label: 西線6条（一般社団法人札幌市交通事業振興公社 山鼻西線）
broader: g000260
in scheme: scheme
notation: 000260
scope note: 運営会社: 一般社団法人札幌市交通事業振興公社。路線名: 山鼻西線。鉄道区分: 軌道（21）。事業者種別: 第三セクター（5）。

山鼻9条
type: Concept
alternative label: 山鼻9条（一般社団法人札幌市交通事業振興公社 山鼻線）
broader: g000261
in scheme: scheme
notation: 000261
scope note: 運営会社: 一般社団法人札幌市交通事業振興公社。路線名: 山鼻線。鉄道区分: 軌道（21）。事業者種別: 第三セクター（5）。

中島公園
type: Concept
alternative label: 中島公園（札幌市 南北線）
broader: g000262
in scheme: scheme
notation: 000262
scope note: 運営会社: 札幌市。路線名: 南北線。鉄道区分: 案内軌条式鉄道（16）。事業者種別: 公営鉄道（3）。

西線9条旭山公園通
type: Concept
alternative label: 西線9条旭山公園通（一般社団法人札幌市交通事業振興公社 山鼻西線）
broader: g000263
in scheme: scheme
notation: 000263
scope note: 運営会社: 一般社団法人札幌市交通事業振興公社。路線名: 山鼻西線。鉄道区分: 軌道（21）。事業者種別: 第三セクター（5）。

学園前
type: Concept
alternative label: 学園前（札幌市 東豊線）
broader: g000264
in scheme: scheme
notation: 000264
scope note: 運営会社: 札幌市。路線名: 東豊線。鉄道区分: 案内軌条式鉄道（16）。事業者種別: 公営鉄道（3）。

遠矢
type: Concept
alternative label: 遠矢（北海道旅客鉄道 釧網線）
broader: g000265
in scheme: scheme
notation: 000265
scope note: 運営会社: 北海道旅客鉄道。路線名: 釧網線。鉄道区分: 普通鉄道JR（11）。事業者種別: JR在来線（2）。

平和
type: Concept
alternative label: 平和（北海道旅客鉄道 千歳線）
broader: g000266
in scheme: scheme
notation: 000266
scope note: 運営会社: 北海道旅客鉄道。路線名: 千歳線。鉄道区分: 普通鉄道JR（11）。事業者種別: JR在来線（2）。

白石
type: Concept
alternative label: 白石（札幌市 東西線）
broader: g000267
in scheme: scheme
notation: 000267
scope note: 運営会社: 札幌市。路線名: 東西線。鉄道区分: 案内軌条式鉄道（16）。事業者種別: 公営鉄道（3）。

中島公園通
type: Concept
alternative label: 中島公園通（一般社団法人札幌市交通事業振興公社 山鼻線）
broader: g000268
in scheme: scheme
notation: 000268
scope note: 運営会社: 一般社団法人札幌市交通事業振興公社。路線名: 山鼻線。鉄道区分: 軌道（21）。事業者種別: 第三セクター（5）。

厚別
type: Concept
alternative label: 厚別（北海道旅客鉄道 函館線）
broader: g000269
in scheme: scheme
notation: 000269
scope note: 運営会社: 北海道旅客鉄道。路線名: 函館線。鉄道区分: 普通鉄道JR（11）。事業者種別: JR在来線（2）。

西線11条
type: Concept
alternative label: 西線11条（一般社団法人札幌市交通事業振興公社 山鼻西線）
broader: g000270
in scheme: scheme
notation: 000270
scope note: 運営会社: 一般社団法人札幌市交通事業振興公社。路線名: 山鼻西線。鉄道区分: 軌道（21）。事業者種別: 第三セクター（5）。

豊平公園
type: Concept
alternative label: 豊平公園（札幌市 東豊線）
broader: g000271
in scheme: scheme
notation: 000271
scope note: 運営会社: 札幌市。路線名: 東豊線。鉄道区分: 案内軌条式鉄道（16）。事業者種別: 公営鉄道（3）。

行啓通
type: Concept
alternative label: 行啓通（一般社団法人札幌市交通事業振興公社 山鼻線）
broader: g000272
in scheme: scheme
notation: 000272
scope note: 運営会社: 一般社団法人札幌市交通事業振興公社。路線名: 山鼻線。鉄道区分: 軌道（21）。事業者種別: 第三セクター（5）。

銀山
type: Concept
alternative label: 銀山（北海道旅客鉄道 函館線）
broader: g000273
in scheme: scheme
notation: 000273
scope note: 運営会社: 北海道旅客鉄道。路線名: 函館線。鉄道区分: 普通鉄道JR（11）。事業者種別: JR在来線（2）。

西線14条
type: Concept
alternative label: 西線14条（一般社団法人札幌市交通事業振興公社 山鼻西線）
broader: g000274
in scheme: scheme
notation: 000274
scope note: 運営会社: 一般社団法人札幌市交通事業振興公社。路線名: 山鼻西線。鉄道区分: 軌道（21）。事業者種別: 第三セクター（5）。

南郷7丁目
type: Concept
alternative label: 南郷7丁目（札幌市 東西線）
broader: g000275
in scheme: scheme
notation: 000275
scope note: 運営会社: 札幌市。路線名: 東西線。鉄道区分: 案内軌条式鉄道（16）。事業者種別: 公営鉄道（3）。

幌平橋
type: Concept
alternative label: 幌平橋（札幌市 南北線）
broader: g000276
in scheme: scheme
notation: 000276
scope note: 運営会社: 札幌市。路線名: 南北線。鉄道区分: 案内軌条式鉄道（16）。事業者種別: 公営鉄道（3）。

新さっぽろ
type: Concept
alternative label: 新さっぽろ（札幌市 東西線）
broader: g000277
in scheme: scheme
notation: 000277
scope note: 運営会社: 札幌市。路線名: 東西線。鉄道区分: 案内軌条式鉄道（16）。事業者種別: 公営鉄道（3）。

新札幌
type: Concept
alternative label: 新札幌（北海道旅客鉄道 千歳線）
broader: g000278
in scheme: scheme
notation: 000278
scope note: 運営会社: 北海道旅客鉄道。路線名: 千歳線。鉄道区分: 普通鉄道JR（11）。事業者種別: JR在来線（2）。

静修学園前
type: Concept
alternative label: 静修学園前（一般社団法人札幌市交通事業振興公社 山鼻線）
broader: g000279
in scheme: scheme
notation: 000279
scope note: 運営会社: 一般社団法人札幌市交通事業振興公社。路線名: 山鼻線。鉄道区分: 軌道（21）。事業者種別: 第三セクター（5）。

中の島
type: Concept
alternative label: 中の島（札幌市 南北線）
broader: g000280
in scheme: scheme
notation: 000280
scope note: 運営会社: 札幌市。路線名: 南北線。鉄道区分: 案内軌条式鉄道（16）。事業者種別: 公営鉄道（3）。

西線16条
type: Concept
alternative label: 西線16条（一般社団法人札幌市交通事業振興公社 山鼻西線）
broader: g000281
in scheme: scheme
notation: 000281
scope note: 運営会社: 一般社団法人札幌市交通事業振興公社。路線名: 山鼻西線。鉄道区分: 軌道（21）。事業者種別: 第三セクター（5）。

美園
type: Concept
alternative label: 美園（札幌市 東豊線）
broader: g000282
in scheme: scheme
notation: 000282
scope note: 運営会社: 札幌市。路線名: 東豊線。鉄道区分: 案内軌条式鉄道（16）。事業者種別: 公営鉄道（3）。

南郷13丁目
type: Concept
alternative label: 南郷13丁目（札幌市 東西線）
broader: g000283
in scheme: scheme
notation: 000283
scope note: 運営会社: 札幌市。路線名: 東西線。鉄道区分: 案内軌条式鉄道（16）。事業者種別: 公営鉄道（3）。

山鼻19条
type: Concept
alternative label: 山鼻19条（一般社団法人札幌市交通事業振興公社 山鼻線）
broader: g000284
in scheme: scheme
notation: 000284
scope note: 運営会社: 一般社団法人札幌市交通事業振興公社。路線名: 山鼻線。鉄道区分: 軌道（21）。事業者種別: 第三セクター（5）。

平岸
type: Concept
alternative label: 平岸（札幌市 南北線）
broader: g000285
in scheme: scheme
notation: 000285
scope note: 運営会社: 札幌市。路線名: 南北線。鉄道区分: 案内軌条式鉄道（16）。事業者種別: 公営鉄道（3）。

ロープウェイ入口
type: Concept
alternative label: ロープウェイ入口（一般社団法人札幌市交通事業振興公社 山鼻西線）
broader: g000286
in scheme: scheme
notation: 000286
scope note: 運営会社: 一般社団法人札幌市交通事業振興公社。路線名: 山鼻西線。鉄道区分: 軌道（21）。事業者種別: 第三セクター（5）。

上尾幌
type: Concept
alternative label: 上尾幌（北海道旅客鉄道 根室線）
broader: g000287
in scheme: scheme
notation: 000287
scope note: 運営会社: 北海道旅客鉄道。路線名: 根室線。鉄道区分: 普通鉄道JR（11）。事業者種別: JR在来線（2）。

幌南小学校前
type: Concept
alternative label: 幌南小学校前（一般社団法人札幌市交通事業振興公社 山鼻線）
broader: g000288
in scheme: scheme
notation: 000288
scope note: 運営会社: 一般社団法人札幌市交通事業振興公社。路線名: 山鼻線。鉄道区分: 軌道（21）。事業者種別: 第三セクター（5）。

ひばりが丘
type: Concept
alternative label: ひばりが丘（札幌市 東西線）
broader: g000289
in scheme: scheme
notation: 000289
scope note: 運営会社: 札幌市。路線名: 東西線。鉄道区分: 案内軌条式鉄道（16）。事業者種別: 公営鉄道（3）。

東屯田通
type: Concept
alternative label: 東屯田通（一般社団法人札幌市交通事業振興公社 山鼻線）
broader: g000290
in scheme: scheme
notation: 000290
scope note: 運営会社: 一般社団法人札幌市交通事業振興公社。路線名: 山鼻線。鉄道区分: 軌道（21）。事業者種別: 第三セクター（5）。

石山通
type: Concept
alternative label: 石山通（一般社団法人札幌市交通事業振興公社 山鼻線）
broader: g000291
in scheme: scheme
notation: 000291
scope note: 運営会社: 一般社団法人札幌市交通事業振興公社。路線名: 山鼻線。鉄道区分: 軌道（21）。事業者種別: 第三セクター（5）。

電車事業所前
type: Concept
alternative label: 電車事業所前（一般社団法人札幌市交通事業振興公社 山鼻西線）
broader: g000292
in scheme: scheme
notation: 000292
scope note: 運営会社: 一般社団法人札幌市交通事業振興公社。路線名: 山鼻西線。鉄道区分: 軌道（21）。事業者種別: 第三セクター（5）。

中央図書館前
type: Concept
alternative label: 中央図書館前（一般社団法人札幌市交通事業振興公社 山鼻西線）
broader: g000293
in scheme: scheme
notation: 000293
scope note: 運営会社: 一般社団法人札幌市交通事業振興公社。路線名: 山鼻西線。鉄道区分: 軌道（21）。事業者種別: 第三セクター（5）。

中央図書館前
type: Concept
alternative label: 中央図書館前（一般社団法人札幌市交通事業振興公社 山鼻線）
broader: g000293
in scheme: scheme
notation: 000294
scope note: 運営会社: 一般社団法人札幌市交通事業振興公社。路線名: 山鼻線。鉄道区分: 軌道（21）。事業者種別: 第三セクター（5）。

南郷18丁目
type: Concept
alternative label: 南郷18丁目（札幌市 東西線）
broader: g000295
in scheme: scheme
notation: 000295
scope note: 運営会社: 札幌市。路線名: 東西線。鉄道区分: 案内軌条式鉄道（16）。事業者種別: 公営鉄道（3）。

月寒中央
type: Concept
alternative label: 月寒中央（札幌市 東豊線）
broader: g000296
in scheme: scheme
notation: 000296
scope note: 運営会社: 札幌市。路線名: 東豊線。鉄道区分: 案内軌条式鉄道（16）。事業者種別: 公営鉄道（3）。

大谷地
type: Concept
alternative label: 大谷地（札幌市 東西線）
broader: g000297
in scheme: scheme
notation: 000297
scope note: 運営会社: 札幌市。路線名: 東西線。鉄道区分: 案内軌条式鉄道（16）。事業者種別: 公営鉄道（3）。

南平岸
type: Concept
alternative label: 南平岸（札幌市 南北線）
broader: g000298
in scheme: scheme
notation: 000298
scope note: 運営会社: 札幌市。路線名: 南北線。鉄道区分: 案内軌条式鉄道（16）。事業者種別: 公営鉄道（3）。

福住
type: Concept
alternative label: 福住（札幌市 東豊線）
broader: g000299
in scheme: scheme
notation: 000299
scope note: 運営会社: 札幌市。路線名: 東豊線。鉄道区分: 案内軌条式鉄道（16）。事業者種別: 公営鉄道（3）。

尾幌
type: Concept
alternative label: 尾幌（北海道旅客鉄道 根室線）
broader: g000300
in scheme: scheme
notation: 000300
scope note: 運営会社: 北海道旅客鉄道。路線名: 根室線。鉄道区分: 普通鉄道JR（11）。事業者種別: JR在来線（2）。

澄川
type: Concept
alternative label: 澄川（札幌市 南北線）
broader: g000301
in scheme: scheme
notation: 000301
scope note: 運営会社: 札幌市。路線名: 南北線。鉄道区分: 案内軌条式鉄道（16）。事業者種別: 公営鉄道（3）。

上野幌
type: Concept
alternative label: 上野幌（北海道旅客鉄道 千歳線）
broader: g000302
in scheme: scheme
notation: 000302
scope note: 運営会社: 北海道旅客鉄道。路線名: 千歳線。鉄道区分: 普通鉄道JR（11）。事業者種別: JR在来線（2）。

十勝清水
type: Concept
alternative label: 十勝清水（北海道旅客鉄道 根室線）
broader: g000303
in scheme: scheme
notation: 000303
scope note: 運営会社: 北海道旅客鉄道。路線名: 根室線。鉄道区分: 普通鉄道JR（11）。事業者種別: JR在来線（2）。

由仁
type: Concept
alternative label: 由仁（北海道旅客鉄道 室蘭線）
broader: g000304
in scheme: scheme
notation: 000304
scope note: 運営会社: 北海道旅客鉄道。路線名: 室蘭線。鉄道区分: 普通鉄道JR（11）。事業者種別: JR在来線（2）。

新大楽毛
type: Concept
alternative label: 新大楽毛（北海道旅客鉄道 根室線）
broader: g000305
in scheme: scheme
notation: 000305
scope note: 運営会社: 北海道旅客鉄道。路線名: 根室線。鉄道区分: 普通鉄道JR（11）。事業者種別: JR在来線（2）。

大楽毛
type: Concept
alternative label: 大楽毛（北海道旅客鉄道 根室線）
broader: g000306
in scheme: scheme
notation: 000306
scope note: 運営会社: 北海道旅客鉄道。路線名: 根室線。鉄道区分: 普通鉄道JR（11）。事業者種別: JR在来線（2）。

自衛隊前
type: Concept
alternative label: 自衛隊前（札幌市 南北線）
broader: g000307
in scheme: scheme
notation: 000307
scope note: 運営会社: 札幌市。路線名: 南北線。鉄道区分: 案内軌条式鉄道（16）。事業者種別: 公営鉄道（3）。

新富士
type: Concept
alternative label: 新富士（北海道旅客鉄道 根室線）
broader: g000308
in scheme: scheme
notation: 000308
scope note: 運営会社: 北海道旅客鉄道。路線名: 根室線。鉄道区分: 普通鉄道JR（11）。事業者種別: JR在来線（2）。

東釧路
type: Concept
alternative label: 東釧路（北海道旅客鉄道 釧網線）
broader: g000309
in scheme: scheme
notation: 000309
scope note: 運営会社: 北海道旅客鉄道。路線名: 釧網線。鉄道区分: 普通鉄道JR（11）。事業者種別: JR在来線（2）。

東釧路
type: Concept
alternative label: 東釧路（北海道旅客鉄道 根室線）
broader: g000309
in scheme: scheme
notation: 000310
scope note: 運営会社: 北海道旅客鉄道。路線名: 根室線。鉄道区分: 普通鉄道JR（11）。事業者種別: JR在来線（2）。

別保
type: Concept
alternative label: 別保（北海道旅客鉄道 根室線）
broader: g000311
in scheme: scheme
notation: 000311
scope note: 運営会社: 北海道旅客鉄道。路線名: 根室線。鉄道区分: 普通鉄道JR（11）。事業者種別: JR在来線（2）。

占冠
type: Concept
alternative label: 占冠（北海道旅客鉄道 石勝線）
broader: g000312
in scheme: scheme
notation: 000312
scope note: 運営会社: 北海道旅客鉄道。路線名: 石勝線。鉄道区分: 普通鉄道JR（11）。事業者種別: JR在来線（2）。

武佐
type: Concept
alternative label: 武佐（北海道旅客鉄道 根室線）
broader: g000313
in scheme: scheme
notation: 000313
scope note: 運営会社: 北海道旅客鉄道。路線名: 根室線。鉄道区分: 普通鉄道JR（11）。事業者種別: JR在来線（2）。

真駒内
type: Concept
alternative label: 真駒内（札幌市 南北線）
broader: g000314
in scheme: scheme
notation: 000314
scope note: 運営会社: 札幌市。路線名: 南北線。鉄道区分: 案内軌条式鉄道（16）。事業者種別: 公営鉄道（3）。

釧路
type: Concept
alternative label: 釧路（北海道旅客鉄道 根室線）
broader: g000315
in scheme: scheme
notation: 000315
scope note: 運営会社: 北海道旅客鉄道。路線名: 根室線。鉄道区分: 普通鉄道JR（11）。事業者種別: JR在来線（2）。

庶路
type: Concept
alternative label: 庶路（北海道旅客鉄道 根室線）
broader: g000316
in scheme: scheme
notation: 000316
scope note: 運営会社: 北海道旅客鉄道。路線名: 根室線。鉄道区分: 普通鉄道JR（11）。事業者種別: JR在来線（2）。

北広島
type: Concept
alternative label: 北広島（北海道旅客鉄道 千歳線）
broader: g000317
in scheme: scheme
notation: 000317
scope note: 運営会社: 北海道旅客鉄道。路線名: 千歳線。鉄道区分: 普通鉄道JR（11）。事業者種別: JR在来線（2）。

西庶路
type: Concept
alternative label: 西庶路（北海道旅客鉄道 根室線）
broader: g000318
in scheme: scheme
notation: 000318
scope note: 運営会社: 北海道旅客鉄道。路線名: 根室線。鉄道区分: 普通鉄道JR（11）。事業者種別: JR在来線（2）。

古山
type: Concept
alternative label: 古山（北海道旅客鉄道 室蘭線）
broader: g000319
in scheme: scheme
notation: 000319
scope note: 運営会社: 北海道旅客鉄道。路線名: 室蘭線。鉄道区分: 普通鉄道JR（11）。事業者種別: JR在来線（2）。

小沢
type: Concept
alternative label: 小沢（北海道旅客鉄道 函館線）
broader: g000320
in scheme: scheme
notation: 000320
scope note: 運営会社: 北海道旅客鉄道。路線名: 函館線。鉄道区分: 普通鉄道JR（11）。事業者種別: JR在来線（2）。

白糠
type: Concept
alternative label: 白糠（北海道旅客鉄道 根室線）
broader: g000321
in scheme: scheme
notation: 000321
scope note: 運営会社: 北海道旅客鉄道。路線名: 根室線。鉄道区分: 普通鉄道JR（11）。事業者種別: JR在来線（2）。

三川
type: Concept
alternative label: 三川（北海道旅客鉄道 室蘭線）
broader: g000322
in scheme: scheme
notation: 000322
scope note: 運営会社: 北海道旅客鉄道。路線名: 室蘭線。鉄道区分: 普通鉄道JR（11）。事業者種別: JR在来線（2）。

御影
type: Concept
alternative label: 御影（北海道旅客鉄道 根室線）
broader: g000323
in scheme: scheme
notation: 000323
scope note: 運営会社: 北海道旅客鉄道。路線名: 根室線。鉄道区分: 普通鉄道JR（11）。事業者種別: JR在来線（2）。

新夕張
type: Concept
alternative label: 新夕張（北海道旅客鉄道 石勝線）
broader: g000324
in scheme: scheme
notation: 000324
scope note: 運営会社: 北海道旅客鉄道。路線名: 石勝線。鉄道区分: 普通鉄道JR（11）。事業者種別: JR在来線（2）。

利別
type: Concept
alternative label: 利別（北海道旅客鉄道 根室線）
broader: g000325
in scheme: scheme
notation: 000325
scope note: 運営会社: 北海道旅客鉄道。路線名: 根室線。鉄道区分: 普通鉄道JR（11）。事業者種別: JR在来線（2）。

柏林台
type: Concept
alternative label: 柏林台（北海道旅客鉄道 根室線）
broader: g000326
in scheme: scheme
notation: 000326
scope note: 運営会社: 北海道旅客鉄道。路線名: 根室線。鉄道区分: 普通鉄道JR（11）。事業者種別: JR在来線（2）。

西帯広
type: Concept
alternative label: 西帯広（北海道旅客鉄道 根室線）
broader: g000327
in scheme: scheme
notation: 000327
scope note: 運営会社: 北海道旅客鉄道。路線名: 根室線。鉄道区分: 普通鉄道JR（11）。事業者種別: JR在来線（2）。

島松
type: Concept
alternative label: 島松（北海道旅客鉄道 千歳線）
broader: g000328
in scheme: scheme
notation: 000328
scope note: 運営会社: 北海道旅客鉄道。路線名: 千歳線。鉄道区分: 普通鉄道JR（11）。事業者種別: JR在来線（2）。

池田
type: Concept
alternative label: 池田（北海道旅客鉄道 根室線）
broader: g000329
in scheme: scheme
notation: 000329
scope note: 運営会社: 北海道旅客鉄道。路線名: 根室線。鉄道区分: 普通鉄道JR（11）。事業者種別: JR在来線（2）。

帯広
type: Concept
alternative label: 帯広（北海道旅客鉄道 根室線）
broader: g000330
in scheme: scheme
notation: 000330
scope note: 運営会社: 北海道旅客鉄道。路線名: 根室線。鉄道区分: 普通鉄道JR（11）。事業者種別: JR在来線（2）。

大成
type: Concept
alternative label: 大成（北海道旅客鉄道 根室線）
broader: g000331
in scheme: scheme
notation: 000331
scope note: 運営会社: 北海道旅客鉄道。路線名: 根室線。鉄道区分: 普通鉄道JR（11）。事業者種別: JR在来線（2）。

川端
type: Concept
alternative label: 川端（北海道旅客鉄道 石勝線）
broader: g000332
in scheme: scheme
notation: 000332
scope note: 運営会社: 北海道旅客鉄道。路線名: 石勝線。鉄道区分: 普通鉄道JR（11）。事業者種別: JR在来線（2）。

札内
type: Concept
alternative label: 札内（北海道旅客鉄道 根室線）
broader: g000333
in scheme: scheme
notation: 000333
scope note: 運営会社: 北海道旅客鉄道。路線名: 根室線。鉄道区分: 普通鉄道JR（11）。事業者種別: JR在来線（2）。

芽室
type: Concept
alternative label: 芽室（北海道旅客鉄道 根室線）
broader: g000335
in scheme: scheme
notation: 000335
scope note: 運営会社: 北海道旅客鉄道。路線名: 根室線。鉄道区分: 普通鉄道JR（11）。事業者種別: JR在来線（2）。

幕別
type: Concept
alternative label: 幕別（北海道旅客鉄道 根室線）
broader: g000336
in scheme: scheme
notation: 000336
scope note: 運営会社: 北海道旅客鉄道。路線名: 根室線。鉄道区分: 普通鉄道JR（11）。事業者種別: JR在来線（2）。

恵み野
type: Concept
alternative label: 恵み野（北海道旅客鉄道 千歳線）
broader: g000337
in scheme: scheme
notation: 000337
scope note: 運営会社: 北海道旅客鉄道。路線名: 千歳線。鉄道区分: 普通鉄道JR（11）。事業者種別: JR在来線（2）。

倶知安
type: Concept
alternative label: 倶知安（北海道旅客鉄道 函館線）
broader: g000338
in scheme: scheme
notation: 000338
scope note: 運営会社: 北海道旅客鉄道。路線名: 函館線。鉄道区分: 普通鉄道JR（11）。事業者種別: JR在来線（2）。

音別
type: Concept
alternative label: 音別（北海道旅客鉄道 根室線）
broader: g000339
in scheme: scheme
notation: 000339
scope note: 運営会社: 北海道旅客鉄道。路線名: 根室線。鉄道区分: 普通鉄道JR（11）。事業者種別: JR在来線（2）。

恵庭
type: Concept
alternative label: 恵庭（北海道旅客鉄道 千歳線）
broader: g000340
in scheme: scheme
notation: 000340
scope note: 運営会社: 北海道旅客鉄道。路線名: 千歳線。鉄道区分: 普通鉄道JR（11）。事業者種別: JR在来線（2）。

追分
type: Concept
alternative label: 追分（北海道旅客鉄道 室蘭線）
broader: g000341
in scheme: scheme
notation: 000341
scope note: 運営会社: 北海道旅客鉄道。路線名: 室蘭線。鉄道区分: 普通鉄道JR（11）。事業者種別: JR在来線（2）。

追分
type: Concept
alternative label: 追分（北海道旅客鉄道 石勝線）
broader: g000341
in scheme: scheme
notation: 000342
scope note: 運営会社: 北海道旅客鉄道。路線名: 石勝線。鉄道区分: 普通鉄道JR（11）。事業者種別: JR在来線（2）。

サッポロビール庭園
type: Concept
alternative label: サッポロビール庭園（北海道旅客鉄道 千歳線）
broader: g000343
in scheme: scheme
notation: 000343
scope note: 運営会社: 北海道旅客鉄道。路線名: 千歳線。鉄道区分: 普通鉄道JR（11）。事業者種別: JR在来線（2）。

十弗
type: Concept
alternative label: 十弗（北海道旅客鉄道 根室線）
broader: g000344
in scheme: scheme
notation: 000344
scope note: 運営会社: 北海道旅客鉄道。路線名: 根室線。鉄道区分: 普通鉄道JR（11）。事業者種別: JR在来線（2）。

長都
type: Concept
alternative label: 長都（北海道旅客鉄道 千歳線）
broader: g000345
in scheme: scheme
notation: 000345
scope note: 運営会社: 北海道旅客鉄道。路線名: 千歳線。鉄道区分: 普通鉄道JR（11）。事業者種別: JR在来線（2）。

比羅夫
type: Concept
alternative label: 比羅夫（北海道旅客鉄道 函館線）
broader: g000346
in scheme: scheme
notation: 000346
scope note: 運営会社: 北海道旅客鉄道。路線名: 函館線。鉄道区分: 普通鉄道JR（11）。事業者種別: JR在来線（2）。

千歳
type: Concept
alternative label: 千歳（北海道旅客鉄道 千歳線）
broader: g000347
in scheme: scheme
notation: 000347
scope note: 運営会社: 北海道旅客鉄道。路線名: 千歳線。鉄道区分: 普通鉄道JR（11）。事業者種別: JR在来線（2）。

豊頃
type: Concept
alternative label: 豊頃（北海道旅客鉄道 根室線）
broader: g000348
in scheme: scheme
notation: 000348
scope note: 運営会社: 北海道旅客鉄道。路線名: 根室線。鉄道区分: 普通鉄道JR（11）。事業者種別: JR在来線（2）。

安平
type: Concept
alternative label: 安平（北海道旅客鉄道 室蘭線）
broader: g000349
in scheme: scheme
notation: 000349
scope note: 運営会社: 北海道旅客鉄道。路線名: 室蘭線。鉄道区分: 普通鉄道JR（11）。事業者種別: JR在来線（2）。

浦幌
type: Concept
alternative label: 浦幌（北海道旅客鉄道 根室線）
broader: g000350
in scheme: scheme
notation: 000350
scope note: 運営会社: 北海道旅客鉄道。路線名: 根室線。鉄道区分: 普通鉄道JR（11）。事業者種別: JR在来線（2）。

厚内
type: Concept
alternative label: 厚内（北海道旅客鉄道 根室線）
broader: g000351
in scheme: scheme
notation: 000351
scope note: 運営会社: 北海道旅客鉄道。路線名: 根室線。鉄道区分: 普通鉄道JR（11）。事業者種別: JR在来線（2）。

ニセコ
type: Concept
alternative label: ニセコ（北海道旅客鉄道 函館線）
broader: g000352
in scheme: scheme
notation: 000352
scope note: 運営会社: 北海道旅客鉄道。路線名: 函館線。鉄道区分: 普通鉄道JR（11）。事業者種別: JR在来線（2）。

南千歳
type: Concept
alternative label: 南千歳（北海道旅客鉄道 石勝線）
broader: g000353
in scheme: scheme
notation: 000353
scope note: 運営会社: 北海道旅客鉄道。路線名: 石勝線。鉄道区分: 普通鉄道JR（11）。事業者種別: JR在来線（2）。

南千歳
type: Concept
alternative label: 南千歳（北海道旅客鉄道 千歳線）
broader: g000353
in scheme: scheme
notation: 000354
scope note: 運営会社: 北海道旅客鉄道。路線名: 千歳線。鉄道区分: 普通鉄道JR（11）。事業者種別: JR在来線（2）。

蘭越
type: Concept
alternative label: 蘭越（北海道旅客鉄道 函館線）
broader: g000355
in scheme: scheme
notation: 000355
scope note: 運営会社: 北海道旅客鉄道。路線名: 函館線。鉄道区分: 普通鉄道JR（11）。事業者種別: JR在来線（2）。

昆布
type: Concept
alternative label: 昆布（北海道旅客鉄道 函館線）
broader: g000356
in scheme: scheme
notation: 000356
scope note: 運営会社: 北海道旅客鉄道。路線名: 函館線。鉄道区分: 普通鉄道JR（11）。事業者種別: JR在来線（2）。

新千歳空港
type: Concept
alternative label: 新千歳空港（北海道旅客鉄道 千歳線）
broader: g000357
in scheme: scheme
notation: 000357
scope note: 運営会社: 北海道旅客鉄道。路線名: 千歳線。鉄道区分: 普通鉄道JR（11）。事業者種別: JR在来線（2）。

新吉野
type: Concept
alternative label: 新吉野（北海道旅客鉄道 根室線）
broader: g000358
in scheme: scheme
notation: 000358
scope note: 運営会社: 北海道旅客鉄道。路線名: 根室線。鉄道区分: 普通鉄道JR（11）。事業者種別: JR在来線（2）。

早来
type: Concept
alternative label: 早来（北海道旅客鉄道 室蘭線）
broader: g000359
in scheme: scheme
notation: 000359
scope note: 運営会社: 北海道旅客鉄道。路線名: 室蘭線。鉄道区分: 普通鉄道JR（11）。事業者種別: JR在来線（2）。

目名
type: Concept
alternative label: 目名（北海道旅客鉄道 函館線）
broader: g000360
in scheme: scheme
notation: 000360
scope note: 運営会社: 北海道旅客鉄道。路線名: 函館線。鉄道区分: 普通鉄道JR（11）。事業者種別: JR在来線（2）。

遠浅
type: Concept
alternative label: 遠浅（北海道旅客鉄道 室蘭線）
broader: g000361
in scheme: scheme
notation: 000361
scope note: 運営会社: 北海道旅客鉄道。路線名: 室蘭線。鉄道区分: 普通鉄道JR（11）。事業者種別: JR在来線（2）。

植苗
type: Concept
alternative label: 植苗（北海道旅客鉄道 千歳線）
broader: g000362
in scheme: scheme
notation: 000362
scope note: 運営会社: 北海道旅客鉄道。路線名: 千歳線。鉄道区分: 普通鉄道JR（11）。事業者種別: JR在来線（2）。

熱郛
type: Concept
alternative label: 熱郛（北海道旅客鉄道 函館線）
broader: g000363
in scheme: scheme
notation: 000363
scope note: 運営会社: 北海道旅客鉄道。路線名: 函館線。鉄道区分: 普通鉄道JR（11）。事業者種別: JR在来線（2）。

沼ノ端
type: Concept
alternative label: 沼ノ端（北海道旅客鉄道 室蘭線）
broader: g000364
in scheme: scheme
notation: 000364
scope note: 運営会社: 北海道旅客鉄道。路線名: 室蘭線。鉄道区分: 普通鉄道JR（11）。事業者種別: JR在来線（2）。

沼ノ端
type: Concept
alternative label: 沼ノ端（北海道旅客鉄道 千歳線）
broader: g000364
in scheme: scheme
notation: 000365
scope note: 運営会社: 北海道旅客鉄道。路線名: 千歳線。鉄道区分: 普通鉄道JR（11）。事業者種別: JR在来線（2）。

黒松内
type: Concept
alternative label: 黒松内（北海道旅客鉄道 函館線）
broader: g000366
in scheme: scheme
notation: 000366
scope note: 運営会社: 北海道旅客鉄道。路線名: 函館線。鉄道区分: 普通鉄道JR（11）。事業者種別: JR在来線（2）。

苫小牧
type: Concept
alternative label: 苫小牧（北海道旅客鉄道 室蘭線）
broader: g000367
in scheme: scheme
notation: 000367
scope note: 運営会社: 北海道旅客鉄道。路線名: 室蘭線。鉄道区分: 普通鉄道JR（11）。事業者種別: JR在来線（2）。

苫小牧
type: Concept
alternative label: 苫小牧（北海道旅客鉄道 日高線）
broader: g000367
in scheme: scheme
notation: 000368
scope note: 運営会社: 北海道旅客鉄道。路線名: 日高線。鉄道区分: 普通鉄道JR（11）。事業者種別: JR在来線（2）。

勇払
type: Concept
alternative label: 勇払（北海道旅客鉄道 日高線）
broader: g000369
in scheme: scheme
notation: 000369
scope note: 運営会社: 北海道旅客鉄道。路線名: 日高線。鉄道区分: 普通鉄道JR（11）。事業者種別: JR在来線（2）。

青葉
type: Concept
alternative label: 青葉（北海道旅客鉄道 室蘭線）
broader: g000370
in scheme: scheme
notation: 000370
scope note: 運営会社: 北海道旅客鉄道。路線名: 室蘭線。鉄道区分: 普通鉄道JR（11）。事業者種別: JR在来線（2）。

糸井
type: Concept
alternative label: 糸井（北海道旅客鉄道 室蘭線）
broader: g000371
in scheme: scheme
notation: 000371
scope note: 運営会社: 北海道旅客鉄道。路線名: 室蘭線。鉄道区分: 普通鉄道JR（11）。事業者種別: JR在来線（2）。

浜厚真
type: Concept
alternative label: 浜厚真（北海道旅客鉄道 日高線）
broader: g000372
in scheme: scheme
notation: 000372
scope note: 運営会社: 北海道旅客鉄道。路線名: 日高線。鉄道区分: 普通鉄道JR（11）。事業者種別: JR在来線（2）。

錦岡
type: Concept
alternative label: 錦岡（北海道旅客鉄道 室蘭線）
broader: g000373
in scheme: scheme
notation: 000373
scope note: 運営会社: 北海道旅客鉄道。路線名: 室蘭線。鉄道区分: 普通鉄道JR（11）。事業者種別: JR在来線（2）。

小幌
type: Concept
alternative label: 小幌（北海道旅客鉄道 室蘭線）
broader: g000375
in scheme: scheme
notation: 000375
scope note: 運営会社: 北海道旅客鉄道。路線名: 室蘭線。鉄道区分: 普通鉄道JR（11）。事業者種別: JR在来線（2）。

大岸
type: Concept
alternative label: 大岸（北海道旅客鉄道 室蘭線）
broader: g000376
in scheme: scheme
notation: 000376
scope note: 運営会社: 北海道旅客鉄道。路線名: 室蘭線。鉄道区分: 普通鉄道JR（11）。事業者種別: JR在来線（2）。

静狩
type: Concept
alternative label: 静狩（北海道旅客鉄道 室蘭線）
broader: g000377
in scheme: scheme
notation: 000377
scope note: 運営会社: 北海道旅客鉄道。路線名: 室蘭線。鉄道区分: 普通鉄道JR（11）。事業者種別: JR在来線（2）。

礼文
type: Concept
alternative label: 礼文（北海道旅客鉄道 室蘭線）
broader: g000378
in scheme: scheme
notation: 000378
scope note: 運営会社: 北海道旅客鉄道。路線名: 室蘭線。鉄道区分: 普通鉄道JR（11）。事業者種別: JR在来線（2）。

豊浦
type: Concept
alternative label: 豊浦（北海道旅客鉄道 室蘭線）
broader: g000379
in scheme: scheme
notation: 000379
scope note: 運営会社: 北海道旅客鉄道。路線名: 室蘭線。鉄道区分: 普通鉄道JR（11）。事業者種別: JR在来線（2）。

社台
type: Concept
alternative label: 社台（北海道旅客鉄道 室蘭線）
broader: g000380
in scheme: scheme
notation: 000380
scope note: 運営会社: 北海道旅客鉄道。路線名: 室蘭線。鉄道区分: 普通鉄道JR（11）。事業者種別: JR在来線（2）。

鵡川
type: Concept
alternative label: 鵡川（北海道旅客鉄道 日高線）
broader: g000381
in scheme: scheme
notation: 000381
scope note: 運営会社: 北海道旅客鉄道。路線名: 日高線。鉄道区分: 普通鉄道JR（11）。事業者種別: JR在来線（2）。

二股
type: Concept
alternative label: 二股（北海道旅客鉄道 函館線）
broader: g000382
in scheme: scheme
notation: 000382
scope note: 運営会社: 北海道旅客鉄道。路線名: 函館線。鉄道区分: 普通鉄道JR（11）。事業者種別: JR在来線（2）。

白老
type: Concept
alternative label: 白老（北海道旅客鉄道 室蘭線）
broader: g000383
in scheme: scheme
notation: 000383
scope note: 運営会社: 北海道旅客鉄道。路線名: 室蘭線。鉄道区分: 普通鉄道JR（11）。事業者種別: JR在来線（2）。

洞爺
type: Concept
alternative label: 洞爺（北海道旅客鉄道 室蘭線）
broader: g000384
in scheme: scheme
notation: 000384
scope note: 運営会社: 北海道旅客鉄道。路線名: 室蘭線。鉄道区分: 普通鉄道JR（11）。事業者種別: JR在来線（2）。

萩野
type: Concept
alternative label: 萩野（北海道旅客鉄道 室蘭線）
broader: g000385
in scheme: scheme
notation: 000385
scope note: 運営会社: 北海道旅客鉄道。路線名: 室蘭線。鉄道区分: 普通鉄道JR（11）。事業者種別: JR在来線（2）。

有珠
type: Concept
alternative label: 有珠（北海道旅客鉄道 室蘭線）
broader: g000386
in scheme: scheme
notation: 000386
scope note: 運営会社: 北海道旅客鉄道。路線名: 室蘭線。鉄道区分: 普通鉄道JR（11）。事業者種別: JR在来線（2）。

長万部
type: Concept
alternative label: 長万部（北海道旅客鉄道 室蘭線）
broader: g000387
in scheme: scheme
notation: 000387
scope note: 運営会社: 北海道旅客鉄道。路線名: 室蘭線。鉄道区分: 普通鉄道JR（11）。事業者種別: JR在来線（2）。

長万部
type: Concept
alternative label: 長万部（北海道旅客鉄道 函館線）
broader: g000387
in scheme: scheme
notation: 000388
scope note: 運営会社: 北海道旅客鉄道。路線名: 函館線。鉄道区分: 普通鉄道JR（11）。事業者種別: JR在来線（2）。

北吉原
type: Concept
alternative label: 北吉原（北海道旅客鉄道 室蘭線）
broader: g000389
in scheme: scheme
notation: 000389
scope note: 運営会社: 北海道旅客鉄道。路線名: 室蘭線。鉄道区分: 普通鉄道JR（11）。事業者種別: JR在来線（2）。

竹浦
type: Concept
alternative label: 竹浦（北海道旅客鉄道 室蘭線）
broader: g000390
in scheme: scheme
notation: 000390
scope note: 運営会社: 北海道旅客鉄道。路線名: 室蘭線。鉄道区分: 普通鉄道JR（11）。事業者種別: JR在来線（2）。

長和
type: Concept
alternative label: 長和（北海道旅客鉄道 室蘭線）
broader: g000391
in scheme: scheme
notation: 000391
scope note: 運営会社: 北海道旅客鉄道。路線名: 室蘭線。鉄道区分: 普通鉄道JR（11）。事業者種別: JR在来線（2）。

伊達紋別
type: Concept
alternative label: 伊達紋別（北海道旅客鉄道 室蘭線）
broader: g000393
in scheme: scheme
notation: 000393
scope note: 運営会社: 北海道旅客鉄道。路線名: 室蘭線。鉄道区分: 普通鉄道JR（11）。事業者種別: JR在来線（2）。

虎杖浜
type: Concept
alternative label: 虎杖浜（北海道旅客鉄道 室蘭線）
broader: g000394
in scheme: scheme
notation: 000394
scope note: 運営会社: 北海道旅客鉄道。路線名: 室蘭線。鉄道区分: 普通鉄道JR（11）。事業者種別: JR在来線（2）。

登別
type: Concept
alternative label: 登別（北海道旅客鉄道 室蘭線）
broader: g000395
in scheme: scheme
notation: 000395
scope note: 運営会社: 北海道旅客鉄道。路線名: 室蘭線。鉄道区分: 普通鉄道JR（11）。事業者種別: JR在来線（2）。

北舟岡
type: Concept
alternative label: 北舟岡（北海道旅客鉄道 室蘭線）
broader: g000396
in scheme: scheme
notation: 000396
scope note: 運営会社: 北海道旅客鉄道。路線名: 室蘭線。鉄道区分: 普通鉄道JR（11）。事業者種別: JR在来線（2）。

富浦
type: Concept
alternative label: 富浦（北海道旅客鉄道 室蘭線）
broader: g000397
in scheme: scheme
notation: 000397
scope note: 運営会社: 北海道旅客鉄道。路線名: 室蘭線。鉄道区分: 普通鉄道JR（11）。事業者種別: JR在来線（2）。

国縫
type: Concept
alternative label: 国縫（北海道旅客鉄道 函館線）
broader: g000398
in scheme: scheme
notation: 000398
scope note: 運営会社: 北海道旅客鉄道。路線名: 函館線。鉄道区分: 普通鉄道JR（11）。事業者種別: JR在来線（2）。

稀府
type: Concept
alternative label: 稀府（北海道旅客鉄道 室蘭線）
broader: g000399
in scheme: scheme
notation: 000399
scope note: 運営会社: 北海道旅客鉄道。路線名: 室蘭線。鉄道区分: 普通鉄道JR（11）。事業者種別: JR在来線（2）。

幌別
type: Concept
alternative label: 幌別（北海道旅客鉄道 室蘭線）
broader: g000400
in scheme: scheme
notation: 000400
scope note: 運営会社: 北海道旅客鉄道。路線名: 室蘭線。鉄道区分: 普通鉄道JR（11）。事業者種別: JR在来線（2）。

黄金
type: Concept
alternative label: 黄金（北海道旅客鉄道 室蘭線）
broader: g000401
in scheme: scheme
notation: 000401
scope note: 運営会社: 北海道旅客鉄道。路線名: 室蘭線。鉄道区分: 普通鉄道JR（11）。事業者種別: JR在来線（2）。

崎守
type: Concept
alternative label: 崎守（北海道旅客鉄道 室蘭線）
broader: g000402
in scheme: scheme
notation: 000402
scope note: 運営会社: 北海道旅客鉄道。路線名: 室蘭線。鉄道区分: 普通鉄道JR（11）。事業者種別: JR在来線（2）。

黒岩
type: Concept
alternative label: 黒岩（北海道旅客鉄道 函館線）
broader: g000403
in scheme: scheme
notation: 000403
scope note: 運営会社: 北海道旅客鉄道。路線名: 函館線。鉄道区分: 普通鉄道JR（11）。事業者種別: JR在来線（2）。

鷲別
type: Concept
alternative label: 鷲別（北海道旅客鉄道 室蘭線）
broader: g000404
in scheme: scheme
notation: 000404
scope note: 運営会社: 北海道旅客鉄道。路線名: 室蘭線。鉄道区分: 普通鉄道JR（11）。事業者種別: JR在来線（2）。

本輪西
type: Concept
alternative label: 本輪西（北海道旅客鉄道 室蘭線）
broader: g000405
in scheme: scheme
notation: 000405
scope note: 運営会社: 北海道旅客鉄道。路線名: 室蘭線。鉄道区分: 普通鉄道JR（11）。事業者種別: JR在来線（2）。

東室蘭
type: Concept
alternative label: 東室蘭（北海道旅客鉄道 室蘭線）
broader: g000406
in scheme: scheme
notation: 000406
scope note: 運営会社: 北海道旅客鉄道。路線名: 室蘭線。鉄道区分: 普通鉄道JR（11）。事業者種別: JR在来線（2）。

輪西
type: Concept
alternative label: 輪西（北海道旅客鉄道 室蘭線）
broader: g000407
in scheme: scheme
notation: 000407
scope note: 運営会社: 北海道旅客鉄道。路線名: 室蘭線。鉄道区分: 普通鉄道JR（11）。事業者種別: JR在来線（2）。

御崎
type: Concept
alternative label: 御崎（北海道旅客鉄道 室蘭線）
broader: g000408
in scheme: scheme
notation: 000408
scope note: 運営会社: 北海道旅客鉄道。路線名: 室蘭線。鉄道区分: 普通鉄道JR（11）。事業者種別: JR在来線（2）。

室蘭
type: Concept
alternative label: 室蘭（北海道旅客鉄道 室蘭線）
broader: g000409
in scheme: scheme
notation: 000409
scope note: 運営会社: 北海道旅客鉄道。路線名: 室蘭線。鉄道区分: 普通鉄道JR（11）。事業者種別: JR在来線（2）。

母恋
type: Concept
alternative label: 母恋（北海道旅客鉄道 室蘭線）
broader: g000410
in scheme: scheme
notation: 000410
scope note: 運営会社: 北海道旅客鉄道。路線名: 室蘭線。鉄道区分: 普通鉄道JR（11）。事業者種別: JR在来線（2）。

山崎
type: Concept
alternative label: 山崎（北海道旅客鉄道 函館線）
broader: g000411
in scheme: scheme
notation: 000411
scope note: 運営会社: 北海道旅客鉄道。路線名: 函館線。鉄道区分: 普通鉄道JR（11）。事業者種別: JR在来線（2）。

八雲
type: Concept
alternative label: 八雲（北海道旅客鉄道 函館線）
broader: g000412
in scheme: scheme
notation: 000412
scope note: 運営会社: 北海道旅客鉄道。路線名: 函館線。鉄道区分: 普通鉄道JR（11）。事業者種別: JR在来線（2）。

山越
type: Concept
alternative label: 山越（北海道旅客鉄道 函館線）
broader: g000413
in scheme: scheme
notation: 000413
scope note: 運営会社: 北海道旅客鉄道。路線名: 函館線。鉄道区分: 普通鉄道JR（11）。事業者種別: JR在来線（2）。

野田生
type: Concept
alternative label: 野田生（北海道旅客鉄道 函館線）
broader: g000414
in scheme: scheme
notation: 000414
scope note: 運営会社: 北海道旅客鉄道。路線名: 函館線。鉄道区分: 普通鉄道JR（11）。事業者種別: JR在来線（2）。

落部
type: Concept
alternative label: 落部（北海道旅客鉄道 函館線）
broader: g000415
in scheme: scheme
notation: 000415
scope note: 運営会社: 北海道旅客鉄道。路線名: 函館線。鉄道区分: 普通鉄道JR（11）。事業者種別: JR在来線（2）。

石倉
type: Concept
alternative label: 石倉（北海道旅客鉄道 函館線）
broader: g000416
in scheme: scheme
notation: 000416
scope note: 運営会社: 北海道旅客鉄道。路線名: 函館線。鉄道区分: 普通鉄道JR（11）。事業者種別: JR在来線（2）。

渡島砂原
type: Concept
alternative label: 渡島砂原（北海道旅客鉄道 函館線）
broader: g000417
in scheme: scheme
notation: 000417
scope note: 運営会社: 北海道旅客鉄道。路線名: 函館線。鉄道区分: 普通鉄道JR（11）。事業者種別: JR在来線（2）。

掛澗
type: Concept
alternative label: 掛澗（北海道旅客鉄道 函館線）
broader: g000418
in scheme: scheme
notation: 000418
scope note: 運営会社: 北海道旅客鉄道。路線名: 函館線。鉄道区分: 普通鉄道JR（11）。事業者種別: JR在来線（2）。

尾白内
type: Concept
alternative label: 尾白内（北海道旅客鉄道 函館線）
broader: g000419
in scheme: scheme
notation: 000419
scope note: 運営会社: 北海道旅客鉄道。路線名: 函館線。鉄道区分: 普通鉄道JR（11）。事業者種別: JR在来線（2）。

森
type: Concept
alternative label: 森（北海道旅客鉄道 函館線）
broader: g000420
in scheme: scheme
notation: 000420
scope note: 運営会社: 北海道旅客鉄道。路線名: 函館線。鉄道区分: 普通鉄道JR（11）。事業者種別: JR在来線（2）。

渡島沼尻
type: Concept
alternative label: 渡島沼尻（北海道旅客鉄道 函館線）
broader: g000421
in scheme: scheme
notation: 000421
scope note: 運営会社: 北海道旅客鉄道。路線名: 函館線。鉄道区分: 普通鉄道JR（11）。事業者種別: JR在来線（2）。

東森
type: Concept
alternative label: 東森（北海道旅客鉄道 函館線）
broader: g000422
in scheme: scheme
notation: 000422
scope note: 運営会社: 北海道旅客鉄道。路線名: 函館線。鉄道区分: 普通鉄道JR（11）。事業者種別: JR在来線（2）。

鹿部
type: Concept
alternative label: 鹿部（北海道旅客鉄道 函館線）
broader: g000423
in scheme: scheme
notation: 000423
scope note: 運営会社: 北海道旅客鉄道。路線名: 函館線。鉄道区分: 普通鉄道JR（11）。事業者種別: JR在来線（2）。

駒ヶ岳
type: Concept
alternative label: 駒ヶ岳（北海道旅客鉄道 函館線）
broader: g000424
in scheme: scheme
notation: 000424
scope note: 運営会社: 北海道旅客鉄道。路線名: 函館線。鉄道区分: 普通鉄道JR（11）。事業者種別: JR在来線（2）。

赤井川
type: Concept
alternative label: 赤井川（北海道旅客鉄道 函館線）
broader: g000425
in scheme: scheme
notation: 000425
scope note: 運営会社: 北海道旅客鉄道。路線名: 函館線。鉄道区分: 普通鉄道JR（11）。事業者種別: JR在来線（2）。

大沼公園
type: Concept
alternative label: 大沼公園（北海道旅客鉄道 函館線）
broader: g000426
in scheme: scheme
notation: 000426
scope note: 運営会社: 北海道旅客鉄道。路線名: 函館線。鉄道区分: 普通鉄道JR（11）。事業者種別: JR在来線（2）。

大沼
type: Concept
alternative label: 大沼（北海道旅客鉄道 函館線）
broader: g000427
in scheme: scheme
notation: 000427
scope note: 運営会社: 北海道旅客鉄道。路線名: 函館線。鉄道区分: 普通鉄道JR（11）。事業者種別: JR在来線（2）。

仁山
type: Concept
alternative label: 仁山（北海道旅客鉄道 函館線）
broader: g000428
in scheme: scheme
notation: 000428
scope note: 運営会社: 北海道旅客鉄道。路線名: 函館線。鉄道区分: 普通鉄道JR（11）。事業者種別: JR在来線（2）。

新函館北斗
type: Concept
alternative label: 新函館北斗（北海道旅客鉄道 函館線）
broader: g000429
in scheme: scheme
notation: 000429
scope note: 運営会社: 北海道旅客鉄道。路線名: 函館線。鉄道区分: 普通鉄道JR（11）。事業者種別: JR在来線（2）。

新函館北斗
type: Concept
alternative label: 新函館北斗（北海道旅客鉄道 北海道新幹線）
broader: g000429
in scheme: scheme
notation: 000430
scope note: 運営会社: 北海道旅客鉄道。路線名: 北海道新幹線。鉄道区分: 普通鉄道JR（11）。事業者種別: JRの新幹線（1）。

七飯
type: Concept
alternative label: 七飯（北海道旅客鉄道 函館線）
broader: g000431
in scheme: scheme
notation: 000431
scope note: 運営会社: 北海道旅客鉄道。路線名: 函館線。鉄道区分: 普通鉄道JR（11）。事業者種別: JR在来線（2）。

大中山
type: Concept
alternative label: 大中山（北海道旅客鉄道 函館線）
broader: g000432
in scheme: scheme
notation: 000432
scope note: 運営会社: 北海道旅客鉄道。路線名: 函館線。鉄道区分: 普通鉄道JR（11）。事業者種別: JR在来線（2）。

桔梗
type: Concept
alternative label: 桔梗（北海道旅客鉄道 函館線）
broader: g000433
in scheme: scheme
notation: 000433
scope note: 運営会社: 北海道旅客鉄道。路線名: 函館線。鉄道区分: 普通鉄道JR（11）。事業者種別: JR在来線（2）。

久根別
type: Concept
alternative label: 久根別（道南いさりび鉄道 道南いさりび鉄道線）
broader: g000434
in scheme: scheme
notation: 000434
scope note: 運営会社: 道南いさりび鉄道。路線名: 道南いさりび鉄道線。鉄道区分: 普通鉄道（12）。事業者種別: 第三セクター（5）。

東久根別
type: Concept
alternative label: 東久根別（道南いさりび鉄道 道南いさりび鉄道線）
broader: g000435
in scheme: scheme
notation: 000435
scope note: 運営会社: 道南いさりび鉄道。路線名: 道南いさりび鉄道線。鉄道区分: 普通鉄道（12）。事業者種別: 第三セクター（5）。

清川口
type: Concept
alternative label: 清川口（道南いさりび鉄道 道南いさりび鉄道線）
broader: g000436
in scheme: scheme
notation: 000436
scope note: 運営会社: 道南いさりび鉄道。路線名: 道南いさりび鉄道線。鉄道区分: 普通鉄道（12）。事業者種別: 第三セクター（5）。

上磯
type: Concept
alternative label: 上磯（道南いさりび鉄道 道南いさりび鉄道線）
broader: g000437
in scheme: scheme
notation: 000437
scope note: 運営会社: 道南いさりび鉄道。路線名: 道南いさりび鉄道線。鉄道区分: 普通鉄道（12）。事業者種別: 第三セクター（5）。

七重浜
type: Concept
alternative label: 七重浜（道南いさりび鉄道 道南いさりび鉄道線）
broader: g000438
in scheme: scheme
notation: 000438
scope note: 運営会社: 道南いさりび鉄道。路線名: 道南いさりび鉄道線。鉄道区分: 普通鉄道（12）。事業者種別: 第三セクター（5）。

五稜郭
type: Concept
alternative label: 五稜郭（北海道旅客鉄道 函館線）
broader: g000439
in scheme: scheme
notation: 000439
scope note: 運営会社: 北海道旅客鉄道。路線名: 函館線。鉄道区分: 普通鉄道JR（11）。事業者種別: JR在来線（2）。

五稜郭
type: Concept
alternative label: 五稜郭（道南いさりび鉄道 道南いさりび鉄道線）
broader: g000439
in scheme: scheme
notation: 000440
scope note: 運営会社: 道南いさりび鉄道。路線名: 道南いさりび鉄道線。鉄道区分: 普通鉄道（12）。事業者種別: 第三セクター（5）。

五稜郭公園前
type: Concept
alternative label: 五稜郭公園前（函館市 湯の川線）
broader: g000441
in scheme: scheme
notation: 000441
scope note: 運営会社: 函館市。路線名: 湯の川線。鉄道区分: 軌道（21）。事業者種別: 公営鉄道（3）。

杉並町
type: Concept
alternative label: 杉並町（函館市 湯の川線）
broader: g000442
in scheme: scheme
notation: 000442
scope note: 運営会社: 函館市。路線名: 湯の川線。鉄道区分: 軌道（21）。事業者種別: 公営鉄道（3）。

柏木町
type: Concept
alternative label: 柏木町（函館市 湯の川線）
broader: g000443
in scheme: scheme
notation: 000443
scope note: 運営会社: 函館市。路線名: 湯の川線。鉄道区分: 軌道（21）。事業者種別: 公営鉄道（3）。

深堀町
type: Concept
alternative label: 深堀町（函館市 湯の川線）
broader: g000444
in scheme: scheme
notation: 000444
scope note: 運営会社: 函館市。路線名: 湯の川線。鉄道区分: 軌道（21）。事業者種別: 公営鉄道（3）。

中央病院前
type: Concept
alternative label: 中央病院前（函館市 湯の川線）
broader: g000445
in scheme: scheme
notation: 000445
scope note: 運営会社: 函館市。路線名: 湯の川線。鉄道区分: 軌道（21）。事業者種別: 公営鉄道（3）。

競馬場前
type: Concept
alternative label: 競馬場前（函館市 湯の川線）
broader: g000446
in scheme: scheme
notation: 000446
scope note: 運営会社: 函館市。路線名: 湯の川線。鉄道区分: 軌道（21）。事業者種別: 公営鉄道（3）。

千代台
type: Concept
alternative label: 千代台（函館市 湯の川線）
broader: g000447
in scheme: scheme
notation: 000447
scope note: 運営会社: 函館市。路線名: 湯の川線。鉄道区分: 軌道（21）。事業者種別: 公営鉄道（3）。

駒場車庫前
type: Concept
alternative label: 駒場車庫前（函館市 湯の川線）
broader: g000448
in scheme: scheme
notation: 000448
scope note: 運営会社: 函館市。路線名: 湯の川線。鉄道区分: 軌道（21）。事業者種別: 公営鉄道（3）。

函館アリーナ前
type: Concept
alternative label: 函館アリーナ前（函館市 湯の川線）
broader: g000449
in scheme: scheme
notation: 000449
scope note: 運営会社: 函館市。路線名: 湯の川線。鉄道区分: 軌道（21）。事業者種別: 公営鉄道（3）。

湯の川
type: Concept
alternative label: 湯の川（函館市 湯の川線）
broader: g000450
in scheme: scheme
notation: 000450
scope note: 運営会社: 函館市。路線名: 湯の川線。鉄道区分: 軌道（21）。事業者種別: 公営鉄道（3）。

堀川町
type: Concept
alternative label: 堀川町（函館市 湯の川線）
broader: g000451
in scheme: scheme
notation: 000451
scope note: 運営会社: 函館市。路線名: 湯の川線。鉄道区分: 軌道（21）。事業者種別: 公営鉄道（3）。

湯の川温泉
type: Concept
alternative label: 湯の川温泉（函館市 湯の川線）
broader: g000452
in scheme: scheme
notation: 000452
scope note: 運営会社: 函館市。路線名: 湯の川線。鉄道区分: 軌道（21）。事業者種別: 公営鉄道（3）。

昭和橋
type: Concept
alternative label: 昭和橋（函館市 湯の川線）
broader: g000453
in scheme: scheme
notation: 000453
scope note: 運営会社: 函館市。路線名: 湯の川線。鉄道区分: 軌道（21）。事業者種別: 公営鉄道（3）。

千歳町
type: Concept
alternative label: 千歳町（函館市 湯の川線）
broader: g000454
in scheme: scheme
notation: 000454
scope note: 運営会社: 函館市。路線名: 湯の川線。鉄道区分: 軌道（21）。事業者種別: 公営鉄道（3）。

函館
type: Concept
alternative label: 函館（北海道旅客鉄道 函館線）
broader: g000455
in scheme: scheme
notation: 000455
scope note: 運営会社: 北海道旅客鉄道。路線名: 函館線。鉄道区分: 普通鉄道JR（11）。事業者種別: JR在来線（2）。

新川町
type: Concept
alternative label: 新川町（函館市 湯の川線）
broader: g000456
in scheme: scheme
notation: 000456
scope note: 運営会社: 函館市。路線名: 湯の川線。鉄道区分: 軌道（21）。事業者種別: 公営鉄道（3）。

函館どつく前
type: Concept
alternative label: 函館どつく前（函館市 本線）
broader: g000457
in scheme: scheme
notation: 000457
scope note: 運営会社: 函館市。路線名: 本線。鉄道区分: 軌道（21）。事業者種別: 公営鉄道（3）。

函館駅前
type: Concept
alternative label: 函館駅前（函館市 大森線）
broader: g000458
in scheme: scheme
notation: 000458
scope note: 運営会社: 函館市。路線名: 大森線。鉄道区分: 軌道（21）。事業者種別: 公営鉄道（3）。

函館駅前
type: Concept
alternative label: 函館駅前（函館市 本線）
broader: g000458
in scheme: scheme
notation: 000459
scope note: 運営会社: 函館市。路線名: 本線。鉄道区分: 軌道（21）。事業者種別: 公営鉄道（3）。

松風町
type: Concept
alternative label: 松風町（函館市 大森線）
broader: g000460
in scheme: scheme
notation: 000460
scope note: 運営会社: 函館市。路線名: 大森線。鉄道区分: 軌道（21）。事業者種別: 公営鉄道（3）。

松風町
type: Concept
alternative label: 松風町（函館市 湯の川線）
broader: g000460
in scheme: scheme
notation: 000461
scope note: 運営会社: 函館市。路線名: 湯の川線。鉄道区分: 軌道（21）。事業者種別: 公営鉄道（3）。

大町
type: Concept
alternative label: 大町（函館市 本線）
broader: g000462
in scheme: scheme
notation: 000462
scope note: 運営会社: 函館市。路線名: 本線。鉄道区分: 軌道（21）。事業者種別: 公営鉄道（3）。

市役所前
type: Concept
alternative label: 市役所前（函館市 本線）
broader: g000463
in scheme: scheme
notation: 000463
scope note: 運営会社: 函館市。路線名: 本線。鉄道区分: 軌道（21）。事業者種別: 公営鉄道（3）。

末広町
type: Concept
alternative label: 末広町（函館市 本線）
broader: g000464
in scheme: scheme
notation: 000464
scope note: 運営会社: 函館市。路線名: 本線。鉄道区分: 軌道（21）。事業者種別: 公営鉄道（3）。

茂辺地
type: Concept
alternative label: 茂辺地（道南いさりび鉄道 道南いさりび鉄道線）
broader: g000465
in scheme: scheme
notation: 000465
scope note: 運営会社: 道南いさりび鉄道。路線名: 道南いさりび鉄道線。鉄道区分: 普通鉄道（12）。事業者種別: 第三セクター（5）。

魚市場通
type: Concept
alternative label: 魚市場通（函館市 本線）
broader: g000466
in scheme: scheme
notation: 000466
scope note: 運営会社: 函館市。路線名: 本線。鉄道区分: 軌道（21）。事業者種別: 公営鉄道（3）。

十字街
type: Concept
alternative label: 十字街（函館市 宝来・谷地頭線）
broader: g000467
in scheme: scheme
notation: 000467
scope note: 運営会社: 函館市。路線名: 宝来・谷地頭線。鉄道区分: 軌道（21）。事業者種別: 公営鉄道（3）。

十字街
type: Concept
alternative label: 十字街（函館市 本線）
broader: g000467
in scheme: scheme
notation: 000468
scope note: 運営会社: 函館市。路線名: 本線。鉄道区分: 軌道（21）。事業者種別: 公営鉄道（3）。

宝来町
type: Concept
alternative label: 宝来町（函館市 宝来・谷地頭線）
broader: g000469
in scheme: scheme
notation: 000469
scope note: 運営会社: 函館市。路線名: 宝来・谷地頭線。鉄道区分: 軌道（21）。事業者種別: 公営鉄道（3）。

青柳町
type: Concept
alternative label: 青柳町（函館市 宝来・谷地頭線）
broader: g000470
in scheme: scheme
notation: 000470
scope note: 運営会社: 函館市。路線名: 宝来・谷地頭線。鉄道区分: 軌道（21）。事業者種別: 公営鉄道（3）。

谷地頭
type: Concept
alternative label: 谷地頭（函館市 宝来・谷地頭線）
broader: g000471
in scheme: scheme
notation: 000471
scope note: 運営会社: 函館市。路線名: 宝来・谷地頭線。鉄道区分: 軌道（21）。事業者種別: 公営鉄道（3）。

渡島当別
type: Concept
alternative label: 渡島当別（道南いさりび鉄道 道南いさりび鉄道線）
broader: g000472
in scheme: scheme
notation: 000472
scope note: 運営会社: 道南いさりび鉄道。路線名: 道南いさりび鉄道線。鉄道区分: 普通鉄道（12）。事業者種別: 第三セクター（5）。

釜谷
type: Concept
alternative label: 釜谷（道南いさりび鉄道 道南いさりび鉄道線）
broader: g000473
in scheme: scheme
notation: 000473
scope note: 運営会社: 道南いさりび鉄道。路線名: 道南いさりび鉄道線。鉄道区分: 普通鉄道（12）。事業者種別: 第三セクター（5）。

泉沢
type: Concept
alternative label: 泉沢（道南いさりび鉄道 道南いさりび鉄道線）
broader: g000474
in scheme: scheme
notation: 000474
scope note: 運営会社: 道南いさりび鉄道。路線名: 道南いさりび鉄道線。鉄道区分: 普通鉄道（12）。事業者種別: 第三セクター（5）。

札苅
type: Concept
alternative label: 札苅（道南いさりび鉄道 道南いさりび鉄道線）
broader: g000475
in scheme: scheme
notation: 000475
scope note: 運営会社: 道南いさりび鉄道。路線名: 道南いさりび鉄道線。鉄道区分: 普通鉄道（12）。事業者種別: 第三セクター（5）。

木古内
type: Concept
alternative label: 木古内（北海道旅客鉄道 北海道新幹線）
broader: g000477
in scheme: scheme
notation: 000476
scope note: 運営会社: 北海道旅客鉄道。路線名: 北海道新幹線。鉄道区分: 普通鉄道JR（11）。事業者種別: JRの新幹線（1）。

木古内
type: Concept
alternative label: 木古内（北海道旅客鉄道 海峡線）
broader: g000477
in scheme: scheme
notation: 000477
scope note: 運営会社: 北海道旅客鉄道。路線名: 海峡線。鉄道区分: 普通鉄道JR（11）。事業者種別: JR在来線（2）。

木古内
type: Concept
alternative label: 木古内（道南いさりび鉄道 道南いさりび鉄道線）
broader: g000477
in scheme: scheme
notation: 000478
scope note: 運営会社: 道南いさりび鉄道。路線名: 道南いさりび鉄道線。鉄道区分: 普通鉄道（12）。事業者種別: 第三セクター（5）。

下北
type: Concept
alternative label: 下北（東日本旅客鉄道 大湊線）
broader: g000479
in scheme: scheme
notation: 000479
scope note: 運営会社: 東日本旅客鉄道。路線名: 大湊線。鉄道区分: 普通鉄道JR（11）。事業者種別: JR在来線（2）。

大湊
type: Concept
alternative label: 大湊（東日本旅客鉄道 大湊線）
broader: g000480
in scheme: scheme
notation: 000480
scope note: 運営会社: 東日本旅客鉄道。路線名: 大湊線。鉄道区分: 普通鉄道JR（11）。事業者種別: JR在来線（2）。

赤川
type: Concept
alternative label: 赤川（東日本旅客鉄道 大湊線）
broader: g000481
in scheme: scheme
notation: 000481
scope note: 運営会社: 東日本旅客鉄道。路線名: 大湊線。鉄道区分: 普通鉄道JR（11）。事業者種別: JR在来線（2）。

体験坑道
type: Concept
alternative label: 体験坑道（一般財団法人青函トンネル記念館 青函トンネル竜飛斜坑線）
broader: g000482
in scheme: scheme
notation: 000482
scope note: 運営会社: 一般財団法人青函トンネル記念館。路線名: 青函トンネル竜飛斜坑線。鉄道区分: 鋼索鉄道（13）。事業者種別: 民営鉄道（4）。

青函トンネル記念館
type: Concept
alternative label: 青函トンネル記念館（一般財団法人青函トンネル記念館 青函トンネル竜飛斜坑線）
broader: g000483
in scheme: scheme
notation: 000483
scope note: 運営会社: 一般財団法人青函トンネル記念館。路線名: 青函トンネル竜飛斜坑線。鉄道区分: 鋼索鉄道（13）。事業者種別: 民営鉄道（4）。

金谷沢
type: Concept
alternative label: 金谷沢（東日本旅客鉄道 大湊線）
broader: g000484
in scheme: scheme
notation: 000484
scope note: 運営会社: 東日本旅客鉄道。路線名: 大湊線。鉄道区分: 普通鉄道JR（11）。事業者種別: JR在来線（2）。

近川
type: Concept
alternative label: 近川（東日本旅客鉄道 大湊線）
broader: g000485
in scheme: scheme
notation: 000485
scope note: 運営会社: 東日本旅客鉄道。路線名: 大湊線。鉄道区分: 普通鉄道JR（11）。事業者種別: JR在来線（2）。

三厩
type: Concept
alternative label: 三厩（東日本旅客鉄道 津軽線）
broader: g000486
in scheme: scheme
notation: 000486
scope note: 運営会社: 東日本旅客鉄道。路線名: 津軽線。鉄道区分: 普通鉄道JR（11）。事業者種別: JR在来線（2）。

津軽浜名
type: Concept
alternative label: 津軽浜名（東日本旅客鉄道 津軽線）
broader: g000487
in scheme: scheme
notation: 000487
scope note: 運営会社: 東日本旅客鉄道。路線名: 津軽線。鉄道区分: 普通鉄道JR（11）。事業者種別: JR在来線（2）。

今別
type: Concept
alternative label: 今別（東日本旅客鉄道 津軽線）
broader: g000488
in scheme: scheme
notation: 000488
scope note: 運営会社: 東日本旅客鉄道。路線名: 津軽線。鉄道区分: 普通鉄道JR（11）。事業者種別: JR在来線（2）。

大川平
type: Concept
alternative label: 大川平（東日本旅客鉄道 津軽線）
broader: g000489
in scheme: scheme
notation: 000489
scope note: 運営会社: 東日本旅客鉄道。路線名: 津軽線。鉄道区分: 普通鉄道JR（11）。事業者種別: JR在来線（2）。

津軽二股
type: Concept
alternative label: 津軽二股（東日本旅客鉄道 津軽線）
broader: g000490
in scheme: scheme
notation: 000490
scope note: 運営会社: 東日本旅客鉄道。路線名: 津軽線。鉄道区分: 普通鉄道JR（11）。事業者種別: JR在来線（2）。

奥津軽いまべつ
type: Concept
alternative label: 奥津軽いまべつ（北海道旅客鉄道 北海道新幹線）
broader: g000491
in scheme: scheme
notation: 000491
scope note: 運営会社: 北海道旅客鉄道。路線名: 北海道新幹線。鉄道区分: 普通鉄道JR（11）。事業者種別: JRの新幹線（1）。

有畑
type: Concept
alternative label: 有畑（東日本旅客鉄道 大湊線）
broader: g000492
in scheme: scheme
notation: 000492
scope note: 運営会社: 東日本旅客鉄道。路線名: 大湊線。鉄道区分: 普通鉄道JR（11）。事業者種別: JR在来線（2）。

陸奥横浜
type: Concept
alternative label: 陸奥横浜（東日本旅客鉄道 大湊線）
broader: g000493
in scheme: scheme
notation: 000493
scope note: 運営会社: 東日本旅客鉄道。路線名: 大湊線。鉄道区分: 普通鉄道JR（11）。事業者種別: JR在来線（2）。

大平
type: Concept
alternative label: 大平（東日本旅客鉄道 津軽線）
broader: g000494
in scheme: scheme
notation: 000494
scope note: 運営会社: 東日本旅客鉄道。路線名: 津軽線。鉄道区分: 普通鉄道JR（11）。事業者種別: JR在来線（2）。

中小国
type: Concept
alternative label: 中小国（北海道旅客鉄道 海峡線）
broader: g000495
in scheme: scheme
notation: 000495
scope note: 運営会社: 北海道旅客鉄道。路線名: 海峡線。鉄道区分: 普通鉄道JR（11）。事業者種別: JR在来線（2）。

中小国
type: Concept
alternative label: 中小国（東日本旅客鉄道 津軽線）
broader: g000495
in scheme: scheme
notation: 000496
scope note: 運営会社: 東日本旅客鉄道。路線名: 津軽線。鉄道区分: 普通鉄道JR（11）。事業者種別: JR在来線（2）。

蟹田
type: Concept
alternative label: 蟹田（東日本旅客鉄道 津軽線）
broader: g000497
in scheme: scheme
notation: 000497
scope note: 運営会社: 東日本旅客鉄道。路線名: 津軽線。鉄道区分: 普通鉄道JR（11）。事業者種別: JR在来線（2）。

吹越
type: Concept
alternative label: 吹越（東日本旅客鉄道 大湊線）
broader: g000498
in scheme: scheme
notation: 000498
scope note: 運営会社: 東日本旅客鉄道。路線名: 大湊線。鉄道区分: 普通鉄道JR（11）。事業者種別: JR在来線（2）。

瀬辺地
type: Concept
alternative label: 瀬辺地（東日本旅客鉄道 津軽線）
broader: g000499
in scheme: scheme
notation: 000499
scope note: 運営会社: 東日本旅客鉄道。路線名: 津軽線。鉄道区分: 普通鉄道JR（11）。事業者種別: JR在来線（2）。

郷沢
type: Concept
alternative label: 郷沢（東日本旅客鉄道 津軽線）
broader: g000500
in scheme: scheme
notation: 000500
scope note: 運営会社: 東日本旅客鉄道。路線名: 津軽線。鉄道区分: 普通鉄道JR（11）。事業者種別: JR在来線（2）。

蓬田
type: Concept
alternative label: 蓬田（東日本旅客鉄道 津軽線）
broader: g000501
in scheme: scheme
notation: 000501
scope note: 運営会社: 東日本旅客鉄道。路線名: 津軽線。鉄道区分: 普通鉄道JR（11）。事業者種別: JR在来線（2）。

津軽中里
type: Concept
alternative label: 津軽中里（津軽鉄道 津軽鉄道線）
broader: g000502
in scheme: scheme
notation: 000502
scope note: 運営会社: 津軽鉄道。路線名: 津軽鉄道線。鉄道区分: 普通鉄道（12）。事業者種別: 民営鉄道（4）。

深郷田
type: Concept
alternative label: 深郷田（津軽鉄道 津軽鉄道線）
broader: g000503
in scheme: scheme
notation: 000503
scope note: 運営会社: 津軽鉄道。路線名: 津軽鉄道線。鉄道区分: 普通鉄道（12）。事業者種別: 民営鉄道（4）。

中沢
type: Concept
alternative label: 中沢（東日本旅客鉄道 津軽線）
broader: g000504
in scheme: scheme
notation: 000504
scope note: 運営会社: 東日本旅客鉄道。路線名: 津軽線。鉄道区分: 普通鉄道JR（11）。事業者種別: JR在来線（2）。

大沢内
type: Concept
alternative label: 大沢内（津軽鉄道 津軽鉄道線）
broader: g000505
in scheme: scheme
notation: 000505
scope note: 運営会社: 津軽鉄道。路線名: 津軽鉄道線。鉄道区分: 普通鉄道（12）。事業者種別: 民営鉄道（4）。

後潟
type: Concept
alternative label: 後潟（東日本旅客鉄道 津軽線）
broader: g000506
in scheme: scheme
notation: 000506
scope note: 運営会社: 東日本旅客鉄道。路線名: 津軽線。鉄道区分: 普通鉄道JR（11）。事業者種別: JR在来線（2）。

小湊
type: Concept
alternative label: 小湊（青い森鉄道 青い森鉄道線）
broader: g000507
in scheme: scheme
notation: 000507
scope note: 運営会社: 青い森鉄道。路線名: 青い森鉄道線。鉄道区分: 普通鉄道（12）。事業者種別: 第三セクター（5）。

川倉
type: Concept
alternative label: 川倉（津軽鉄道 津軽鉄道線）
broader: g000508
in scheme: scheme
notation: 000508
scope note: 運営会社: 津軽鉄道。路線名: 津軽鉄道線。鉄道区分: 普通鉄道（12）。事業者種別: 民営鉄道（4）。

清水川
type: Concept
alternative label: 清水川（青い森鉄道 青い森鉄道線）
broader: g000509
in scheme: scheme
notation: 000509
scope note: 運営会社: 青い森鉄道。路線名: 青い森鉄道線。鉄道区分: 普通鉄道（12）。事業者種別: 第三セクター（5）。

西平内
type: Concept
alternative label: 西平内（青い森鉄道 青い森鉄道線）
broader: g000510
in scheme: scheme
notation: 000510
scope note: 運営会社: 青い森鉄道。路線名: 青い森鉄道線。鉄道区分: 普通鉄道（12）。事業者種別: 第三セクター（5）。

左堰
type: Concept
alternative label: 左堰（東日本旅客鉄道 津軽線）
broader: g000511
in scheme: scheme
notation: 000511
scope note: 運営会社: 東日本旅客鉄道。路線名: 津軽線。鉄道区分: 普通鉄道JR（11）。事業者種別: JR在来線（2）。

有戸
type: Concept
alternative label: 有戸（東日本旅客鉄道 大湊線）
broader: g000512
in scheme: scheme
notation: 000512
scope note: 運営会社: 東日本旅客鉄道。路線名: 大湊線。鉄道区分: 普通鉄道JR（11）。事業者種別: JR在来線（2）。

芦野公園
type: Concept
alternative label: 芦野公園（津軽鉄道 津軽鉄道線）
broader: g000513
in scheme: scheme
notation: 000513
scope note: 運営会社: 津軽鉄道。路線名: 津軽鉄道線。鉄道区分: 普通鉄道（12）。事業者種別: 民営鉄道（4）。

奥内
type: Concept
alternative label: 奥内（東日本旅客鉄道 津軽線）
broader: g000514
in scheme: scheme
notation: 000514
scope note: 運営会社: 東日本旅客鉄道。路線名: 津軽線。鉄道区分: 普通鉄道JR（11）。事業者種別: JR在来線（2）。

金木
type: Concept
alternative label: 金木（津軽鉄道 津軽鉄道線）
broader: g000515
in scheme: scheme
notation: 000515
scope note: 運営会社: 津軽鉄道。路線名: 津軽鉄道線。鉄道区分: 普通鉄道（12）。事業者種別: 民営鉄道（4）。

狩場沢
type: Concept
alternative label: 狩場沢（青い森鉄道 青い森鉄道線）
broader: g000516
in scheme: scheme
notation: 000516
scope note: 運営会社: 青い森鉄道。路線名: 青い森鉄道線。鉄道区分: 普通鉄道（12）。事業者種別: 第三セクター（5）。

浅虫温泉
type: Concept
alternative label: 浅虫温泉（青い森鉄道 青い森鉄道線）
broader: g000517
in scheme: scheme
notation: 000517
scope note: 運営会社: 青い森鉄道。路線名: 青い森鉄道線。鉄道区分: 普通鉄道（12）。事業者種別: 第三セクター（5）。

津軽宮田
type: Concept
alternative label: 津軽宮田（東日本旅客鉄道 津軽線）
broader: g000518
in scheme: scheme
notation: 000518
scope note: 運営会社: 東日本旅客鉄道。路線名: 津軽線。鉄道区分: 普通鉄道JR（11）。事業者種別: JR在来線（2）。

嘉瀬
type: Concept
alternative label: 嘉瀬（津軽鉄道 津軽鉄道線）
broader: g000519
in scheme: scheme
notation: 000519
scope note: 運営会社: 津軽鉄道。路線名: 津軽鉄道線。鉄道区分: 普通鉄道（12）。事業者種別: 民営鉄道（4）。

北野辺地
type: Concept
alternative label: 北野辺地（東日本旅客鉄道 大湊線）
broader: g000520
in scheme: scheme
notation: 000520
scope note: 運営会社: 東日本旅客鉄道。路線名: 大湊線。鉄道区分: 普通鉄道JR（11）。事業者種別: JR在来線（2）。

毘沙門
type: Concept
alternative label: 毘沙門（津軽鉄道 津軽鉄道線）
broader: g000521
in scheme: scheme
notation: 000521
scope note: 運営会社: 津軽鉄道。路線名: 津軽鉄道線。鉄道区分: 普通鉄道（12）。事業者種別: 民営鉄道（4）。

油川
type: Concept
alternative label: 油川（東日本旅客鉄道 津軽線）
broader: g000522
in scheme: scheme
notation: 000522
scope note: 運営会社: 東日本旅客鉄道。路線名: 津軽線。鉄道区分: 普通鉄道JR（11）。事業者種別: JR在来線（2）。

野辺地
type: Concept
alternative label: 野辺地（東日本旅客鉄道 大湊線）
broader: g000523
in scheme: scheme
notation: 000523
scope note: 運営会社: 東日本旅客鉄道。路線名: 大湊線。鉄道区分: 普通鉄道JR（11）。事業者種別: JR在来線（2）。

野辺地
type: Concept
alternative label: 野辺地（青い森鉄道 青い森鉄道線）
broader: g000523
in scheme: scheme
notation: 000524
scope note: 運営会社: 青い森鉄道。路線名: 青い森鉄道線。鉄道区分: 普通鉄道（12）。事業者種別: 第三セクター（5）。

野内
type: Concept
alternative label: 野内（青い森鉄道 青い森鉄道線）
broader: g000525
in scheme: scheme
notation: 000525
scope note: 運営会社: 青い森鉄道。路線名: 青い森鉄道線。鉄道区分: 普通鉄道（12）。事業者種別: 第三セクター（5）。

矢田前
type: Concept
alternative label: 矢田前（青い森鉄道 青い森鉄道線）
broader: g000526
in scheme: scheme
notation: 000526
scope note: 運営会社: 青い森鉄道。路線名: 青い森鉄道線。鉄道区分: 普通鉄道（12）。事業者種別: 第三セクター（5）。

青森
type: Concept
alternative label: 青森（東日本旅客鉄道 奥羽線）
broader: g000527
in scheme: scheme
notation: 000527
scope note: 運営会社: 東日本旅客鉄道。路線名: 奥羽線。鉄道区分: 普通鉄道JR（11）。事業者種別: JR在来線（2）。

青森
type: Concept
alternative label: 青森（東日本旅客鉄道 津軽線）
broader: g000527
in scheme: scheme
notation: 000528
scope note: 運営会社: 東日本旅客鉄道。路線名: 津軽線。鉄道区分: 普通鉄道JR（11）。事業者種別: JR在来線（2）。

青森
type: Concept
alternative label: 青森（青い森鉄道 青い森鉄道線）
broader: g000527
in scheme: scheme
notation: 000529
scope note: 運営会社: 青い森鉄道。路線名: 青い森鉄道線。鉄道区分: 普通鉄道（12）。事業者種別: 第三セクター（5）。

津軽飯詰
type: Concept
alternative label: 津軽飯詰（津軽鉄道 津軽鉄道線）
broader: g000530
in scheme: scheme
notation: 000530
scope note: 運営会社: 津軽鉄道。路線名: 津軽鉄道線。鉄道区分: 普通鉄道（12）。事業者種別: 民営鉄道（4）。

新青森
type: Concept
alternative label: 新青森（東日本旅客鉄道 東北新幹線）
broader: g000531
in scheme: scheme
notation: 000531
scope note: 運営会社: 東日本旅客鉄道。路線名: 東北新幹線。鉄道区分: 普通鉄道JR（11）。事業者種別: JRの新幹線（1）。

新青森
type: Concept
alternative label: 新青森（北海道旅客鉄道 北海道新幹線）
broader: g000531
in scheme: scheme
notation: 000532
scope note: 運営会社: 北海道旅客鉄道。路線名: 北海道新幹線。鉄道区分: 普通鉄道JR（11）。事業者種別: JRの新幹線（1）。

津軽新城
type: Concept
alternative label: 津軽新城（東日本旅客鉄道 奥羽線）
broader: g000533
in scheme: scheme
notation: 000533
scope note: 運営会社: 東日本旅客鉄道。路線名: 奥羽線。鉄道区分: 普通鉄道JR（11）。事業者種別: JR在来線（2）。

新青森
type: Concept
alternative label: 新青森（東日本旅客鉄道 奥羽線）
broader: g000531
in scheme: scheme
notation: 000534
scope note: 運営会社: 東日本旅客鉄道。路線名: 奥羽線。鉄道区分: 普通鉄道JR（11）。事業者種別: JR在来線（2）。

五農校前
type: Concept
alternative label: 五農校前（津軽鉄道 津軽鉄道線）
broader: g000535
in scheme: scheme
notation: 000535
scope note: 運営会社: 津軽鉄道。路線名: 津軽鉄道線。鉄道区分: 普通鉄道（12）。事業者種別: 民営鉄道（4）。

小柳
type: Concept
alternative label: 小柳（青い森鉄道 青い森鉄道線）
broader: g000536
in scheme: scheme
notation: 000536
scope note: 運営会社: 青い森鉄道。路線名: 青い森鉄道線。鉄道区分: 普通鉄道（12）。事業者種別: 第三セクター（5）。

十川
type: Concept
alternative label: 十川（津軽鉄道 津軽鉄道線）
broader: g000537
in scheme: scheme
notation: 000537
scope note: 運営会社: 津軽鉄道。路線名: 津軽鉄道線。鉄道区分: 普通鉄道（12）。事業者種別: 民営鉄道（4）。

東青森
type: Concept
alternative label: 東青森（青い森鉄道 青い森鉄道線）
broader: g000538
in scheme: scheme
notation: 000538
scope note: 運営会社: 青い森鉄道。路線名: 青い森鉄道線。鉄道区分: 普通鉄道（12）。事業者種別: 第三セクター（5）。

津軽五所川原
type: Concept
alternative label: 津軽五所川原（津軽鉄道 津軽鉄道線）
broader: g000539
in scheme: scheme
notation: 000539
scope note: 運営会社: 津軽鉄道。路線名: 津軽鉄道線。鉄道区分: 普通鉄道（12）。事業者種別: 民営鉄道（4）。

五所川原
type: Concept
alternative label: 五所川原（東日本旅客鉄道 五能線）
broader: g000540
in scheme: scheme
notation: 000540
scope note: 運営会社: 東日本旅客鉄道。路線名: 五能線。鉄道区分: 普通鉄道JR（11）。事業者種別: JR在来線（2）。

筒井
type: Concept
alternative label: 筒井（青い森鉄道 青い森鉄道線）
broader: g000541
in scheme: scheme
notation: 000541
scope note: 運営会社: 青い森鉄道。路線名: 青い森鉄道線。鉄道区分: 普通鉄道（12）。事業者種別: 第三セクター（5）。

千曳
type: Concept
alternative label: 千曳（青い森鉄道 青い森鉄道線）
broader: g000542
in scheme: scheme
notation: 000542
scope note: 運営会社: 青い森鉄道。路線名: 青い森鉄道線。鉄道区分: 普通鉄道（12）。事業者種別: 第三セクター（5）。

木造
type: Concept
alternative label: 木造（東日本旅客鉄道 五能線）
broader: g000543
in scheme: scheme
notation: 000543
scope note: 運営会社: 東日本旅客鉄道。路線名: 五能線。鉄道区分: 普通鉄道JR（11）。事業者種別: JR在来線（2）。

鶴ヶ坂
type: Concept
alternative label: 鶴ヶ坂（東日本旅客鉄道 奥羽線）
broader: g000544
in scheme: scheme
notation: 000544
scope note: 運営会社: 東日本旅客鉄道。路線名: 奥羽線。鉄道区分: 普通鉄道JR（11）。事業者種別: JR在来線（2）。

中田
type: Concept
alternative label: 中田（東日本旅客鉄道 五能線）
broader: g000545
in scheme: scheme
notation: 000545
scope note: 運営会社: 東日本旅客鉄道。路線名: 五能線。鉄道区分: 普通鉄道JR（11）。事業者種別: JR在来線（2）。

越水
type: Concept
alternative label: 越水（東日本旅客鉄道 五能線）
broader: g000546
in scheme: scheme
notation: 000546
scope note: 運営会社: 東日本旅客鉄道。路線名: 五能線。鉄道区分: 普通鉄道JR（11）。事業者種別: JR在来線（2）。

鳴沢
type: Concept
alternative label: 鳴沢（東日本旅客鉄道 五能線）
broader: g000547
in scheme: scheme
notation: 000547
scope note: 運営会社: 東日本旅客鉄道。路線名: 五能線。鉄道区分: 普通鉄道JR（11）。事業者種別: JR在来線（2）。

陸奥森田
type: Concept
alternative label: 陸奥森田（東日本旅客鉄道 五能線）
broader: g000548
in scheme: scheme
notation: 000548
scope note: 運営会社: 東日本旅客鉄道。路線名: 五能線。鉄道区分: 普通鉄道JR（11）。事業者種別: JR在来線（2）。

乙供
type: Concept
alternative label: 乙供（青い森鉄道 青い森鉄道線）
broader: g000549
in scheme: scheme
notation: 000549
scope note: 運営会社: 青い森鉄道。路線名: 青い森鉄道線。鉄道区分: 普通鉄道（12）。事業者種別: 第三セクター（5）。

鰺ヶ沢
type: Concept
alternative label: 鰺ヶ沢（東日本旅客鉄道 五能線）
broader: g000550
in scheme: scheme
notation: 000550
scope note: 運営会社: 東日本旅客鉄道。路線名: 五能線。鉄道区分: 普通鉄道JR（11）。事業者種別: JR在来線（2）。

千畳敷
type: Concept
alternative label: 千畳敷（東日本旅客鉄道 五能線）
broader: g000551
in scheme: scheme
notation: 000551
scope note: 運営会社: 東日本旅客鉄道。路線名: 五能線。鉄道区分: 普通鉄道JR（11）。事業者種別: JR在来線（2）。

陸奥赤石
type: Concept
alternative label: 陸奥赤石（東日本旅客鉄道 五能線）
broader: g000552
in scheme: scheme
notation: 000552
scope note: 運営会社: 東日本旅客鉄道。路線名: 五能線。鉄道区分: 普通鉄道JR（11）。事業者種別: JR在来線（2）。

大戸瀬
type: Concept
alternative label: 大戸瀬（東日本旅客鉄道 五能線）
broader: g000553
in scheme: scheme
notation: 000553
scope note: 運営会社: 東日本旅客鉄道。路線名: 五能線。鉄道区分: 普通鉄道JR（11）。事業者種別: JR在来線（2）。

陸奥鶴田
type: Concept
alternative label: 陸奥鶴田（東日本旅客鉄道 五能線）
broader: g000554
in scheme: scheme
notation: 000554
scope note: 運営会社: 東日本旅客鉄道。路線名: 五能線。鉄道区分: 普通鉄道JR（11）。事業者種別: JR在来線（2）。

大釈迦
type: Concept
alternative label: 大釈迦（東日本旅客鉄道 奥羽線）
broader: g000555
in scheme: scheme
notation: 000555
scope note: 運営会社: 東日本旅客鉄道。路線名: 奥羽線。鉄道区分: 普通鉄道JR（11）。事業者種別: JR在来線（2）。

北金ヶ沢
type: Concept
alternative label: 北金ヶ沢（東日本旅客鉄道 五能線）
broader: g000556
in scheme: scheme
notation: 000556
scope note: 運営会社: 東日本旅客鉄道。路線名: 五能線。鉄道区分: 普通鉄道JR（11）。事業者種別: JR在来線（2）。

陸奥柳田
type: Concept
alternative label: 陸奥柳田（東日本旅客鉄道 五能線）
broader: g000557
in scheme: scheme
notation: 000557
scope note: 運営会社: 東日本旅客鉄道。路線名: 五能線。鉄道区分: 普通鉄道JR（11）。事業者種別: JR在来線（2）。

鶴泊
type: Concept
alternative label: 鶴泊（東日本旅客鉄道 五能線）
broader: g000558
in scheme: scheme
notation: 000558
scope note: 運営会社: 東日本旅客鉄道。路線名: 五能線。鉄道区分: 普通鉄道JR（11）。事業者種別: JR在来線（2）。

上北町
type: Concept
alternative label: 上北町（青い森鉄道 青い森鉄道線）
broader: g000559
in scheme: scheme
notation: 000559
scope note: 運営会社: 青い森鉄道。路線名: 青い森鉄道線。鉄道区分: 普通鉄道（12）。事業者種別: 第三セクター（5）。

風合瀬
type: Concept
alternative label: 風合瀬（東日本旅客鉄道 五能線）
broader: g000560
in scheme: scheme
notation: 000560
scope note: 運営会社: 東日本旅客鉄道。路線名: 五能線。鉄道区分: 普通鉄道JR（11）。事業者種別: JR在来線（2）。

七戸十和田
type: Concept
alternative label: 七戸十和田（東日本旅客鉄道 東北新幹線）
broader: g000561
in scheme: scheme
notation: 000561
scope note: 運営会社: 東日本旅客鉄道。路線名: 東北新幹線。鉄道区分: 普通鉄道JR（11）。事業者種別: JRの新幹線（1）。

浪岡
type: Concept
alternative label: 浪岡（東日本旅客鉄道 奥羽線）
broader: g000562
in scheme: scheme
notation: 000562
scope note: 運営会社: 東日本旅客鉄道。路線名: 奥羽線。鉄道区分: 普通鉄道JR（11）。事業者種別: JR在来線（2）。

小川原
type: Concept
alternative label: 小川原（青い森鉄道 青い森鉄道線）
broader: g000563
in scheme: scheme
notation: 000563
scope note: 運営会社: 青い森鉄道。路線名: 青い森鉄道線。鉄道区分: 普通鉄道（12）。事業者種別: 第三セクター（5）。

驫木
type: Concept
alternative label: 驫木（東日本旅客鉄道 五能線）
broader: g000564
in scheme: scheme
notation: 000564
scope note: 運営会社: 東日本旅客鉄道。路線名: 五能線。鉄道区分: 普通鉄道JR（11）。事業者種別: JR在来線（2）。

板柳
type: Concept
alternative label: 板柳（東日本旅客鉄道 五能線）
broader: g000565
in scheme: scheme
notation: 000565
scope note: 運営会社: 東日本旅客鉄道。路線名: 五能線。鉄道区分: 普通鉄道JR（11）。事業者種別: JR在来線（2）。

追良瀬
type: Concept
alternative label: 追良瀬（東日本旅客鉄道 五能線）
broader: g000566
in scheme: scheme
notation: 000566
scope note: 運営会社: 東日本旅客鉄道。路線名: 五能線。鉄道区分: 普通鉄道JR（11）。事業者種別: JR在来線（2）。

林崎
type: Concept
alternative label: 林崎（東日本旅客鉄道 五能線）
broader: g000567
in scheme: scheme
notation: 000567
scope note: 運営会社: 東日本旅客鉄道。路線名: 五能線。鉄道区分: 普通鉄道JR（11）。事業者種別: JR在来線（2）。

広戸
type: Concept
alternative label: 広戸（東日本旅客鉄道 五能線）
broader: g000568
in scheme: scheme
notation: 000568
scope note: 運営会社: 東日本旅客鉄道。路線名: 五能線。鉄道区分: 普通鉄道JR（11）。事業者種別: JR在来線（2）。

北常盤
type: Concept
alternative label: 北常盤（東日本旅客鉄道 奥羽線）
broader: g000569
in scheme: scheme
notation: 000569
scope note: 運営会社: 東日本旅客鉄道。路線名: 奥羽線。鉄道区分: 普通鉄道JR（11）。事業者種別: JR在来線（2）。

三沢
type: Concept
alternative label: 三沢（青い森鉄道 青い森鉄道線）
broader: g000570
in scheme: scheme
notation: 000570
scope note: 運営会社: 青い森鉄道。路線名: 青い森鉄道線。鉄道区分: 普通鉄道（12）。事業者種別: 第三セクター（5）。

藤崎
type: Concept
alternative label: 藤崎（東日本旅客鉄道 五能線）
broader: g000571
in scheme: scheme
notation: 000571
scope note: 運営会社: 東日本旅客鉄道。路線名: 五能線。鉄道区分: 普通鉄道JR（11）。事業者種別: JR在来線（2）。

深浦
type: Concept
alternative label: 深浦（東日本旅客鉄道 五能線）
broader: g000572
in scheme: scheme
notation: 000572
scope note: 運営会社: 東日本旅客鉄道。路線名: 五能線。鉄道区分: 普通鉄道JR（11）。事業者種別: JR在来線（2）。

境松
type: Concept
alternative label: 境松（弘南鉄道 弘南線）
broader: g000573
in scheme: scheme
notation: 000573
scope note: 運営会社: 弘南鉄道。路線名: 弘南線。鉄道区分: 普通鉄道（12）。事業者種別: 民営鉄道（4）。

黒石
type: Concept
alternative label: 黒石（弘南鉄道 弘南線）
broader: g000574
in scheme: scheme
notation: 000574
scope note: 運営会社: 弘南鉄道。路線名: 弘南線。鉄道区分: 普通鉄道（12）。事業者種別: 民営鉄道（4）。

川部
type: Concept
alternative label: 川部（東日本旅客鉄道 奥羽線）
broader: g000575
in scheme: scheme
notation: 000575
scope note: 運営会社: 東日本旅客鉄道。路線名: 奥羽線。鉄道区分: 普通鉄道JR（11）。事業者種別: JR在来線（2）。

川部
type: Concept
alternative label: 川部（東日本旅客鉄道 五能線）
broader: g000575
in scheme: scheme
notation: 000576
scope note: 運営会社: 東日本旅客鉄道。路線名: 五能線。鉄道区分: 普通鉄道JR（11）。事業者種別: JR在来線（2）。

田舎館
type: Concept
alternative label: 田舎館（弘南鉄道 弘南線）
broader: g000577
in scheme: scheme
notation: 000577
scope note: 運営会社: 弘南鉄道。路線名: 弘南線。鉄道区分: 普通鉄道（12）。事業者種別: 民営鉄道（4）。

田んぼアート
type: Concept
alternative label: 田んぼアート（弘南鉄道 弘南線）
broader: g000578
in scheme: scheme
notation: 000578
scope note: 運営会社: 弘南鉄道。路線名: 弘南線。鉄道区分: 普通鉄道（12）。事業者種別: 民営鉄道（4）。

向山
type: Concept
alternative label: 向山（青い森鉄道 青い森鉄道線）
broader: g000579
in scheme: scheme
notation: 000579
scope note: 運営会社: 青い森鉄道。路線名: 青い森鉄道線。鉄道区分: 普通鉄道（12）。事業者種別: 第三セクター（5）。

横磯
type: Concept
alternative label: 横磯（東日本旅客鉄道 五能線）
broader: g000580
in scheme: scheme
notation: 000580
scope note: 運営会社: 東日本旅客鉄道。路線名: 五能線。鉄道区分: 普通鉄道JR（11）。事業者種別: JR在来線（2）。

尾上高校前
type: Concept
alternative label: 尾上高校前（弘南鉄道 弘南線）
broader: g000581
in scheme: scheme
notation: 000581
scope note: 運営会社: 弘南鉄道。路線名: 弘南線。鉄道区分: 普通鉄道（12）。事業者種別: 民営鉄道（4）。

撫牛子
type: Concept
alternative label: 撫牛子（東日本旅客鉄道 奥羽線）
broader: g000582
in scheme: scheme
notation: 000582
scope note: 運営会社: 東日本旅客鉄道。路線名: 奥羽線。鉄道区分: 普通鉄道JR（11）。事業者種別: JR在来線（2）。

津軽尾上
type: Concept
alternative label: 津軽尾上（弘南鉄道 弘南線）
broader: g000583
in scheme: scheme
notation: 000583
scope note: 運営会社: 弘南鉄道。路線名: 弘南線。鉄道区分: 普通鉄道（12）。事業者種別: 民営鉄道（4）。

艫作
type: Concept
alternative label: 艫作（東日本旅客鉄道 五能線）
broader: g000584
in scheme: scheme
notation: 000584
scope note: 運営会社: 東日本旅客鉄道。路線名: 五能線。鉄道区分: 普通鉄道JR（11）。事業者種別: JR在来線（2）。

柏農高校前
type: Concept
alternative label: 柏農高校前（弘南鉄道 弘南線）
broader: g000585
in scheme: scheme
notation: 000585
scope note: 運営会社: 弘南鉄道。路線名: 弘南線。鉄道区分: 普通鉄道（12）。事業者種別: 民営鉄道（4）。

弘前
type: Concept
alternative label: 弘前（東日本旅客鉄道 奥羽線）
broader: g000586
in scheme: scheme
notation: 000586
scope note: 運営会社: 東日本旅客鉄道。路線名: 奥羽線。鉄道区分: 普通鉄道JR（11）。事業者種別: JR在来線（2）。

中央弘前
type: Concept
alternative label: 中央弘前（弘南鉄道 大鰐線）
broader: g000587
in scheme: scheme
notation: 000587
scope note: 運営会社: 弘南鉄道。路線名: 大鰐線。鉄道区分: 普通鉄道（12）。事業者種別: 民営鉄道（4）。

弘前
type: Concept
alternative label: 弘前（弘南鉄道 弘南線）
broader: g000586
in scheme: scheme
notation: 000588
scope note: 運営会社: 弘南鉄道。路線名: 弘南線。鉄道区分: 普通鉄道（12）。事業者種別: 民営鉄道（4）。

ウェスパ椿山
type: Concept
alternative label: ウェスパ椿山（東日本旅客鉄道 五能線）
broader: g000589
in scheme: scheme
notation: 000589
scope note: 運営会社: 東日本旅客鉄道。路線名: 五能線。鉄道区分: 普通鉄道JR（11）。事業者種別: JR在来線（2）。

弘高下
type: Concept
alternative label: 弘高下（弘南鉄道 大鰐線）
broader: g000590
in scheme: scheme
notation: 000590
scope note: 運営会社: 弘南鉄道。路線名: 大鰐線。鉄道区分: 普通鉄道（12）。事業者種別: 民営鉄道（4）。

弘前東高前
type: Concept
alternative label: 弘前東高前（弘南鉄道 弘南線）
broader: g000591
in scheme: scheme
notation: 000591
scope note: 運営会社: 弘南鉄道。路線名: 弘南線。鉄道区分: 普通鉄道（12）。事業者種別: 民営鉄道（4）。

下田
type: Concept
alternative label: 下田（青い森鉄道 青い森鉄道線）
broader: g000592
in scheme: scheme
notation: 000592
scope note: 運営会社: 青い森鉄道。路線名: 青い森鉄道線。鉄道区分: 普通鉄道（12）。事業者種別: 第三セクター（5）。

運動公園前
type: Concept
alternative label: 運動公園前（弘南鉄道 弘南線）
broader: g000593
in scheme: scheme
notation: 000593
scope note: 運営会社: 弘南鉄道。路線名: 弘南線。鉄道区分: 普通鉄道（12）。事業者種別: 民営鉄道（4）。

新里
type: Concept
alternative label: 新里（弘南鉄道 弘南線）
broader: g000594
in scheme: scheme
notation: 000594
scope note: 運営会社: 弘南鉄道。路線名: 弘南線。鉄道区分: 普通鉄道（12）。事業者種別: 民営鉄道（4）。

陸奥沢辺
type: Concept
alternative label: 陸奥沢辺（東日本旅客鉄道 五能線）
broader: g000595
in scheme: scheme
notation: 000595
scope note: 運営会社: 東日本旅客鉄道。路線名: 五能線。鉄道区分: 普通鉄道JR（11）。事業者種別: JR在来線（2）。

館田
type: Concept
alternative label: 館田（弘南鉄道 弘南線）
broader: g000596
in scheme: scheme
notation: 000596
scope note: 運営会社: 弘南鉄道。路線名: 弘南線。鉄道区分: 普通鉄道（12）。事業者種別: 民営鉄道（4）。

平賀
type: Concept
alternative label: 平賀（弘南鉄道 弘南線）
broader: g000597
in scheme: scheme
notation: 000597
scope note: 運営会社: 弘南鉄道。路線名: 弘南線。鉄道区分: 普通鉄道（12）。事業者種別: 民営鉄道（4）。

弘前学院大前
type: Concept
alternative label: 弘前学院大前（弘南鉄道 大鰐線）
broader: g000598
in scheme: scheme
notation: 000598
scope note: 運営会社: 弘南鉄道。路線名: 大鰐線。鉄道区分: 普通鉄道（12）。事業者種別: 民営鉄道（4）。

陸奥岩崎
type: Concept
alternative label: 陸奥岩崎（東日本旅客鉄道 五能線）
broader: g000599
in scheme: scheme
notation: 000599
scope note: 運営会社: 東日本旅客鉄道。路線名: 五能線。鉄道区分: 普通鉄道JR（11）。事業者種別: JR在来線（2）。

聖愛中高前
type: Concept
alternative label: 聖愛中高前（弘南鉄道 大鰐線）
broader: g000600
in scheme: scheme
notation: 000600
scope note: 運営会社: 弘南鉄道。路線名: 大鰐線。鉄道区分: 普通鉄道（12）。事業者種別: 民営鉄道（4）。

千年
type: Concept
alternative label: 千年（弘南鉄道 大鰐線）
broader: g000601
in scheme: scheme
notation: 000601
scope note: 運営会社: 弘南鉄道。路線名: 大鰐線。鉄道区分: 普通鉄道（12）。事業者種別: 民営鉄道（4）。

小栗山
type: Concept
alternative label: 小栗山（弘南鉄道 大鰐線）
broader: g000602
in scheme: scheme
notation: 000602
scope note: 運営会社: 弘南鉄道。路線名: 大鰐線。鉄道区分: 普通鉄道（12）。事業者種別: 民営鉄道（4）。

陸奥市川
type: Concept
alternative label: 陸奥市川（青い森鉄道 青い森鉄道線）
broader: g000603
in scheme: scheme
notation: 000603
scope note: 運営会社: 青い森鉄道。路線名: 青い森鉄道線。鉄道区分: 普通鉄道（12）。事業者種別: 第三セクター（5）。

松木平
type: Concept
alternative label: 松木平（弘南鉄道 大鰐線）
broader: g000604
in scheme: scheme
notation: 000604
scope note: 運営会社: 弘南鉄道。路線名: 大鰐線。鉄道区分: 普通鉄道（12）。事業者種別: 民営鉄道（4）。

津軽大沢
type: Concept
alternative label: 津軽大沢（弘南鉄道 大鰐線）
broader: g000605
in scheme: scheme
notation: 000605
scope note: 運営会社: 弘南鉄道。路線名: 大鰐線。鉄道区分: 普通鉄道（12）。事業者種別: 民営鉄道（4）。

石川
type: Concept
alternative label: 石川（東日本旅客鉄道 奥羽線）
broader: g000606
in scheme: scheme
notation: 000606
scope note: 運営会社: 東日本旅客鉄道。路線名: 奥羽線。鉄道区分: 普通鉄道JR（11）。事業者種別: JR在来線（2）。

義塾高校前
type: Concept
alternative label: 義塾高校前（弘南鉄道 大鰐線）
broader: g000607
in scheme: scheme
notation: 000607
scope note: 運営会社: 弘南鉄道。路線名: 大鰐線。鉄道区分: 普通鉄道（12）。事業者種別: 民営鉄道（4）。

十二湖
type: Concept
alternative label: 十二湖（東日本旅客鉄道 五能線）
broader: g000608
in scheme: scheme
notation: 000608
scope note: 運営会社: 東日本旅客鉄道。路線名: 五能線。鉄道区分: 普通鉄道JR（11）。事業者種別: JR在来線（2）。

石川
type: Concept
alternative label: 石川（弘南鉄道 大鰐線）
broader: g000609
in scheme: scheme
notation: 000609
scope note: 運営会社: 弘南鉄道。路線名: 大鰐線。鉄道区分: 普通鉄道（12）。事業者種別: 民営鉄道（4）。

石川プール前
type: Concept
alternative label: 石川プール前（弘南鉄道 大鰐線）
broader: g000610
in scheme: scheme
notation: 000610
scope note: 運営会社: 弘南鉄道。路線名: 大鰐線。鉄道区分: 普通鉄道（12）。事業者種別: 民営鉄道（4）。

鯖石
type: Concept
alternative label: 鯖石（弘南鉄道 大鰐線）
broader: g000611
in scheme: scheme
notation: 000611
scope note: 運営会社: 弘南鉄道。路線名: 大鰐線。鉄道区分: 普通鉄道（12）。事業者種別: 民営鉄道（4）。

松神
type: Concept
alternative label: 松神（東日本旅客鉄道 五能線）
broader: g000612
in scheme: scheme
notation: 000612
scope note: 運営会社: 東日本旅客鉄道。路線名: 五能線。鉄道区分: 普通鉄道JR（11）。事業者種別: JR在来線（2）。

鮫
type: Concept
alternative label: 鮫（東日本旅客鉄道 八戸線）
broader: g000613
in scheme: scheme
notation: 000613
scope note: 運営会社: 東日本旅客鉄道。路線名: 八戸線。鉄道区分: 普通鉄道JR（11）。事業者種別: JR在来線（2）。

宿川原
type: Concept
alternative label: 宿川原（弘南鉄道 大鰐線）
broader: g000614
in scheme: scheme
notation: 000614
scope note: 運営会社: 弘南鉄道。路線名: 大鰐線。鉄道区分: 普通鉄道（12）。事業者種別: 民営鉄道（4）。

陸奥湊
type: Concept
alternative label: 陸奥湊（東日本旅客鉄道 八戸線）
broader: g000615
in scheme: scheme
notation: 000615
scope note: 運営会社: 東日本旅客鉄道。路線名: 八戸線。鉄道区分: 普通鉄道JR（11）。事業者種別: JR在来線（2）。

白銀
type: Concept
alternative label: 白銀（東日本旅客鉄道 八戸線）
broader: g000616
in scheme: scheme
notation: 000616
scope note: 運営会社: 東日本旅客鉄道。路線名: 八戸線。鉄道区分: 普通鉄道JR（11）。事業者種別: JR在来線（2）。

大鰐
type: Concept
alternative label: 大鰐（弘南鉄道 大鰐線）
broader: g000617
in scheme: scheme
notation: 000617
scope note: 運営会社: 弘南鉄道。路線名: 大鰐線。鉄道区分: 普通鉄道（12）。事業者種別: 民営鉄道（4）。

大鰐温泉
type: Concept
alternative label: 大鰐温泉（東日本旅客鉄道 奥羽線）
broader: g000618
in scheme: scheme
notation: 000618
scope note: 運営会社: 東日本旅客鉄道。路線名: 奥羽線。鉄道区分: 普通鉄道JR（11）。事業者種別: JR在来線（2）。

長苗代
type: Concept
alternative label: 長苗代（東日本旅客鉄道 八戸線）
broader: g000619
in scheme: scheme
notation: 000619
scope note: 運営会社: 東日本旅客鉄道。路線名: 八戸線。鉄道区分: 普通鉄道JR（11）。事業者種別: JR在来線（2）。

小中野
type: Concept
alternative label: 小中野（東日本旅客鉄道 八戸線）
broader: g000620
in scheme: scheme
notation: 000620
scope note: 運営会社: 東日本旅客鉄道。路線名: 八戸線。鉄道区分: 普通鉄道JR（11）。事業者種別: JR在来線（2）。

陸奥白浜
type: Concept
alternative label: 陸奥白浜（東日本旅客鉄道 八戸線）
broader: g000621
in scheme: scheme
notation: 000621
scope note: 運営会社: 東日本旅客鉄道。路線名: 八戸線。鉄道区分: 普通鉄道JR（11）。事業者種別: JR在来線（2）。

本八戸
type: Concept
alternative label: 本八戸（東日本旅客鉄道 八戸線）
broader: g000622
in scheme: scheme
notation: 000622
scope note: 運営会社: 東日本旅客鉄道。路線名: 八戸線。鉄道区分: 普通鉄道JR（11）。事業者種別: JR在来線（2）。

長峰
type: Concept
alternative label: 長峰（東日本旅客鉄道 奥羽線）
broader: g000623
in scheme: scheme
notation: 000623
scope note: 運営会社: 東日本旅客鉄道。路線名: 奥羽線。鉄道区分: 普通鉄道JR（11）。事業者種別: JR在来線（2）。

白神岳登山口
type: Concept
alternative label: 白神岳登山口（東日本旅客鉄道 五能線）
broader: g000624
in scheme: scheme
notation: 000624
scope note: 運営会社: 東日本旅客鉄道。路線名: 五能線。鉄道区分: 普通鉄道JR（11）。事業者種別: JR在来線（2）。

八戸
type: Concept
alternative label: 八戸（東日本旅客鉄道 東北新幹線）
broader: g000626
in scheme: scheme
notation: 000625
scope note: 運営会社: 東日本旅客鉄道。路線名: 東北新幹線。鉄道区分: 普通鉄道JR（11）。事業者種別: JRの新幹線（1）。

八戸
type: Concept
alternative label: 八戸（東日本旅客鉄道 八戸線）
broader: g000626
in scheme: scheme
notation: 000626
scope note: 運営会社: 東日本旅客鉄道。路線名: 八戸線。鉄道区分: 普通鉄道JR（11）。事業者種別: JR在来線（2）。

八戸
type: Concept
alternative label: 八戸（青い森鉄道 青い森鉄道線）
broader: g000626
in scheme: scheme
notation: 000627
scope note: 運営会社: 青い森鉄道。路線名: 青い森鉄道線。鉄道区分: 普通鉄道（12）。事業者種別: 第三セクター（5）。

種差海岸
type: Concept
alternative label: 種差海岸（東日本旅客鉄道 八戸線）
broader: g000628
in scheme: scheme
notation: 000628
scope note: 運営会社: 東日本旅客鉄道。路線名: 八戸線。鉄道区分: 普通鉄道JR（11）。事業者種別: JR在来線（2）。

大久喜
type: Concept
alternative label: 大久喜（東日本旅客鉄道 八戸線）
broader: g000629
in scheme: scheme
notation: 000629
scope note: 運営会社: 東日本旅客鉄道。路線名: 八戸線。鉄道区分: 普通鉄道JR（11）。事業者種別: JR在来線（2）。

大間越
type: Concept
alternative label: 大間越（東日本旅客鉄道 五能線）
broader: g000630
in scheme: scheme
notation: 000630
scope note: 運営会社: 東日本旅客鉄道。路線名: 五能線。鉄道区分: 普通鉄道JR（11）。事業者種別: JR在来線（2）。

碇ヶ関
type: Concept
alternative label: 碇ヶ関（東日本旅客鉄道 奥羽線）
broader: g000631
in scheme: scheme
notation: 000631
scope note: 運営会社: 東日本旅客鉄道。路線名: 奥羽線。鉄道区分: 普通鉄道JR（11）。事業者種別: JR在来線（2）。

金浜
type: Concept
alternative label: 金浜（東日本旅客鉄道 八戸線）
broader: g000632
in scheme: scheme
notation: 000632
scope note: 運営会社: 東日本旅客鉄道。路線名: 八戸線。鉄道区分: 普通鉄道JR（11）。事業者種別: JR在来線（2）。

北高岩
type: Concept
alternative label: 北高岩（青い森鉄道 青い森鉄道線）
broader: g000633
in scheme: scheme
notation: 000633
scope note: 運営会社: 青い森鉄道。路線名: 青い森鉄道線。鉄道区分: 普通鉄道（12）。事業者種別: 第三セクター（5）。

大蛇
type: Concept
alternative label: 大蛇（東日本旅客鉄道 八戸線）
broader: g000634
in scheme: scheme
notation: 000634
scope note: 運営会社: 東日本旅客鉄道。路線名: 八戸線。鉄道区分: 普通鉄道JR（11）。事業者種別: JR在来線（2）。

苫米地
type: Concept
alternative label: 苫米地（青い森鉄道 青い森鉄道線）
broader: g000635
in scheme: scheme
notation: 000635
scope note: 運営会社: 青い森鉄道。路線名: 青い森鉄道線。鉄道区分: 普通鉄道（12）。事業者種別: 第三セクター（5）。

階上
type: Concept
alternative label: 階上（東日本旅客鉄道 八戸線）
broader: g000636
in scheme: scheme
notation: 000636
scope note: 運営会社: 東日本旅客鉄道。路線名: 八戸線。鉄道区分: 普通鉄道JR（11）。事業者種別: JR在来線（2）。

剣吉
type: Concept
alternative label: 剣吉（青い森鉄道 青い森鉄道線）
broader: g000637
in scheme: scheme
notation: 000637
scope note: 運営会社: 青い森鉄道。路線名: 青い森鉄道線。鉄道区分: 普通鉄道（12）。事業者種別: 第三セクター（5）。

角の浜
type: Concept
alternative label: 角の浜（東日本旅客鉄道 八戸線）
broader: g000638
in scheme: scheme
notation: 000638
scope note: 運営会社: 東日本旅客鉄道。路線名: 八戸線。鉄道区分: 普通鉄道JR（11）。事業者種別: JR在来線（2）。

津軽湯の沢
type: Concept
alternative label: 津軽湯の沢（東日本旅客鉄道 奥羽線）
broader: g000639
in scheme: scheme
notation: 000639
scope note: 運営会社: 東日本旅客鉄道。路線名: 奥羽線。鉄道区分: 普通鉄道JR（11）。事業者種別: JR在来線（2）。

平内
type: Concept
alternative label: 平内（東日本旅客鉄道 八戸線）
broader: g000640
in scheme: scheme
notation: 000640
scope note: 運営会社: 東日本旅客鉄道。路線名: 八戸線。鉄道区分: 普通鉄道JR（11）。事業者種別: JR在来線（2）。

諏訪ノ平
type: Concept
alternative label: 諏訪ノ平（青い森鉄道 青い森鉄道線）
broader: g000641
in scheme: scheme
notation: 000641
scope note: 運営会社: 青い森鉄道。路線名: 青い森鉄道線。鉄道区分: 普通鉄道（12）。事業者種別: 第三セクター（5）。

種市
type: Concept
alternative label: 種市（東日本旅客鉄道 八戸線）
broader: g000642
in scheme: scheme
notation: 000642
scope note: 運営会社: 東日本旅客鉄道。路線名: 八戸線。鉄道区分: 普通鉄道JR（11）。事業者種別: JR在来線（2）。

岩館
type: Concept
alternative label: 岩館（東日本旅客鉄道 五能線）
broader: g000643
in scheme: scheme
notation: 000643
scope note: 運営会社: 東日本旅客鉄道。路線名: 五能線。鉄道区分: 普通鉄道JR（11）。事業者種別: JR在来線（2）。

陣場
type: Concept
alternative label: 陣場（東日本旅客鉄道 奥羽線）
broader: g000644
in scheme: scheme
notation: 000644
scope note: 運営会社: 東日本旅客鉄道。路線名: 奥羽線。鉄道区分: 普通鉄道JR（11）。事業者種別: JR在来線（2）。

三戸
type: Concept
alternative label: 三戸（青い森鉄道 青い森鉄道線）
broader: g000645
in scheme: scheme
notation: 000645
scope note: 運営会社: 青い森鉄道。路線名: 青い森鉄道線。鉄道区分: 普通鉄道（12）。事業者種別: 第三セクター（5）。

あきた白神
type: Concept
alternative label: あきた白神（東日本旅客鉄道 五能線）
broader: g000646
in scheme: scheme
notation: 000646
scope note: 運営会社: 東日本旅客鉄道。路線名: 五能線。鉄道区分: 普通鉄道JR（11）。事業者種別: JR在来線（2）。

玉川
type: Concept
alternative label: 玉川（東日本旅客鉄道 八戸線）
broader: g000647
in scheme: scheme
notation: 000647
scope note: 運営会社: 東日本旅客鉄道。路線名: 八戸線。鉄道区分: 普通鉄道JR（11）。事業者種別: JR在来線（2）。

滝ノ間
type: Concept
alternative label: 滝ノ間（東日本旅客鉄道 五能線）
broader: g000648
in scheme: scheme
notation: 000648
scope note: 運営会社: 東日本旅客鉄道。路線名: 五能線。鉄道区分: 普通鉄道JR（11）。事業者種別: JR在来線（2）。

八森
type: Concept
alternative label: 八森（東日本旅客鉄道 五能線）
broader: g000649
in scheme: scheme
notation: 000649
scope note: 運営会社: 東日本旅客鉄道。路線名: 五能線。鉄道区分: 普通鉄道JR（11）。事業者種別: JR在来線（2）。

宿戸
type: Concept
alternative label: 宿戸（東日本旅客鉄道 八戸線）
broader: g000650
in scheme: scheme
notation: 000650
scope note: 運営会社: 東日本旅客鉄道。路線名: 八戸線。鉄道区分: 普通鉄道JR（11）。事業者種別: JR在来線（2）。

目時
type: Concept
alternative label: 目時（アイジーアールいわて銀河鉄道 いわて銀河鉄道線）
broader: g000651
in scheme: scheme
notation: 000651
scope note: 運営会社: アイジーアールいわて銀河鉄道。路線名: いわて銀河鉄道線。鉄道区分: 普通鉄道（12）。事業者種別: 第三セクター（5）。

目時
type: Concept
alternative label: 目時（青い森鉄道 青い森鉄道線）
broader: g000651
in scheme: scheme
notation: 000652
scope note: 運営会社: 青い森鉄道。路線名: 青い森鉄道線。鉄道区分: 普通鉄道（12）。事業者種別: 第三セクター（5）。

陸中八木
type: Concept
alternative label: 陸中八木（東日本旅客鉄道 八戸線）
broader: g000653
in scheme: scheme
notation: 000653
scope note: 運営会社: 東日本旅客鉄道。路線名: 八戸線。鉄道区分: 普通鉄道JR（11）。事業者種別: JR在来線（2）。

白沢
type: Concept
alternative label: 白沢（東日本旅客鉄道 奥羽線）
broader: g000654
in scheme: scheme
notation: 000654
scope note: 運営会社: 東日本旅客鉄道。路線名: 奥羽線。鉄道区分: 普通鉄道JR（11）。事業者種別: JR在来線（2）。

東八森
type: Concept
alternative label: 東八森（東日本旅客鉄道 五能線）
broader: g000655
in scheme: scheme
notation: 000655
scope note: 運営会社: 東日本旅客鉄道。路線名: 五能線。鉄道区分: 普通鉄道JR（11）。事業者種別: JR在来線（2）。

有家
type: Concept
alternative label: 有家（東日本旅客鉄道 八戸線）
broader: g000656
in scheme: scheme
notation: 000656
scope note: 運営会社: 東日本旅客鉄道。路線名: 八戸線。鉄道区分: 普通鉄道JR（11）。事業者種別: JR在来線（2）。

金田一温泉
type: Concept
alternative label: 金田一温泉（アイジーアールいわて銀河鉄道 いわて銀河鉄道線）
broader: g000657
in scheme: scheme
notation: 000657
scope note: 運営会社: アイジーアールいわて銀河鉄道。路線名: いわて銀河鉄道線。鉄道区分: 普通鉄道（12）。事業者種別: 第三セクター（5）。

陸中中野
type: Concept
alternative label: 陸中中野（東日本旅客鉄道 八戸線）
broader: g000658
in scheme: scheme
notation: 000658
scope note: 運営会社: 東日本旅客鉄道。路線名: 八戸線。鉄道区分: 普通鉄道JR（11）。事業者種別: JR在来線（2）。

沢目
type: Concept
alternative label: 沢目（東日本旅客鉄道 五能線）
broader: g000659
in scheme: scheme
notation: 000659
scope note: 運営会社: 東日本旅客鉄道。路線名: 五能線。鉄道区分: 普通鉄道JR（11）。事業者種別: JR在来線（2）。

大館
type: Concept
alternative label: 大館（東日本旅客鉄道 奥羽線）
broader: g000660
in scheme: scheme
notation: 000660
scope note: 運営会社: 東日本旅客鉄道。路線名: 奥羽線。鉄道区分: 普通鉄道JR（11）。事業者種別: JR在来線（2）。

大館
type: Concept
alternative label: 大館（東日本旅客鉄道 花輪線）
broader: g000660
in scheme: scheme
notation: 000661
scope note: 運営会社: 東日本旅客鉄道。路線名: 花輪線。鉄道区分: 普通鉄道JR（11）。事業者種別: JR在来線（2）。

斗米
type: Concept
alternative label: 斗米（アイジーアールいわて銀河鉄道 いわて銀河鉄道線）
broader: g000662
in scheme: scheme
notation: 000662
scope note: 運営会社: アイジーアールいわて銀河鉄道。路線名: いわて銀河鉄道線。鉄道区分: 普通鉄道（12）。事業者種別: 第三セクター（5）。

下川沿
type: Concept
alternative label: 下川沿（東日本旅客鉄道 奥羽線）
broader: g000663
in scheme: scheme
notation: 000663
scope note: 運営会社: 東日本旅客鉄道。路線名: 奥羽線。鉄道区分: 普通鉄道JR（11）。事業者種別: JR在来線（2）。

鳥形
type: Concept
alternative label: 鳥形（東日本旅客鉄道 五能線）
broader: g000664
in scheme: scheme
notation: 000664
scope note: 運営会社: 東日本旅客鉄道。路線名: 五能線。鉄道区分: 普通鉄道JR（11）。事業者種別: JR在来線（2）。

早口
type: Concept
alternative label: 早口（東日本旅客鉄道 奥羽線）
broader: g000665
in scheme: scheme
notation: 000665
scope note: 運営会社: 東日本旅客鉄道。路線名: 奥羽線。鉄道区分: 普通鉄道JR（11）。事業者種別: JR在来線（2）。

東大館
type: Concept
alternative label: 東大館（東日本旅客鉄道 花輪線）
broader: g000666
in scheme: scheme
notation: 000666
scope note: 運営会社: 東日本旅客鉄道。路線名: 花輪線。鉄道区分: 普通鉄道JR（11）。事業者種別: JR在来線（2）。

侍浜
type: Concept
alternative label: 侍浜（東日本旅客鉄道 八戸線）
broader: g000667
in scheme: scheme
notation: 000667
scope note: 運営会社: 東日本旅客鉄道。路線名: 八戸線。鉄道区分: 普通鉄道JR（11）。事業者種別: JR在来線（2）。

二戸
type: Concept
alternative label: 二戸（アイジーアールいわて銀河鉄道 いわて銀河鉄道線）
broader: g000668
in scheme: scheme
notation: 000668
scope note: 運営会社: アイジーアールいわて銀河鉄道。路線名: いわて銀河鉄道線。鉄道区分: 普通鉄道（12）。事業者種別: 第三セクター（5）。

二戸
type: Concept
alternative label: 二戸（東日本旅客鉄道 東北新幹線）
broader: g000668
in scheme: scheme
notation: 000669
scope note: 運営会社: 東日本旅客鉄道。路線名: 東北新幹線。鉄道区分: 普通鉄道JR（11）。事業者種別: JRの新幹線（1）。

十和田南
type: Concept
alternative label: 十和田南（東日本旅客鉄道 花輪線）
broader: g000670
in scheme: scheme
notation: 000670
scope note: 運営会社: 東日本旅客鉄道。路線名: 花輪線。鉄道区分: 普通鉄道JR（11）。事業者種別: JR在来線（2）。

北能代
type: Concept
alternative label: 北能代（東日本旅客鉄道 五能線）
broader: g000671
in scheme: scheme
notation: 000671
scope note: 運営会社: 東日本旅客鉄道。路線名: 五能線。鉄道区分: 普通鉄道JR（11）。事業者種別: JR在来線（2）。

糠沢
type: Concept
alternative label: 糠沢（東日本旅客鉄道 奥羽線）
broader: g000672
in scheme: scheme
notation: 000672
scope note: 運営会社: 東日本旅客鉄道。路線名: 奥羽線。鉄道区分: 普通鉄道JR（11）。事業者種別: JR在来線（2）。

鷹ノ巣
type: Concept
alternative label: 鷹ノ巣（東日本旅客鉄道 奥羽線）
broader: g000673
in scheme: scheme
notation: 000673
scope note: 運営会社: 東日本旅客鉄道。路線名: 奥羽線。鉄道区分: 普通鉄道JR（11）。事業者種別: JR在来線（2）。

鷹巣
type: Concept
alternative label: 鷹巣（秋田内陸縦貫鉄道 秋田内陸線）
broader: g000674
in scheme: scheme
notation: 000674
scope note: 運営会社: 秋田内陸縦貫鉄道。路線名: 秋田内陸線。鉄道区分: 普通鉄道（12）。事業者種別: 第三セクター（5）。

柴平
type: Concept
alternative label: 柴平（東日本旅客鉄道 花輪線）
broader: g000675
in scheme: scheme
notation: 000675
scope note: 運営会社: 東日本旅客鉄道。路線名: 花輪線。鉄道区分: 普通鉄道JR（11）。事業者種別: JR在来線（2）。

沢尻
type: Concept
alternative label: 沢尻（東日本旅客鉄道 花輪線）
broader: g000676
in scheme: scheme
notation: 000676
scope note: 運営会社: 東日本旅客鉄道。路線名: 花輪線。鉄道区分: 普通鉄道JR（11）。事業者種別: JR在来線（2）。

末広
type: Concept
alternative label: 末広（東日本旅客鉄道 花輪線）
broader: g000677
in scheme: scheme
notation: 000677
scope note: 運営会社: 東日本旅客鉄道。路線名: 花輪線。鉄道区分: 普通鉄道JR（11）。事業者種別: JR在来線（2）。

扇田
type: Concept
alternative label: 扇田（東日本旅客鉄道 花輪線）
broader: g000678
in scheme: scheme
notation: 000678
scope note: 運営会社: 東日本旅客鉄道。路線名: 花輪線。鉄道区分: 普通鉄道JR（11）。事業者種別: JR在来線（2）。

向能代
type: Concept
alternative label: 向能代（東日本旅客鉄道 五能線）
broader: g000679
in scheme: scheme
notation: 000679
scope note: 運営会社: 東日本旅客鉄道。路線名: 五能線。鉄道区分: 普通鉄道JR（11）。事業者種別: JR在来線（2）。

西鷹巣
type: Concept
alternative label: 西鷹巣（秋田内陸縦貫鉄道 秋田内陸線）
broader: g000680
in scheme: scheme
notation: 000680
scope note: 運営会社: 秋田内陸縦貫鉄道。路線名: 秋田内陸線。鉄道区分: 普通鉄道（12）。事業者種別: 第三セクター（5）。

土深井
type: Concept
alternative label: 土深井（東日本旅客鉄道 花輪線）
broader: g000681
in scheme: scheme
notation: 000681
scope note: 運営会社: 東日本旅客鉄道。路線名: 花輪線。鉄道区分: 普通鉄道JR（11）。事業者種別: JR在来線（2）。

富根
type: Concept
alternative label: 富根（東日本旅客鉄道 奥羽線）
broader: g000682
in scheme: scheme
notation: 000682
scope note: 運営会社: 東日本旅客鉄道。路線名: 奥羽線。鉄道区分: 普通鉄道JR（11）。事業者種別: JR在来線（2）。

前山
type: Concept
alternative label: 前山（東日本旅客鉄道 奥羽線）
broader: g000683
in scheme: scheme
notation: 000683
scope note: 運営会社: 東日本旅客鉄道。路線名: 奥羽線。鉄道区分: 普通鉄道JR（11）。事業者種別: JR在来線（2）。

十二所
type: Concept
alternative label: 十二所（東日本旅客鉄道 花輪線）
broader: g000684
in scheme: scheme
notation: 000684
scope note: 運営会社: 東日本旅客鉄道。路線名: 花輪線。鉄道区分: 普通鉄道JR（11）。事業者種別: JR在来線（2）。

二ツ井
type: Concept
alternative label: 二ツ井（東日本旅客鉄道 奥羽線）
broader: g000685
in scheme: scheme
notation: 000685
scope note: 運営会社: 東日本旅客鉄道。路線名: 奥羽線。鉄道区分: 普通鉄道JR（11）。事業者種別: JR在来線（2）。

一戸
type: Concept
alternative label: 一戸（アイジーアールいわて銀河鉄道 いわて銀河鉄道線）
broader: g000686
in scheme: scheme
notation: 000686
scope note: 運営会社: アイジーアールいわて銀河鉄道。路線名: いわて銀河鉄道線。鉄道区分: 普通鉄道（12）。事業者種別: 第三セクター（5）。

大滝温泉
type: Concept
alternative label: 大滝温泉（東日本旅客鉄道 花輪線）
broader: g000687
in scheme: scheme
notation: 000687
scope note: 運営会社: 東日本旅客鉄道。路線名: 花輪線。鉄道区分: 普通鉄道JR（11）。事業者種別: JR在来線（2）。

陸中夏井
type: Concept
alternative label: 陸中夏井（東日本旅客鉄道 八戸線）
broader: g000688
in scheme: scheme
notation: 000688
scope note: 運営会社: 東日本旅客鉄道。路線名: 八戸線。鉄道区分: 普通鉄道JR（11）。事業者種別: JR在来線（2）。

能代
type: Concept
alternative label: 能代（東日本旅客鉄道 五能線）
broader: g000689
in scheme: scheme
notation: 000689
scope note: 運営会社: 東日本旅客鉄道。路線名: 五能線。鉄道区分: 普通鉄道JR（11）。事業者種別: JR在来線（2）。

縄文小ヶ田
type: Concept
alternative label: 縄文小ヶ田（秋田内陸縦貫鉄道 秋田内陸線）
broader: g000690
in scheme: scheme
notation: 000690
scope note: 運営会社: 秋田内陸縦貫鉄道。路線名: 秋田内陸線。鉄道区分: 普通鉄道（12）。事業者種別: 第三セクター（5）。

鶴形
type: Concept
alternative label: 鶴形（東日本旅客鉄道 奥羽線）
broader: g000691
in scheme: scheme
notation: 000691
scope note: 運営会社: 東日本旅客鉄道。路線名: 奥羽線。鉄道区分: 普通鉄道JR（11）。事業者種別: JR在来線（2）。

東能代
type: Concept
alternative label: 東能代（東日本旅客鉄道 奥羽線）
broader: g000692
in scheme: scheme
notation: 000692
scope note: 運営会社: 東日本旅客鉄道。路線名: 奥羽線。鉄道区分: 普通鉄道JR（11）。事業者種別: JR在来線（2）。

東能代
type: Concept
alternative label: 東能代（東日本旅客鉄道 五能線）
broader: g000692
in scheme: scheme
notation: 000693
scope note: 運営会社: 東日本旅客鉄道。路線名: 五能線。鉄道区分: 普通鉄道JR（11）。事業者種別: JR在来線（2）。

久慈
type: Concept
alternative label: 久慈（東日本旅客鉄道 八戸線）
broader: g000694
in scheme: scheme
notation: 000694
scope note: 運営会社: 東日本旅客鉄道。路線名: 八戸線。鉄道区分: 普通鉄道JR（11）。事業者種別: JR在来線（2）。

久慈
type: Concept
alternative label: 久慈（三陸鉄道 北リアス線）
broader: g000694
in scheme: scheme
notation: 000695
scope note: 運営会社: 三陸鉄道。路線名: 北リアス線。鉄道区分: 普通鉄道（12）。事業者種別: 第三セクター（5）。

鹿角花輪
type: Concept
alternative label: 鹿角花輪（東日本旅客鉄道 花輪線）
broader: g000696
in scheme: scheme
notation: 000696
scope note: 運営会社: 東日本旅客鉄道。路線名: 花輪線。鉄道区分: 普通鉄道JR（11）。事業者種別: JR在来線（2）。

大野台
type: Concept
alternative label: 大野台（秋田内陸縦貫鉄道 秋田内陸線）
broader: g000697
in scheme: scheme
notation: 000697
scope note: 運営会社: 秋田内陸縦貫鉄道。路線名: 秋田内陸線。鉄道区分: 普通鉄道（12）。事業者種別: 第三セクター（5）。

小鳥谷
type: Concept
alternative label: 小鳥谷（アイジーアールいわて銀河鉄道 いわて銀河鉄道線）
broader: g000698
in scheme: scheme
notation: 000698
scope note: 運営会社: アイジーアールいわて銀河鉄道。路線名: いわて銀河鉄道線。鉄道区分: 普通鉄道（12）。事業者種別: 第三セクター（5）。

合川
type: Concept
alternative label: 合川（秋田内陸縦貫鉄道 秋田内陸線）
broader: g000699
in scheme: scheme
notation: 000699
scope note: 運営会社: 秋田内陸縦貫鉄道。路線名: 秋田内陸線。鉄道区分: 普通鉄道（12）。事業者種別: 第三セクター（5）。

陸中大里
type: Concept
alternative label: 陸中大里（東日本旅客鉄道 花輪線）
broader: g000700
in scheme: scheme
notation: 000700
scope note: 運営会社: 東日本旅客鉄道。路線名: 花輪線。鉄道区分: 普通鉄道JR（11）。事業者種別: JR在来線（2）。

上杉
type: Concept
alternative label: 上杉（秋田内陸縦貫鉄道 秋田内陸線）
broader: g000701
in scheme: scheme
notation: 000701
scope note: 運営会社: 秋田内陸縦貫鉄道。路線名: 秋田内陸線。鉄道区分: 普通鉄道（12）。事業者種別: 第三セクター（5）。

八幡平
type: Concept
alternative label: 八幡平（東日本旅客鉄道 花輪線）
broader: g000702
in scheme: scheme
notation: 000702
scope note: 運営会社: 東日本旅客鉄道。路線名: 花輪線。鉄道区分: 普通鉄道JR（11）。事業者種別: JR在来線（2）。

北金岡
type: Concept
alternative label: 北金岡（東日本旅客鉄道 奥羽線）
broader: g000703
in scheme: scheme
notation: 000703
scope note: 運営会社: 東日本旅客鉄道。路線名: 奥羽線。鉄道区分: 普通鉄道JR（11）。事業者種別: JR在来線（2）。

田山
type: Concept
alternative label: 田山（東日本旅客鉄道 花輪線）
broader: g000704
in scheme: scheme
notation: 000704
scope note: 運営会社: 東日本旅客鉄道。路線名: 花輪線。鉄道区分: 普通鉄道JR（11）。事業者種別: JR在来線（2）。

陸中宇部
type: Concept
alternative label: 陸中宇部（三陸鉄道 北リアス線）
broader: g000705
in scheme: scheme
notation: 000705
scope note: 運営会社: 三陸鉄道。路線名: 北リアス線。鉄道区分: 普通鉄道（12）。事業者種別: 第三セクター（5）。

米内沢
type: Concept
alternative label: 米内沢（秋田内陸縦貫鉄道 秋田内陸線）
broader: g000706
in scheme: scheme
notation: 000706
scope note: 運営会社: 秋田内陸縦貫鉄道。路線名: 秋田内陸線。鉄道区分: 普通鉄道（12）。事業者種別: 第三セクター（5）。

小繋
type: Concept
alternative label: 小繋（アイジーアールいわて銀河鉄道 いわて銀河鉄道線）
broader: g000707
in scheme: scheme
notation: 000707
scope note: 運営会社: アイジーアールいわて銀河鉄道。路線名: いわて銀河鉄道線。鉄道区分: 普通鉄道（12）。事業者種別: 第三セクター（5）。

湯瀬温泉
type: Concept
alternative label: 湯瀬温泉（東日本旅客鉄道 花輪線）
broader: g000708
in scheme: scheme
notation: 000708
scope note: 運営会社: 東日本旅客鉄道。路線名: 花輪線。鉄道区分: 普通鉄道JR（11）。事業者種別: JR在来線（2）。

陸中野田
type: Concept
alternative label: 陸中野田（三陸鉄道 北リアス線）
broader: g000709
in scheme: scheme
notation: 000709
scope note: 運営会社: 三陸鉄道。路線名: 北リアス線。鉄道区分: 普通鉄道（12）。事業者種別: 第三セクター（5）。

兄畑
type: Concept
alternative label: 兄畑（東日本旅客鉄道 花輪線）
broader: g000710
in scheme: scheme
notation: 000710
scope note: 運営会社: 東日本旅客鉄道。路線名: 花輪線。鉄道区分: 普通鉄道JR（11）。事業者種別: JR在来線（2）。

横間
type: Concept
alternative label: 横間（東日本旅客鉄道 花輪線）
broader: g000711
in scheme: scheme
notation: 000711
scope note: 運営会社: 東日本旅客鉄道。路線名: 花輪線。鉄道区分: 普通鉄道JR（11）。事業者種別: JR在来線（2）。

森岳
type: Concept
alternative label: 森岳（東日本旅客鉄道 奥羽線）
broader: g000712
in scheme: scheme
notation: 000712
scope note: 運営会社: 東日本旅客鉄道。路線名: 奥羽線。鉄道区分: 普通鉄道JR（11）。事業者種別: JR在来線（2）。

桂瀬
type: Concept
alternative label: 桂瀬（秋田内陸縦貫鉄道 秋田内陸線）
broader: g000713
in scheme: scheme
notation: 000713
scope note: 運営会社: 秋田内陸縦貫鉄道。路線名: 秋田内陸線。鉄道区分: 普通鉄道（12）。事業者種別: 第三セクター（5）。

荒屋新町
type: Concept
alternative label: 荒屋新町（東日本旅客鉄道 花輪線）
broader: g000714
in scheme: scheme
notation: 000714
scope note: 運営会社: 東日本旅客鉄道。路線名: 花輪線。鉄道区分: 普通鉄道JR（11）。事業者種別: JR在来線（2）。

十府ヶ浦海岸
type: Concept
alternative label: 十府ヶ浦海岸（三陸鉄道 北リアス線）
broader: g000715
in scheme: scheme
notation: 000715
scope note: 運営会社: 三陸鉄道。路線名: 北リアス線。鉄道区分: 普通鉄道（12）。事業者種別: 第三セクター（5）。

野田玉川
type: Concept
alternative label: 野田玉川（三陸鉄道 北リアス線）
broader: g000716
in scheme: scheme
notation: 000716
scope note: 運営会社: 三陸鉄道。路線名: 北リアス線。鉄道区分: 普通鉄道（12）。事業者種別: 第三セクター（5）。

小屋の畑
type: Concept
alternative label: 小屋の畑（東日本旅客鉄道 花輪線）
broader: g000717
in scheme: scheme
notation: 000717
scope note: 運営会社: 東日本旅客鉄道。路線名: 花輪線。鉄道区分: 普通鉄道JR（11）。事業者種別: JR在来線（2）。

奥中山高原
type: Concept
alternative label: 奥中山高原（アイジーアールいわて銀河鉄道 いわて銀河鉄道線）
broader: g000718
in scheme: scheme
notation: 000718
scope note: 運営会社: アイジーアールいわて銀河鉄道。路線名: いわて銀河鉄道線。鉄道区分: 普通鉄道（12）。事業者種別: 第三セクター（5）。

阿仁前田温泉
type: Concept
alternative label: 阿仁前田温泉（秋田内陸縦貫鉄道 秋田内陸線）
broader: g000719
in scheme: scheme
notation: 000719
scope note: 運営会社: 秋田内陸縦貫鉄道。路線名: 秋田内陸線。鉄道区分: 普通鉄道（12）。事業者種別: 第三セクター（5）。

堀内
type: Concept
alternative label: 堀内（三陸鉄道 北リアス線）
broader: g000720
in scheme: scheme
notation: 000720
scope note: 運営会社: 三陸鉄道。路線名: 北リアス線。鉄道区分: 普通鉄道（12）。事業者種別: 第三セクター（5）。

前田南
type: Concept
alternative label: 前田南（秋田内陸縦貫鉄道 秋田内陸線）
broader: g000721
in scheme: scheme
notation: 000721
scope note: 運営会社: 秋田内陸縦貫鉄道。路線名: 秋田内陸線。鉄道区分: 普通鉄道（12）。事業者種別: 第三セクター（5）。

赤坂田
type: Concept
alternative label: 赤坂田（東日本旅客鉄道 花輪線）
broader: g000722
in scheme: scheme
notation: 000722
scope note: 運営会社: 東日本旅客鉄道。路線名: 花輪線。鉄道区分: 普通鉄道JR（11）。事業者種別: JR在来線（2）。

鹿渡
type: Concept
alternative label: 鹿渡（東日本旅客鉄道 奥羽線）
broader: g000723
in scheme: scheme
notation: 000723
scope note: 運営会社: 東日本旅客鉄道。路線名: 奥羽線。鉄道区分: 普通鉄道JR（11）。事業者種別: JR在来線（2）。

小渕
type: Concept
alternative label: 小渕（秋田内陸縦貫鉄道 秋田内陸線）
broader: g000724
in scheme: scheme
notation: 000724
scope note: 運営会社: 秋田内陸縦貫鉄道。路線名: 秋田内陸線。鉄道区分: 普通鉄道（12）。事業者種別: 第三セクター（5）。

白井海岸
type: Concept
alternative label: 白井海岸（三陸鉄道 北リアス線）
broader: g000725
in scheme: scheme
notation: 000725
scope note: 運営会社: 三陸鉄道。路線名: 北リアス線。鉄道区分: 普通鉄道（12）。事業者種別: 第三セクター（5）。

安比高原
type: Concept
alternative label: 安比高原（東日本旅客鉄道 花輪線）
broader: g000726
in scheme: scheme
notation: 000726
scope note: 運営会社: 東日本旅客鉄道。路線名: 花輪線。鉄道区分: 普通鉄道JR（11）。事業者種別: JR在来線（2）。

御堂
type: Concept
alternative label: 御堂（アイジーアールいわて銀河鉄道 いわて銀河鉄道線）
broader: g000727
in scheme: scheme
notation: 000727
scope note: 運営会社: アイジーアールいわて銀河鉄道。路線名: いわて銀河鉄道線。鉄道区分: 普通鉄道（12）。事業者種別: 第三セクター（5）。

普代
type: Concept
alternative label: 普代（三陸鉄道 北リアス線）
broader: g000728
in scheme: scheme
notation: 000728
scope note: 運営会社: 三陸鉄道。路線名: 北リアス線。鉄道区分: 普通鉄道（12）。事業者種別: 第三セクター（5）。

阿仁合
type: Concept
alternative label: 阿仁合（秋田内陸縦貫鉄道 秋田内陸線）
broader: g000729
in scheme: scheme
notation: 000729
scope note: 運営会社: 秋田内陸縦貫鉄道。路線名: 秋田内陸線。鉄道区分: 普通鉄道（12）。事業者種別: 第三セクター（5）。

鯉川
type: Concept
alternative label: 鯉川（東日本旅客鉄道 奥羽線）
broader: g000730
in scheme: scheme
notation: 000730
scope note: 運営会社: 東日本旅客鉄道。路線名: 奥羽線。鉄道区分: 普通鉄道JR（11）。事業者種別: JR在来線（2）。

荒瀬
type: Concept
alternative label: 荒瀬（秋田内陸縦貫鉄道 秋田内陸線）
broader: g000731
in scheme: scheme
notation: 000731
scope note: 運営会社: 秋田内陸縦貫鉄道。路線名: 秋田内陸線。鉄道区分: 普通鉄道（12）。事業者種別: 第三セクター（5）。

松尾八幡平
type: Concept
alternative label: 松尾八幡平（東日本旅客鉄道 花輪線）
broader: g000732
in scheme: scheme
notation: 000732
scope note: 運営会社: 東日本旅客鉄道。路線名: 花輪線。鉄道区分: 普通鉄道JR（11）。事業者種別: JR在来線（2）。

いわて沼宮内
type: Concept
alternative label: いわて沼宮内（東日本旅客鉄道 東北新幹線）
broader: g000733
in scheme: scheme
notation: 000733
scope note: 運営会社: 東日本旅客鉄道。路線名: 東北新幹線。鉄道区分: 普通鉄道JR（11）。事業者種別: JRの新幹線（1）。

いわて沼宮内
type: Concept
alternative label: いわて沼宮内（アイジーアールいわて銀河鉄道 いわて銀河鉄道線）
broader: g000733
in scheme: scheme
notation: 000734
scope note: 運営会社: アイジーアールいわて銀河鉄道。路線名: いわて銀河鉄道線。鉄道区分: 普通鉄道（12）。事業者種別: 第三セクター（5）。

萱草
type: Concept
alternative label: 萱草（秋田内陸縦貫鉄道 秋田内陸線）
broader: g000735
in scheme: scheme
notation: 000735
scope note: 運営会社: 秋田内陸縦貫鉄道。路線名: 秋田内陸線。鉄道区分: 普通鉄道（12）。事業者種別: 第三セクター（5）。

北森
type: Concept
alternative label: 北森（東日本旅客鉄道 花輪線）
broader: g000736
in scheme: scheme
notation: 000736
scope note: 運営会社: 東日本旅客鉄道。路線名: 花輪線。鉄道区分: 普通鉄道JR（11）。事業者種別: JR在来線（2）。

平館
type: Concept
alternative label: 平館（東日本旅客鉄道 花輪線）
broader: g000737
in scheme: scheme
notation: 000737
scope note: 運営会社: 東日本旅客鉄道。路線名: 花輪線。鉄道区分: 普通鉄道JR（11）。事業者種別: JR在来線（2）。

八郎潟
type: Concept
alternative label: 八郎潟（東日本旅客鉄道 奥羽線）
broader: g000738
in scheme: scheme
notation: 000738
scope note: 運営会社: 東日本旅客鉄道。路線名: 奥羽線。鉄道区分: 普通鉄道JR（11）。事業者種別: JR在来線（2）。

笑内
type: Concept
alternative label: 笑内（秋田内陸縦貫鉄道 秋田内陸線）
broader: g000739
in scheme: scheme
notation: 000739
scope note: 運営会社: 秋田内陸縦貫鉄道。路線名: 秋田内陸線。鉄道区分: 普通鉄道（12）。事業者種別: 第三セクター（5）。

田野畑
type: Concept
alternative label: 田野畑（三陸鉄道 北リアス線）
broader: g000740
in scheme: scheme
notation: 000740
scope note: 運営会社: 三陸鉄道。路線名: 北リアス線。鉄道区分: 普通鉄道（12）。事業者種別: 第三セクター（5）。

岩野目
type: Concept
alternative label: 岩野目（秋田内陸縦貫鉄道 秋田内陸線）
broader: g000741
in scheme: scheme
notation: 000741
scope note: 運営会社: 秋田内陸縦貫鉄道。路線名: 秋田内陸線。鉄道区分: 普通鉄道（12）。事業者種別: 第三セクター（5）。

阿仁マタギ
type: Concept
alternative label: 阿仁マタギ（秋田内陸縦貫鉄道 秋田内陸線）
broader: g000742
in scheme: scheme
notation: 000742
scope note: 運営会社: 秋田内陸縦貫鉄道。路線名: 秋田内陸線。鉄道区分: 普通鉄道（12）。事業者種別: 第三セクター（5）。

岩手川口
type: Concept
alternative label: 岩手川口（アイジーアールいわて銀河鉄道 いわて銀河鉄道線）
broader: g000743
in scheme: scheme
notation: 000743
scope note: 運営会社: アイジーアールいわて銀河鉄道。路線名: いわて銀河鉄道線。鉄道区分: 普通鉄道（12）。事業者種別: 第三セクター（5）。

島越
type: Concept
alternative label: 島越（三陸鉄道 北リアス線）
broader: g000744
in scheme: scheme
notation: 000744
scope note: 運営会社: 三陸鉄道。路線名: 北リアス線。鉄道区分: 普通鉄道（12）。事業者種別: 第三セクター（5）。

脇本
type: Concept
alternative label: 脇本（東日本旅客鉄道 男鹿線）
broader: g000745
in scheme: scheme
notation: 000745
scope note: 運営会社: 東日本旅客鉄道。路線名: 男鹿線。鉄道区分: 普通鉄道JR（11）。事業者種別: JR在来線（2）。

大更
type: Concept
alternative label: 大更（東日本旅客鉄道 花輪線）
broader: g000746
in scheme: scheme
notation: 000746
scope note: 運営会社: 東日本旅客鉄道。路線名: 花輪線。鉄道区分: 普通鉄道JR（11）。事業者種別: JR在来線（2）。

井川さくら
type: Concept
alternative label: 井川さくら（東日本旅客鉄道 奥羽線）
broader: g000747
in scheme: scheme
notation: 000747
scope note: 運営会社: 東日本旅客鉄道。路線名: 奥羽線。鉄道区分: 普通鉄道JR（11）。事業者種別: JR在来線（2）。

奥阿仁
type: Concept
alternative label: 奥阿仁（秋田内陸縦貫鉄道 秋田内陸線）
broader: g000748
in scheme: scheme
notation: 000748
scope note: 運営会社: 秋田内陸縦貫鉄道。路線名: 秋田内陸線。鉄道区分: 普通鉄道（12）。事業者種別: 第三セクター（5）。

比立内
type: Concept
alternative label: 比立内（秋田内陸縦貫鉄道 秋田内陸線）
broader: g000749
in scheme: scheme
notation: 000749
scope note: 運営会社: 秋田内陸縦貫鉄道。路線名: 秋田内陸線。鉄道区分: 普通鉄道（12）。事業者種別: 第三セクター（5）。

船越
type: Concept
alternative label: 船越（東日本旅客鉄道 男鹿線）
broader: g000750
in scheme: scheme
notation: 000750
scope note: 運営会社: 東日本旅客鉄道。路線名: 男鹿線。鉄道区分: 普通鉄道JR（11）。事業者種別: JR在来線（2）。

羽立
type: Concept
alternative label: 羽立（東日本旅客鉄道 男鹿線）
broader: g000751
in scheme: scheme
notation: 000751
scope note: 運営会社: 東日本旅客鉄道。路線名: 男鹿線。鉄道区分: 普通鉄道JR（11）。事業者種別: JR在来線（2）。

東大更
type: Concept
alternative label: 東大更（東日本旅客鉄道 花輪線）
broader: g000752
in scheme: scheme
notation: 000752
scope note: 運営会社: 東日本旅客鉄道。路線名: 花輪線。鉄道区分: 普通鉄道JR（11）。事業者種別: JR在来線（2）。

羽後飯塚
type: Concept
alternative label: 羽後飯塚（東日本旅客鉄道 奥羽線）
broader: g000753
in scheme: scheme
notation: 000753
scope note: 運営会社: 東日本旅客鉄道。路線名: 奥羽線。鉄道区分: 普通鉄道JR（11）。事業者種別: JR在来線（2）。

天王
type: Concept
alternative label: 天王（東日本旅客鉄道 男鹿線）
broader: g000754
in scheme: scheme
notation: 000754
scope note: 運営会社: 東日本旅客鉄道。路線名: 男鹿線。鉄道区分: 普通鉄道JR（11）。事業者種別: JR在来線（2）。

男鹿
type: Concept
alternative label: 男鹿（東日本旅客鉄道 男鹿線）
broader: g000755
in scheme: scheme
notation: 000755
scope note: 運営会社: 東日本旅客鉄道。路線名: 男鹿線。鉄道区分: 普通鉄道JR（11）。事業者種別: JR在来線（2）。

二田
type: Concept
alternative label: 二田（東日本旅客鉄道 男鹿線）
broader: g000756
in scheme: scheme
notation: 000756
scope note: 運営会社: 東日本旅客鉄道。路線名: 男鹿線。鉄道区分: 普通鉄道JR（11）。事業者種別: JR在来線（2）。

好摩
type: Concept
alternative label: 好摩（東日本旅客鉄道 花輪線）
broader: g000757
in scheme: scheme
notation: 000757
scope note: 運営会社: 東日本旅客鉄道。路線名: 花輪線。鉄道区分: 普通鉄道JR（11）。事業者種別: JR在来線（2）。

好摩
type: Concept
alternative label: 好摩（アイジーアールいわて銀河鉄道 いわて銀河鉄道線）
broader: g000757
in scheme: scheme
notation: 000758
scope note: 運営会社: アイジーアールいわて銀河鉄道。路線名: いわて銀河鉄道線。鉄道区分: 普通鉄道（12）。事業者種別: 第三セクター（5）。

大久保
type: Concept
alternative label: 大久保（東日本旅客鉄道 奥羽線）
broader: g000759
in scheme: scheme
notation: 000759
scope note: 運営会社: 東日本旅客鉄道。路線名: 奥羽線。鉄道区分: 普通鉄道JR（11）。事業者種別: JR在来線（2）。

上二田
type: Concept
alternative label: 上二田（東日本旅客鉄道 男鹿線）
broader: g000760
in scheme: scheme
notation: 000760
scope note: 運営会社: 東日本旅客鉄道。路線名: 男鹿線。鉄道区分: 普通鉄道JR（11）。事業者種別: JR在来線（2）。

戸沢
type: Concept
alternative label: 戸沢（秋田内陸縦貫鉄道 秋田内陸線）
broader: g000761
in scheme: scheme
notation: 000761
scope note: 運営会社: 秋田内陸縦貫鉄道。路線名: 秋田内陸線。鉄道区分: 普通鉄道（12）。事業者種別: 第三セクター（5）。

出戸浜
type: Concept
alternative label: 出戸浜（東日本旅客鉄道 男鹿線）
broader: g000762
in scheme: scheme
notation: 000762
scope note: 運営会社: 東日本旅客鉄道。路線名: 男鹿線。鉄道区分: 普通鉄道JR（11）。事業者種別: JR在来線（2）。

岩泉小本
type: Concept
alternative label: 岩泉小本（三陸鉄道 北リアス線）
broader: g000763
in scheme: scheme
notation: 000763
scope note: 運営会社: 三陸鉄道。路線名: 北リアス線。鉄道区分: 普通鉄道（12）。事業者種別: 第三セクター（5）。

渋民
type: Concept
alternative label: 渋民（アイジーアールいわて銀河鉄道 いわて銀河鉄道線）
broader: g000764
in scheme: scheme
notation: 000764
scope note: 運営会社: アイジーアールいわて銀河鉄道。路線名: いわて銀河鉄道線。鉄道区分: 普通鉄道（12）。事業者種別: 第三セクター（5）。

上桧木内
type: Concept
alternative label: 上桧木内（秋田内陸縦貫鉄道 秋田内陸線）
broader: g000765
in scheme: scheme
notation: 000765
scope note: 運営会社: 秋田内陸縦貫鉄道。路線名: 秋田内陸線。鉄道区分: 普通鉄道（12）。事業者種別: 第三セクター（5）。

追分
type: Concept
alternative label: 追分（東日本旅客鉄道 奥羽線）
broader: g000766
in scheme: scheme
notation: 000766
scope note: 運営会社: 東日本旅客鉄道。路線名: 奥羽線。鉄道区分: 普通鉄道JR（11）。事業者種別: JR在来線（2）。

追分
type: Concept
alternative label: 追分（東日本旅客鉄道 男鹿線）
broader: g000766
in scheme: scheme
notation: 000767
scope note: 運営会社: 東日本旅客鉄道。路線名: 男鹿線。鉄道区分: 普通鉄道JR（11）。事業者種別: JR在来線（2）。

摂待
type: Concept
alternative label: 摂待（三陸鉄道 北リアス線）
broader: g000768
in scheme: scheme
notation: 000768
scope note: 運営会社: 三陸鉄道。路線名: 北リアス線。鉄道区分: 普通鉄道（12）。事業者種別: 第三セクター（5）。

左通
type: Concept
alternative label: 左通（秋田内陸縦貫鉄道 秋田内陸線）
broader: g000769
in scheme: scheme
notation: 000769
scope note: 運営会社: 秋田内陸縦貫鉄道。路線名: 秋田内陸線。鉄道区分: 普通鉄道（12）。事業者種別: 第三セクター（5）。

滝沢
type: Concept
alternative label: 滝沢（アイジーアールいわて銀河鉄道 いわて銀河鉄道線）
broader: g000770
in scheme: scheme
notation: 000770
scope note: 運営会社: アイジーアールいわて銀河鉄道。路線名: いわて銀河鉄道線。鉄道区分: 普通鉄道（12）。事業者種別: 第三セクター（5）。

巣子
type: Concept
alternative label: 巣子（アイジーアールいわて銀河鉄道 いわて銀河鉄道線）
broader: g000771
in scheme: scheme
notation: 000771
scope note: 運営会社: アイジーアールいわて銀河鉄道。路線名: いわて銀河鉄道線。鉄道区分: 普通鉄道（12）。事業者種別: 第三セクター（5）。

上飯島
type: Concept
alternative label: 上飯島（東日本旅客鉄道 奥羽線）
broader: g000772
in scheme: scheme
notation: 000772
scope note: 運営会社: 東日本旅客鉄道。路線名: 奥羽線。鉄道区分: 普通鉄道JR（11）。事業者種別: JR在来線（2）。

羽後中里
type: Concept
alternative label: 羽後中里（秋田内陸縦貫鉄道 秋田内陸線）
broader: g000773
in scheme: scheme
notation: 000773
scope note: 運営会社: 秋田内陸縦貫鉄道。路線名: 秋田内陸線。鉄道区分: 普通鉄道（12）。事業者種別: 第三セクター（5）。

土崎
type: Concept
alternative label: 土崎（東日本旅客鉄道 奥羽線）
broader: g000774
in scheme: scheme
notation: 000774
scope note: 運営会社: 東日本旅客鉄道。路線名: 奥羽線。鉄道区分: 普通鉄道JR（11）。事業者種別: JR在来線（2）。

松葉
type: Concept
alternative label: 松葉（秋田内陸縦貫鉄道 秋田内陸線）
broader: g000775
in scheme: scheme
notation: 000775
scope note: 運営会社: 秋田内陸縦貫鉄道。路線名: 秋田内陸線。鉄道区分: 普通鉄道（12）。事業者種別: 第三セクター（5）。

厨川
type: Concept
alternative label: 厨川（アイジーアールいわて銀河鉄道 いわて銀河鉄道線）
broader: g000776
in scheme: scheme
notation: 000776
scope note: 運営会社: アイジーアールいわて銀河鉄道。路線名: いわて銀河鉄道線。鉄道区分: 普通鉄道（12）。事業者種別: 第三セクター（5）。

上米内
type: Concept
alternative label: 上米内（東日本旅客鉄道 山田線）
broader: g000777
in scheme: scheme
notation: 000777
scope note: 運営会社: 東日本旅客鉄道。路線名: 山田線。鉄道区分: 普通鉄道JR（11）。事業者種別: JR在来線（2）。

泉外旭川
type: Concept
alternative label: 泉外旭川（東日本旅客鉄道 奥羽線）
broader: g000778
in scheme: scheme
notation: 000778
scope note: 運営会社: 東日本旅客鉄道。路線名: 奥羽線。鉄道区分: 普通鉄道JR（11）。事業者種別: JR在来線（2）。

新田老
type: Concept
alternative label: 新田老（三陸鉄道 北リアス線）
broader: g000779
in scheme: scheme
notation: 000779
scope note: 運営会社: 三陸鉄道。路線名: 北リアス線。鉄道区分: 普通鉄道（12）。事業者種別: 第三セクター（5）。

田老
type: Concept
alternative label: 田老（三陸鉄道 北リアス線）
broader: g000780
in scheme: scheme
notation: 000780
scope note: 運営会社: 三陸鉄道。路線名: 北リアス線。鉄道区分: 普通鉄道（12）。事業者種別: 第三セクター（5）。

羽後長戸呂
type: Concept
alternative label: 羽後長戸呂（秋田内陸縦貫鉄道 秋田内陸線）
broader: g000781
in scheme: scheme
notation: 000781
scope note: 運営会社: 秋田内陸縦貫鉄道。路線名: 秋田内陸線。鉄道区分: 普通鉄道（12）。事業者種別: 第三セクター（5）。

青山
type: Concept
alternative label: 青山（アイジーアールいわて銀河鉄道 いわて銀河鉄道線）
broader: g000782
in scheme: scheme
notation: 000782
scope note: 運営会社: アイジーアールいわて銀河鉄道。路線名: いわて銀河鉄道線。鉄道区分: 普通鉄道（12）。事業者種別: 第三セクター（5）。

秋田
type: Concept
alternative label: 秋田（東日本旅客鉄道 奥羽線）
broader: g000783
in scheme: scheme
notation: 000783
scope note: 運営会社: 東日本旅客鉄道。路線名: 奥羽線。鉄道区分: 普通鉄道JR（11）。事業者種別: JR在来線（2）。

秋田
type: Concept
alternative label: 秋田（東日本旅客鉄道 羽越線）
broader: g000783
in scheme: scheme
notation: 000784
scope note: 運営会社: 東日本旅客鉄道。路線名: 羽越線。鉄道区分: 普通鉄道JR（11）。事業者種別: JR在来線（2）。

山岸
type: Concept
alternative label: 山岸（東日本旅客鉄道 山田線）
broader: g000785
in scheme: scheme
notation: 000785
scope note: 運営会社: 東日本旅客鉄道。路線名: 山田線。鉄道区分: 普通鉄道JR（11）。事業者種別: JR在来線（2）。

大釜
type: Concept
alternative label: 大釜（東日本旅客鉄道 田沢湖線）
broader: g000786
in scheme: scheme
notation: 000786
scope note: 運営会社: 東日本旅客鉄道。路線名: 田沢湖線。鉄道区分: 普通鉄道JR（11）。事業者種別: JR在来線（2）。

上盛岡
type: Concept
alternative label: 上盛岡（東日本旅客鉄道 山田線）
broader: g000787
in scheme: scheme
notation: 000787
scope note: 運営会社: 東日本旅客鉄道。路線名: 山田線。鉄道区分: 普通鉄道JR（11）。事業者種別: JR在来線（2）。

佐羽根
type: Concept
alternative label: 佐羽根（三陸鉄道 北リアス線）
broader: g000788
in scheme: scheme
notation: 000788
scope note: 運営会社: 三陸鉄道。路線名: 北リアス線。鉄道区分: 普通鉄道（12）。事業者種別: 第三セクター（5）。

小岩井
type: Concept
alternative label: 小岩井（東日本旅客鉄道 田沢湖線）
broader: g000789
in scheme: scheme
notation: 000789
scope note: 運営会社: 東日本旅客鉄道。路線名: 田沢湖線。鉄道区分: 普通鉄道JR（11）。事業者種別: JR在来線（2）。

盛岡
type: Concept
alternative label: 盛岡（東日本旅客鉄道 東北新幹線）
broader: g000792
in scheme: scheme
notation: 000790
scope note: 運営会社: 東日本旅客鉄道。路線名: 東北新幹線。鉄道区分: 普通鉄道JR（11）。事業者種別: JRの新幹線（1）。

盛岡
type: Concept
alternative label: 盛岡（東日本旅客鉄道 田沢湖線）
broader: g000792
in scheme: scheme
notation: 000791
scope note: 運営会社: 東日本旅客鉄道。路線名: 田沢湖線。鉄道区分: 普通鉄道JR（11）。事業者種別: JR在来線（2）。

盛岡
type: Concept
alternative label: 盛岡（東日本旅客鉄道 山田線）
broader: g000792
in scheme: scheme
notation: 000792
scope note: 運営会社: 東日本旅客鉄道。路線名: 山田線。鉄道区分: 普通鉄道JR（11）。事業者種別: JR在来線（2）。

盛岡
type: Concept
alternative label: 盛岡（東日本旅客鉄道 東北線）
broader: g000792
in scheme: scheme
notation: 000793
scope note: 運営会社: 東日本旅客鉄道。路線名: 東北線。鉄道区分: 普通鉄道JR（11）。事業者種別: JR在来線（2）。

盛岡
type: Concept
alternative label: 盛岡（アイジーアールいわて銀河鉄道 いわて銀河鉄道線）
broader: g000792
in scheme: scheme
notation: 000794
scope note: 運営会社: アイジーアールいわて銀河鉄道。路線名: いわて銀河鉄道線。鉄道区分: 普通鉄道（12）。事業者種別: 第三セクター（5）。

田沢湖
type: Concept
alternative label: 田沢湖（東日本旅客鉄道 田沢湖線）
broader: g000795
in scheme: scheme
notation: 000795
scope note: 運営会社: 東日本旅客鉄道。路線名: 田沢湖線。鉄道区分: 普通鉄道JR（11）。事業者種別: JR在来線（2）。

羽後牛島
type: Concept
alternative label: 羽後牛島（東日本旅客鉄道 羽越線）
broader: g000796
in scheme: scheme
notation: 000796
scope note: 運営会社: 東日本旅客鉄道。路線名: 羽越線。鉄道区分: 普通鉄道JR（11）。事業者種別: JR在来線（2）。

春木場
type: Concept
alternative label: 春木場（東日本旅客鉄道 田沢湖線）
broader: g000797
in scheme: scheme
notation: 000797
scope note: 運営会社: 東日本旅客鉄道。路線名: 田沢湖線。鉄道区分: 普通鉄道JR（11）。事業者種別: JR在来線（2）。

雫石
type: Concept
alternative label: 雫石（東日本旅客鉄道 田沢湖線）
broader: g000798
in scheme: scheme
notation: 000798
scope note: 運営会社: 東日本旅客鉄道。路線名: 田沢湖線。鉄道区分: 普通鉄道JR（11）。事業者種別: JR在来線（2）。

八津
type: Concept
alternative label: 八津（秋田内陸縦貫鉄道 秋田内陸線）
broader: g000799
in scheme: scheme
notation: 000799
scope note: 運営会社: 秋田内陸縦貫鉄道。路線名: 秋田内陸線。鉄道区分: 普通鉄道（12）。事業者種別: 第三セクター（5）。

仙北町
type: Concept
alternative label: 仙北町（東日本旅客鉄道 東北線）
broader: g000800
in scheme: scheme
notation: 000800
scope note: 運営会社: 東日本旅客鉄道。路線名: 東北線。鉄道区分: 普通鉄道JR（11）。事業者種別: JR在来線（2）。

一の渡
type: Concept
alternative label: 一の渡（三陸鉄道 北リアス線）
broader: g000801
in scheme: scheme
notation: 000801
scope note: 運営会社: 三陸鉄道。路線名: 北リアス線。鉄道区分: 普通鉄道（12）。事業者種別: 第三セクター（5）。

赤渕
type: Concept
alternative label: 赤渕（東日本旅客鉄道 田沢湖線）
broader: g000802
in scheme: scheme
notation: 000802
scope note: 運営会社: 東日本旅客鉄道。路線名: 田沢湖線。鉄道区分: 普通鉄道JR（11）。事業者種別: JR在来線（2）。

新屋
type: Concept
alternative label: 新屋（東日本旅客鉄道 羽越線）
broader: g000803
in scheme: scheme
notation: 000803
scope note: 運営会社: 東日本旅客鉄道。路線名: 羽越線。鉄道区分: 普通鉄道JR（11）。事業者種別: JR在来線（2）。

刺巻
type: Concept
alternative label: 刺巻（東日本旅客鉄道 田沢湖線）
broader: g000804
in scheme: scheme
notation: 000804
scope note: 運営会社: 東日本旅客鉄道。路線名: 田沢湖線。鉄道区分: 普通鉄道JR（11）。事業者種別: JR在来線（2）。

大張野
type: Concept
alternative label: 大張野（東日本旅客鉄道 奥羽線）
broader: g000805
in scheme: scheme
notation: 000805
scope note: 運営会社: 東日本旅客鉄道。路線名: 奥羽線。鉄道区分: 普通鉄道JR（11）。事業者種別: JR在来線（2）。

四ツ小屋
type: Concept
alternative label: 四ツ小屋（東日本旅客鉄道 奥羽線）
broader: g000806
in scheme: scheme
notation: 000806
scope note: 運営会社: 東日本旅客鉄道。路線名: 奥羽線。鉄道区分: 普通鉄道JR（11）。事業者種別: JR在来線（2）。

岩手飯岡
type: Concept
alternative label: 岩手飯岡（東日本旅客鉄道 東北線）
broader: g000807
in scheme: scheme
notation: 000807
scope note: 運営会社: 東日本旅客鉄道。路線名: 東北線。鉄道区分: 普通鉄道JR（11）。事業者種別: JR在来線（2）。

西明寺
type: Concept
alternative label: 西明寺（秋田内陸縦貫鉄道 秋田内陸線）
broader: g000808
in scheme: scheme
notation: 000808
scope note: 運営会社: 秋田内陸縦貫鉄道。路線名: 秋田内陸線。鉄道区分: 普通鉄道（12）。事業者種別: 第三セクター（5）。

区界
type: Concept
alternative label: 区界（東日本旅客鉄道 山田線）
broader: g000809
in scheme: scheme
notation: 000809
scope note: 運営会社: 東日本旅客鉄道。路線名: 山田線。鉄道区分: 普通鉄道JR（11）。事業者種別: JR在来線（2）。

和田
type: Concept
alternative label: 和田（東日本旅客鉄道 奥羽線）
broader: g000810
in scheme: scheme
notation: 000810
scope note: 運営会社: 東日本旅客鉄道。路線名: 奥羽線。鉄道区分: 普通鉄道JR（11）。事業者種別: JR在来線（2）。

桂根
type: Concept
alternative label: 桂根（東日本旅客鉄道 羽越線）
broader: g000811
in scheme: scheme
notation: 000811
scope note: 運営会社: 東日本旅客鉄道。路線名: 羽越線。鉄道区分: 普通鉄道JR（11）。事業者種別: JR在来線（2）。

山口団地
type: Concept
alternative label: 山口団地（三陸鉄道 北リアス線）
broader: g000812
in scheme: scheme
notation: 000812
scope note: 運営会社: 三陸鉄道。路線名: 北リアス線。鉄道区分: 普通鉄道（12）。事業者種別: 第三セクター（5）。

川内
type: Concept
alternative label: 川内（東日本旅客鉄道 山田線）
broader: g000813
in scheme: scheme
notation: 000813
scope note: 運営会社: 東日本旅客鉄道。路線名: 山田線。鉄道区分: 普通鉄道JR（11）。事業者種別: JR在来線（2）。

宮古
type: Concept
alternative label: 宮古（東日本旅客鉄道 山田線）
broader: g000814
in scheme: scheme
notation: 000814
scope note: 運営会社: 東日本旅客鉄道。路線名: 山田線。鉄道区分: 普通鉄道JR（11）。事業者種別: JR在来線（2）。

宮古
type: Concept
alternative label: 宮古（三陸鉄道 リアス線）
broader: g000814
in scheme: scheme
notation: 000815
scope note: 運営会社: 三陸鉄道。路線名: リアス線。鉄道区分: 普通鉄道（12）。事業者種別: 第三セクター（5）。

松草
type: Concept
alternative label: 松草（東日本旅客鉄道 山田線）
broader: g000816
in scheme: scheme
notation: 000816
scope note: 運営会社: 東日本旅客鉄道。路線名: 山田線。鉄道区分: 普通鉄道JR（11）。事業者種別: JR在来線（2）。

千徳
type: Concept
alternative label: 千徳（東日本旅客鉄道 山田線）
broader: g000817
in scheme: scheme
notation: 000817
scope note: 運営会社: 東日本旅客鉄道。路線名: 山田線。鉄道区分: 普通鉄道JR（11）。事業者種別: JR在来線（2）。

花原市
type: Concept
alternative label: 花原市（東日本旅客鉄道 山田線）
broader: g000818
in scheme: scheme
notation: 000818
scope note: 運営会社: 東日本旅客鉄道。路線名: 山田線。鉄道区分: 普通鉄道JR（11）。事業者種別: JR在来線（2）。

磯鶏
type: Concept
alternative label: 磯鶏（三陸鉄道 リアス線）
broader: g000819
in scheme: scheme
notation: 000819
scope note: 運営会社: 三陸鉄道。路線名: リアス線。鉄道区分: 普通鉄道（12）。事業者種別: 第三セクター（5）。

蟇目
type: Concept
alternative label: 蟇目（東日本旅客鉄道 山田線）
broader: g000820
in scheme: scheme
notation: 000820
scope note: 運営会社: 東日本旅客鉄道。路線名: 山田線。鉄道区分: 普通鉄道JR（11）。事業者種別: JR在来線（2）。

羽後太田
type: Concept
alternative label: 羽後太田（秋田内陸縦貫鉄道 秋田内陸線）
broader: g000821
in scheme: scheme
notation: 000821
scope note: 運営会社: 秋田内陸縦貫鉄道。路線名: 秋田内陸線。鉄道区分: 普通鉄道（12）。事業者種別: 第三セクター（5）。

神代
type: Concept
alternative label: 神代（東日本旅客鉄道 田沢湖線）
broader: g000823
in scheme: scheme
notation: 000823
scope note: 運営会社: 東日本旅客鉄道。路線名: 田沢湖線。鉄道区分: 普通鉄道JR（11）。事業者種別: JR在来線（2）。

茂市
type: Concept
alternative label: 茂市（東日本旅客鉄道 山田線）
broader: g000824
in scheme: scheme
notation: 000824
scope note: 運営会社: 東日本旅客鉄道。路線名: 山田線。鉄道区分: 普通鉄道JR（11）。事業者種別: JR在来線（2）。

下浜
type: Concept
alternative label: 下浜（東日本旅客鉄道 羽越線）
broader: g000825
in scheme: scheme
notation: 000825
scope note: 運営会社: 東日本旅客鉄道。路線名: 羽越線。鉄道区分: 普通鉄道JR（11）。事業者種別: JR在来線（2）。

八木沢・宮古短大
type: Concept
alternative label: 八木沢・宮古短大（三陸鉄道 リアス線）
broader: g000826
in scheme: scheme
notation: 000826
scope note: 運営会社: 三陸鉄道。路線名: リアス線。鉄道区分: 普通鉄道（12）。事業者種別: 第三セクター（5）。

羽後境
type: Concept
alternative label: 羽後境（東日本旅客鉄道 奥羽線）
broader: g000827
in scheme: scheme
notation: 000827
scope note: 運営会社: 東日本旅客鉄道。路線名: 奥羽線。鉄道区分: 普通鉄道JR（11）。事業者種別: JR在来線（2）。

箱石
type: Concept
alternative label: 箱石（東日本旅客鉄道 山田線）
broader: g000828
in scheme: scheme
notation: 000828
scope note: 運営会社: 東日本旅客鉄道。路線名: 山田線。鉄道区分: 普通鉄道JR（11）。事業者種別: JR在来線（2）。

矢幅
type: Concept
alternative label: 矢幅（東日本旅客鉄道 東北線）
broader: g000829
in scheme: scheme
notation: 000829
scope note: 運営会社: 東日本旅客鉄道。路線名: 東北線。鉄道区分: 普通鉄道JR（11）。事業者種別: JR在来線（2）。

生田
type: Concept
alternative label: 生田（東日本旅客鉄道 田沢湖線）
broader: g000830
in scheme: scheme
notation: 000830
scope note: 運営会社: 東日本旅客鉄道。路線名: 田沢湖線。鉄道区分: 普通鉄道JR（11）。事業者種別: JR在来線（2）。

腹帯
type: Concept
alternative label: 腹帯（東日本旅客鉄道 山田線）
broader: g000831
in scheme: scheme
notation: 000831
scope note: 運営会社: 東日本旅客鉄道。路線名: 山田線。鉄道区分: 普通鉄道JR（11）。事業者種別: JR在来線（2）。

陸中川井
type: Concept
alternative label: 陸中川井（東日本旅客鉄道 山田線）
broader: g000832
in scheme: scheme
notation: 000832
scope note: 運営会社: 東日本旅客鉄道。路線名: 山田線。鉄道区分: 普通鉄道JR（11）。事業者種別: JR在来線（2）。

角館
type: Concept
alternative label: 角館（東日本旅客鉄道 田沢湖線）
broader: g000833
in scheme: scheme
notation: 000833
scope note: 運営会社: 東日本旅客鉄道。路線名: 田沢湖線。鉄道区分: 普通鉄道JR（11）。事業者種別: JR在来線（2）。

角館
type: Concept
alternative label: 角館（秋田内陸縦貫鉄道 秋田内陸線）
broader: g000833
in scheme: scheme
notation: 000834
scope note: 運営会社: 秋田内陸縦貫鉄道。路線名: 秋田内陸線。鉄道区分: 普通鉄道（12）。事業者種別: 第三セクター（5）。

津軽石
type: Concept
alternative label: 津軽石（三陸鉄道 リアス線）
broader: g000835
in scheme: scheme
notation: 000835
scope note: 運営会社: 三陸鉄道。路線名: リアス線。鉄道区分: 普通鉄道（12）。事業者種別: 第三セクター（5）。

古館
type: Concept
alternative label: 古館（東日本旅客鉄道 東北線）
broader: g000836
in scheme: scheme
notation: 000836
scope note: 運営会社: 東日本旅客鉄道。路線名: 東北線。鉄道区分: 普通鉄道JR（11）。事業者種別: JR在来線（2）。

鶯野
type: Concept
alternative label: 鶯野（東日本旅客鉄道 田沢湖線）
broader: g000837
in scheme: scheme
notation: 000837
scope note: 運営会社: 東日本旅客鉄道。路線名: 田沢湖線。鉄道区分: 普通鉄道JR（11）。事業者種別: JR在来線（2）。

峰吉川
type: Concept
alternative label: 峰吉川（東日本旅客鉄道 奥羽線）
broader: g000838
in scheme: scheme
notation: 000838
scope note: 運営会社: 東日本旅客鉄道。路線名: 奥羽線。鉄道区分: 普通鉄道JR（11）。事業者種別: JR在来線（2）。

払川
type: Concept
alternative label: 払川（三陸鉄道 リアス線）
broader: g000839
in scheme: scheme
notation: 000839
scope note: 運営会社: 三陸鉄道。路線名: リアス線。鉄道区分: 普通鉄道（12）。事業者種別: 第三セクター（5）。

道川
type: Concept
alternative label: 道川（東日本旅客鉄道 羽越線）
broader: g000840
in scheme: scheme
notation: 000840
scope note: 運営会社: 東日本旅客鉄道。路線名: 羽越線。鉄道区分: 普通鉄道JR（11）。事業者種別: JR在来線（2）。

紫波中央
type: Concept
alternative label: 紫波中央（東日本旅客鉄道 東北線）
broader: g000841
in scheme: scheme
notation: 000841
scope note: 運営会社: 東日本旅客鉄道。路線名: 東北線。鉄道区分: 普通鉄道JR（11）。事業者種別: JR在来線（2）。

刈和野
type: Concept
alternative label: 刈和野（東日本旅客鉄道 奥羽線）
broader: g000842
in scheme: scheme
notation: 000842
scope note: 運営会社: 東日本旅客鉄道。路線名: 奥羽線。鉄道区分: 普通鉄道JR（11）。事業者種別: JR在来線（2）。

岩城みなと
type: Concept
alternative label: 岩城みなと（東日本旅客鉄道 羽越線）
broader: g000843
in scheme: scheme
notation: 000843
scope note: 運営会社: 東日本旅客鉄道。路線名: 羽越線。鉄道区分: 普通鉄道JR（11）。事業者種別: JR在来線（2）。

羽後長野
type: Concept
alternative label: 羽後長野（東日本旅客鉄道 田沢湖線）
broader: g000844
in scheme: scheme
notation: 000844
scope note: 運営会社: 東日本旅客鉄道。路線名: 田沢湖線。鉄道区分: 普通鉄道JR（11）。事業者種別: JR在来線（2）。

日詰
type: Concept
alternative label: 日詰（東日本旅客鉄道 東北線）
broader: g000845
in scheme: scheme
notation: 000845
scope note: 運営会社: 東日本旅客鉄道。路線名: 東北線。鉄道区分: 普通鉄道JR（11）。事業者種別: JR在来線（2）。

豊間根
type: Concept
alternative label: 豊間根（三陸鉄道 リアス線）
broader: g000846
in scheme: scheme
notation: 000846
scope note: 運営会社: 三陸鉄道。路線名: リアス線。鉄道区分: 普通鉄道（12）。事業者種別: 第三セクター（5）。

鑓見内
type: Concept
alternative label: 鑓見内（東日本旅客鉄道 田沢湖線）
broader: g000847
in scheme: scheme
notation: 000847
scope note: 運営会社: 東日本旅客鉄道。路線名: 田沢湖線。鉄道区分: 普通鉄道JR（11）。事業者種別: JR在来線（2）。

羽後四ツ屋
type: Concept
alternative label: 羽後四ツ屋（東日本旅客鉄道 田沢湖線）
broader: g000848
in scheme: scheme
notation: 000848
scope note: 運営会社: 東日本旅客鉄道。路線名: 田沢湖線。鉄道区分: 普通鉄道JR（11）。事業者種別: JR在来線（2）。

神宮寺
type: Concept
alternative label: 神宮寺（東日本旅客鉄道 奥羽線）
broader: g000849
in scheme: scheme
notation: 000849
scope note: 運営会社: 東日本旅客鉄道。路線名: 奥羽線。鉄道区分: 普通鉄道JR（11）。事業者種別: JR在来線（2）。

羽後亀田
type: Concept
alternative label: 羽後亀田（東日本旅客鉄道 羽越線）
broader: g000850
in scheme: scheme
notation: 000850
scope note: 運営会社: 東日本旅客鉄道。路線名: 羽越線。鉄道区分: 普通鉄道JR（11）。事業者種別: JR在来線（2）。

石鳥谷
type: Concept
alternative label: 石鳥谷（東日本旅客鉄道 東北線）
broader: g000851
in scheme: scheme
notation: 000851
scope note: 運営会社: 東日本旅客鉄道。路線名: 東北線。鉄道区分: 普通鉄道JR（11）。事業者種別: JR在来線（2）。

北大曲
type: Concept
alternative label: 北大曲（東日本旅客鉄道 田沢湖線）
broader: g000852
in scheme: scheme
notation: 000852
scope note: 運営会社: 東日本旅客鉄道。路線名: 田沢湖線。鉄道区分: 普通鉄道JR（11）。事業者種別: JR在来線（2）。

折渡
type: Concept
alternative label: 折渡（東日本旅客鉄道 羽越線）
broader: g000853
in scheme: scheme
notation: 000853
scope note: 運営会社: 東日本旅客鉄道。路線名: 羽越線。鉄道区分: 普通鉄道JR（11）。事業者種別: JR在来線（2）。

大曲
type: Concept
alternative label: 大曲（東日本旅客鉄道 奥羽線）
broader: g000854
in scheme: scheme
notation: 000854
scope note: 運営会社: 東日本旅客鉄道。路線名: 奥羽線。鉄道区分: 普通鉄道JR（11）。事業者種別: JR在来線（2）。

大曲
type: Concept
alternative label: 大曲（東日本旅客鉄道 田沢湖線）
broader: g000854
in scheme: scheme
notation: 000855
scope note: 運営会社: 東日本旅客鉄道。路線名: 田沢湖線。鉄道区分: 普通鉄道JR（11）。事業者種別: JR在来線（2）。

陸中山田
type: Concept
alternative label: 陸中山田（三陸鉄道 リアス線）
broader: g000856
in scheme: scheme
notation: 000856
scope note: 運営会社: 三陸鉄道。路線名: リアス線。鉄道区分: 普通鉄道（12）。事業者種別: 第三セクター（5）。

織笠
type: Concept
alternative label: 織笠（三陸鉄道 リアス線）
broader: g000857
in scheme: scheme
notation: 000857
scope note: 運営会社: 三陸鉄道。路線名: リアス線。鉄道区分: 普通鉄道（12）。事業者種別: 第三セクター（5）。

花巻空港
type: Concept
alternative label: 花巻空港（東日本旅客鉄道 東北線）
broader: g000858
in scheme: scheme
notation: 000858
scope note: 運営会社: 東日本旅客鉄道。路線名: 東北線。鉄道区分: 普通鉄道JR（11）。事業者種別: JR在来線（2）。

羽後岩谷
type: Concept
alternative label: 羽後岩谷（東日本旅客鉄道 羽越線）
broader: g000859
in scheme: scheme
notation: 000859
scope note: 運営会社: 東日本旅客鉄道。路線名: 羽越線。鉄道区分: 普通鉄道JR（11）。事業者種別: JR在来線（2）。

岩手船越
type: Concept
alternative label: 岩手船越（三陸鉄道 リアス線）
broader: g000860
in scheme: scheme
notation: 000860
scope note: 運営会社: 三陸鉄道。路線名: リアス線。鉄道区分: 普通鉄道（12）。事業者種別: 第三セクター（5）。

小山田
type: Concept
alternative label: 小山田（東日本旅客鉄道 釜石線）
broader: g000861
in scheme: scheme
notation: 000861
scope note: 運営会社: 東日本旅客鉄道。路線名: 釜石線。鉄道区分: 普通鉄道JR（11）。事業者種別: JR在来線（2）。

似内
type: Concept
alternative label: 似内（東日本旅客鉄道 釜石線）
broader: g000862
in scheme: scheme
notation: 000862
scope note: 運営会社: 東日本旅客鉄道。路線名: 釜石線。鉄道区分: 普通鉄道JR（11）。事業者種別: JR在来線（2）。

新花巻
type: Concept
alternative label: 新花巻（東日本旅客鉄道 東北新幹線）
broader: g000863
in scheme: scheme
notation: 000863
scope note: 運営会社: 東日本旅客鉄道。路線名: 東北新幹線。鉄道区分: 普通鉄道JR（11）。事業者種別: JRの新幹線（1）。

飯詰
type: Concept
alternative label: 飯詰（東日本旅客鉄道 奥羽線）
broader: g000864
in scheme: scheme
notation: 000864
scope note: 運営会社: 東日本旅客鉄道。路線名: 奥羽線。鉄道区分: 普通鉄道JR（11）。事業者種別: JR在来線（2）。

新花巻
type: Concept
alternative label: 新花巻（東日本旅客鉄道 釜石線）
broader: g000863
in scheme: scheme
notation: 000865
scope note: 運営会社: 東日本旅客鉄道。路線名: 釜石線。鉄道区分: 普通鉄道JR（11）。事業者種別: JR在来線（2）。

花巻
type: Concept
alternative label: 花巻（東日本旅客鉄道 釜石線）
broader: g000866
in scheme: scheme
notation: 000866
scope note: 運営会社: 東日本旅客鉄道。路線名: 釜石線。鉄道区分: 普通鉄道JR（11）。事業者種別: JR在来線（2）。

花巻
type: Concept
alternative label: 花巻（東日本旅客鉄道 東北線）
broader: g000866
in scheme: scheme
notation: 000867
scope note: 運営会社: 東日本旅客鉄道。路線名: 東北線。鉄道区分: 普通鉄道JR（11）。事業者種別: JR在来線（2）。

羽後本荘
type: Concept
alternative label: 羽後本荘（東日本旅客鉄道 羽越線）
broader: g000868
in scheme: scheme
notation: 000868
scope note: 運営会社: 東日本旅客鉄道。路線名: 羽越線。鉄道区分: 普通鉄道JR（11）。事業者種別: JR在来線（2）。

羽後本荘
type: Concept
alternative label: 羽後本荘（由利高原鉄道 鳥海山ろく線）
broader: g000868
in scheme: scheme
notation: 000869
scope note: 運営会社: 由利高原鉄道。路線名: 鳥海山ろく線。鉄道区分: 普通鉄道（12）。事業者種別: 第三セクター（5）。

浪板海岸
type: Concept
alternative label: 浪板海岸（三陸鉄道 リアス線）
broader: g000870
in scheme: scheme
notation: 000870
scope note: 運営会社: 三陸鉄道。路線名: リアス線。鉄道区分: 普通鉄道（12）。事業者種別: 第三セクター（5）。

土沢
type: Concept
alternative label: 土沢（東日本旅客鉄道 釜石線）
broader: g000871
in scheme: scheme
notation: 000871
scope note: 運営会社: 東日本旅客鉄道。路線名: 釜石線。鉄道区分: 普通鉄道JR（11）。事業者種別: JR在来線（2）。

吉里吉里
type: Concept
alternative label: 吉里吉里（三陸鉄道 リアス線）
broader: g000872
in scheme: scheme
notation: 000872
scope note: 運営会社: 三陸鉄道。路線名: リアス線。鉄道区分: 普通鉄道（12）。事業者種別: 第三セクター（5）。

薬師堂
type: Concept
alternative label: 薬師堂（由利高原鉄道 鳥海山ろく線）
broader: g000873
in scheme: scheme
notation: 000873
scope note: 運営会社: 由利高原鉄道。路線名: 鳥海山ろく線。鉄道区分: 普通鉄道（12）。事業者種別: 第三セクター（5）。

晴山
type: Concept
alternative label: 晴山（東日本旅客鉄道 釜石線）
broader: g000874
in scheme: scheme
notation: 000874
scope note: 運営会社: 東日本旅客鉄道。路線名: 釜石線。鉄道区分: 普通鉄道JR（11）。事業者種別: JR在来線（2）。

後三年
type: Concept
alternative label: 後三年（東日本旅客鉄道 奥羽線）
broader: g000875
in scheme: scheme
notation: 000875
scope note: 運営会社: 東日本旅客鉄道。路線名: 奥羽線。鉄道区分: 普通鉄道JR（11）。事業者種別: JR在来線（2）。

大槌
type: Concept
alternative label: 大槌（三陸鉄道 リアス線）
broader: g000876
in scheme: scheme
notation: 000876
scope note: 運営会社: 三陸鉄道。路線名: リアス線。鉄道区分: 普通鉄道（12）。事業者種別: 第三セクター（5）。

岩根橋
type: Concept
alternative label: 岩根橋（東日本旅客鉄道 釜石線）
broader: g000877
in scheme: scheme
notation: 000877
scope note: 運営会社: 東日本旅客鉄道。路線名: 釜石線。鉄道区分: 普通鉄道JR（11）。事業者種別: JR在来線（2）。

宮守
type: Concept
alternative label: 宮守（東日本旅客鉄道 釜石線）
broader: g000878
in scheme: scheme
notation: 000878
scope note: 運営会社: 東日本旅客鉄道。路線名: 釜石線。鉄道区分: 普通鉄道JR（11）。事業者種別: JR在来線（2）。

子吉
type: Concept
alternative label: 子吉（由利高原鉄道 鳥海山ろく線）
broader: g000879
in scheme: scheme
notation: 000879
scope note: 運営会社: 由利高原鉄道。路線名: 鳥海山ろく線。鉄道区分: 普通鉄道（12）。事業者種別: 第三セクター（5）。

西目
type: Concept
alternative label: 西目（東日本旅客鉄道 羽越線）
broader: g000880
in scheme: scheme
notation: 000880
scope note: 運営会社: 東日本旅客鉄道。路線名: 羽越線。鉄道区分: 普通鉄道JR（11）。事業者種別: JR在来線（2）。

遠野
type: Concept
alternative label: 遠野（東日本旅客鉄道 釜石線）
broader: g000881
in scheme: scheme
notation: 000881
scope note: 運営会社: 東日本旅客鉄道。路線名: 釜石線。鉄道区分: 普通鉄道JR（11）。事業者種別: JR在来線（2）。

鮎川
type: Concept
alternative label: 鮎川（由利高原鉄道 鳥海山ろく線）
broader: g000882
in scheme: scheme
notation: 000882
scope note: 運営会社: 由利高原鉄道。路線名: 鳥海山ろく線。鉄道区分: 普通鉄道（12）。事業者種別: 第三セクター（5）。

綾織
type: Concept
alternative label: 綾織（東日本旅客鉄道 釜石線）
broader: g000883
in scheme: scheme
notation: 000883
scope note: 運営会社: 東日本旅客鉄道。路線名: 釜石線。鉄道区分: 普通鉄道JR（11）。事業者種別: JR在来線（2）。

鵜住居
type: Concept
alternative label: 鵜住居（三陸鉄道 リアス線）
broader: g000884
in scheme: scheme
notation: 000884
scope note: 運営会社: 三陸鉄道。路線名: リアス線。鉄道区分: 普通鉄道（12）。事業者種別: 第三セクター（5）。

岩手二日町
type: Concept
alternative label: 岩手二日町（東日本旅客鉄道 釜石線）
broader: g000885
in scheme: scheme
notation: 000885
scope note: 運営会社: 東日本旅客鉄道。路線名: 釜石線。鉄道区分: 普通鉄道JR（11）。事業者種別: JR在来線（2）。

村崎野
type: Concept
alternative label: 村崎野（東日本旅客鉄道 東北線）
broader: g000886
in scheme: scheme
notation: 000886
scope note: 運営会社: 東日本旅客鉄道。路線名: 東北線。鉄道区分: 普通鉄道JR（11）。事業者種別: JR在来線（2）。

曲沢
type: Concept
alternative label: 曲沢（由利高原鉄道 鳥海山ろく線）
broader: g000887
in scheme: scheme
notation: 000887
scope note: 運営会社: 由利高原鉄道。路線名: 鳥海山ろく線。鉄道区分: 普通鉄道（12）。事業者種別: 第三セクター（5）。

黒沢
type: Concept
alternative label: 黒沢（由利高原鉄道 鳥海山ろく線）
broader: g000888
in scheme: scheme
notation: 000888
scope note: 運営会社: 由利高原鉄道。路線名: 鳥海山ろく線。鉄道区分: 普通鉄道（12）。事業者種別: 第三セクター（5）。

ほっとゆだ
type: Concept
alternative label: ほっとゆだ（東日本旅客鉄道 北上線）
broader: g000889
in scheme: scheme
notation: 000889
scope note: 運営会社: 東日本旅客鉄道。路線名: 北上線。鉄道区分: 普通鉄道JR（11）。事業者種別: JR在来線（2）。

前郷
type: Concept
alternative label: 前郷（由利高原鉄道 鳥海山ろく線）
broader: g000890
in scheme: scheme
notation: 000890
scope note: 運営会社: 由利高原鉄道。路線名: 鳥海山ろく線。鉄道区分: 普通鉄道（12）。事業者種別: 第三セクター（5）。

青笹
type: Concept
alternative label: 青笹（東日本旅客鉄道 釜石線）
broader: g000891
in scheme: scheme
notation: 000891
scope note: 運営会社: 東日本旅客鉄道。路線名: 釜石線。鉄道区分: 普通鉄道JR（11）。事業者種別: JR在来線（2）。

横手
type: Concept
alternative label: 横手（東日本旅客鉄道 奥羽線）
broader: g000892
in scheme: scheme
notation: 000892
scope note: 運営会社: 東日本旅客鉄道。路線名: 奥羽線。鉄道区分: 普通鉄道JR（11）。事業者種別: JR在来線（2）。

横手
type: Concept
alternative label: 横手（東日本旅客鉄道 北上線）
broader: g000892
in scheme: scheme
notation: 000893
scope note: 運営会社: 東日本旅客鉄道。路線名: 北上線。鉄道区分: 普通鉄道JR（11）。事業者種別: JR在来線（2）。

荒谷前
type: Concept
alternative label: 荒谷前（東日本旅客鉄道 釜石線）
broader: g000894
in scheme: scheme
notation: 000894
scope note: 運営会社: 東日本旅客鉄道。路線名: 釜石線。鉄道区分: 普通鉄道JR（11）。事業者種別: JR在来線（2）。

横川目
type: Concept
alternative label: 横川目（東日本旅客鉄道 北上線）
broader: g000895
in scheme: scheme
notation: 000895
scope note: 運営会社: 東日本旅客鉄道。路線名: 北上線。鉄道区分: 普通鉄道JR（11）。事業者種別: JR在来線（2）。

和賀仙人
type: Concept
alternative label: 和賀仙人（東日本旅客鉄道 北上線）
broader: g000896
in scheme: scheme
notation: 000896
scope note: 運営会社: 東日本旅客鉄道。路線名: 北上線。鉄道区分: 普通鉄道JR（11）。事業者種別: JR在来線（2）。

両石
type: Concept
alternative label: 両石（三陸鉄道 リアス線）
broader: g000897
in scheme: scheme
notation: 000897
scope note: 運営会社: 三陸鉄道。路線名: リアス線。鉄道区分: 普通鉄道（12）。事業者種別: 第三セクター（5）。

立川目
type: Concept
alternative label: 立川目（東日本旅客鉄道 北上線）
broader: g000898
in scheme: scheme
notation: 000898
scope note: 運営会社: 東日本旅客鉄道。路線名: 北上線。鉄道区分: 普通鉄道JR（11）。事業者種別: JR在来線（2）。

柏木平
type: Concept
alternative label: 柏木平（東日本旅客鉄道 釜石線）
broader: g000899
in scheme: scheme
notation: 000899
scope note: 運営会社: 東日本旅客鉄道。路線名: 釜石線。鉄道区分: 普通鉄道JR（11）。事業者種別: JR在来線（2）。

岩沢
type: Concept
alternative label: 岩沢（東日本旅客鉄道 北上線）
broader: g000900
in scheme: scheme
notation: 000900
scope note: 運営会社: 東日本旅客鉄道。路線名: 北上線。鉄道区分: 普通鉄道JR（11）。事業者種別: JR在来線（2）。

藤根
type: Concept
alternative label: 藤根（東日本旅客鉄道 北上線）
broader: g000901
in scheme: scheme
notation: 000901
scope note: 運営会社: 東日本旅客鉄道。路線名: 北上線。鉄道区分: 普通鉄道JR（11）。事業者種別: JR在来線（2）。

ゆだ高原
type: Concept
alternative label: ゆだ高原（東日本旅客鉄道 北上線）
broader: g000902
in scheme: scheme
notation: 000902
scope note: 運営会社: 東日本旅客鉄道。路線名: 北上線。鉄道区分: 普通鉄道JR（11）。事業者種別: JR在来線（2）。

鱒沢
type: Concept
alternative label: 鱒沢（東日本旅客鉄道 釜石線）
broader: g000903
in scheme: scheme
notation: 000903
scope note: 運営会社: 東日本旅客鉄道。路線名: 釜石線。鉄道区分: 普通鉄道JR（11）。事業者種別: JR在来線（2）。

江釣子
type: Concept
alternative label: 江釣子（東日本旅客鉄道 北上線）
broader: g000904
in scheme: scheme
notation: 000904
scope note: 運営会社: 東日本旅客鉄道。路線名: 北上線。鉄道区分: 普通鉄道JR（11）。事業者種別: JR在来線（2）。

久保田
type: Concept
alternative label: 久保田（由利高原鉄道 鳥海山ろく線）
broader: g000905
in scheme: scheme
notation: 000905
scope note: 運営会社: 由利高原鉄道。路線名: 鳥海山ろく線。鉄道区分: 普通鉄道（12）。事業者種別: 第三セクター（5）。

ゆだ錦秋湖
type: Concept
alternative label: ゆだ錦秋湖（東日本旅客鉄道 北上線）
broader: g000906
in scheme: scheme
notation: 000906
scope note: 運営会社: 東日本旅客鉄道。路線名: 北上線。鉄道区分: 普通鉄道JR（11）。事業者種別: JR在来線（2）。

柳原
type: Concept
alternative label: 柳原（東日本旅客鉄道 北上線）
broader: g000907
in scheme: scheme
notation: 000907
scope note: 運営会社: 東日本旅客鉄道。路線名: 北上線。鉄道区分: 普通鉄道JR（11）。事業者種別: JR在来線（2）。

小松川
type: Concept
alternative label: 小松川（東日本旅客鉄道 北上線）
broader: g000908
in scheme: scheme
notation: 000908
scope note: 運営会社: 東日本旅客鉄道。路線名: 北上線。鉄道区分: 普通鉄道JR（11）。事業者種別: JR在来線（2）。

仁賀保
type: Concept
alternative label: 仁賀保（東日本旅客鉄道 羽越線）
broader: g000909
in scheme: scheme
notation: 000909
scope note: 運営会社: 東日本旅客鉄道。路線名: 羽越線。鉄道区分: 普通鉄道JR（11）。事業者種別: JR在来線（2）。

岩手上郷
type: Concept
alternative label: 岩手上郷（東日本旅客鉄道 釜石線）
broader: g000910
in scheme: scheme
notation: 000910
scope note: 運営会社: 東日本旅客鉄道。路線名: 釜石線。鉄道区分: 普通鉄道JR（11）。事業者種別: JR在来線（2）。

北上
type: Concept
alternative label: 北上（東日本旅客鉄道 東北新幹線）
broader: g000912
in scheme: scheme
notation: 000911
scope note: 運営会社: 東日本旅客鉄道。路線名: 東北新幹線。鉄道区分: 普通鉄道JR（11）。事業者種別: JRの新幹線（1）。

北上
type: Concept
alternative label: 北上（東日本旅客鉄道 東北線）
broader: g000912
in scheme: scheme
notation: 000912
scope note: 運営会社: 東日本旅客鉄道。路線名: 東北線。鉄道区分: 普通鉄道JR（11）。事業者種別: JR在来線（2）。

北上
type: Concept
alternative label: 北上（東日本旅客鉄道 北上線）
broader: g000912
in scheme: scheme
notation: 000913
scope note: 運営会社: 東日本旅客鉄道。路線名: 北上線。鉄道区分: 普通鉄道JR（11）。事業者種別: JR在来線（2）。

陸中大橋
type: Concept
alternative label: 陸中大橋（東日本旅客鉄道 釜石線）
broader: g000914
in scheme: scheme
notation: 000914
scope note: 運営会社: 東日本旅客鉄道。路線名: 釜石線。鉄道区分: 普通鉄道JR（11）。事業者種別: JR在来線（2）。

西滝沢
type: Concept
alternative label: 西滝沢（由利高原鉄道 鳥海山ろく線）
broader: g000915
in scheme: scheme
notation: 000915
scope note: 運営会社: 由利高原鉄道。路線名: 鳥海山ろく線。鉄道区分: 普通鉄道（12）。事業者種別: 第三セクター（5）。

相野々
type: Concept
alternative label: 相野々（東日本旅客鉄道 北上線）
broader: g000916
in scheme: scheme
notation: 000916
scope note: 運営会社: 東日本旅客鉄道。路線名: 北上線。鉄道区分: 普通鉄道JR（11）。事業者種別: JR在来線（2）。

柳田
type: Concept
alternative label: 柳田（東日本旅客鉄道 奥羽線）
broader: g000917
in scheme: scheme
notation: 000917
scope note: 運営会社: 東日本旅客鉄道。路線名: 奥羽線。鉄道区分: 普通鉄道JR（11）。事業者種別: JR在来線（2）。

黒沢
type: Concept
alternative label: 黒沢（東日本旅客鉄道 北上線）
broader: g000918
in scheme: scheme
notation: 000918
scope note: 運営会社: 東日本旅客鉄道。路線名: 北上線。鉄道区分: 普通鉄道JR（11）。事業者種別: JR在来線（2）。

釜石
type: Concept
alternative label: 釜石（東日本旅客鉄道 釜石線）
broader: g000919
in scheme: scheme
notation: 000919
scope note: 運営会社: 東日本旅客鉄道。路線名: 釜石線。鉄道区分: 普通鉄道JR（11）。事業者種別: JR在来線（2）。

釜石
type: Concept
alternative label: 釜石（三陸鉄道 リアス線）
broader: g000919
in scheme: scheme
notation: 000920
scope note: 運営会社: 三陸鉄道。路線名: リアス線。鉄道区分: 普通鉄道（12）。事業者種別: 第三セクター（5）。

吉沢
type: Concept
alternative label: 吉沢（由利高原鉄道 鳥海山ろく線）
broader: g000921
in scheme: scheme
notation: 000921
scope note: 運営会社: 由利高原鉄道。路線名: 鳥海山ろく線。鉄道区分: 普通鉄道（12）。事業者種別: 第三セクター（5）。

平倉
type: Concept
alternative label: 平倉（東日本旅客鉄道 釜石線）
broader: g000922
in scheme: scheme
notation: 000922
scope note: 運営会社: 東日本旅客鉄道。路線名: 釜石線。鉄道区分: 普通鉄道JR（11）。事業者種別: JR在来線（2）。

小佐野
type: Concept
alternative label: 小佐野（東日本旅客鉄道 釜石線）
broader: g000923
in scheme: scheme
notation: 000923
scope note: 運営会社: 東日本旅客鉄道。路線名: 釜石線。鉄道区分: 普通鉄道JR（11）。事業者種別: JR在来線（2）。

松倉
type: Concept
alternative label: 松倉（東日本旅客鉄道 釜石線）
broader: g000924
in scheme: scheme
notation: 000924
scope note: 運営会社: 東日本旅客鉄道。路線名: 釜石線。鉄道区分: 普通鉄道JR（11）。事業者種別: JR在来線（2）。

金浦
type: Concept
alternative label: 金浦（東日本旅客鉄道 羽越線）
broader: g000925
in scheme: scheme
notation: 000925
scope note: 運営会社: 東日本旅客鉄道。路線名: 羽越線。鉄道区分: 普通鉄道JR（11）。事業者種別: JR在来線（2）。

足ヶ瀬
type: Concept
alternative label: 足ヶ瀬（東日本旅客鉄道 釜石線）
broader: g000926
in scheme: scheme
notation: 000926
scope note: 運営会社: 東日本旅客鉄道。路線名: 釜石線。鉄道区分: 普通鉄道JR（11）。事業者種別: JR在来線（2）。

洞泉
type: Concept
alternative label: 洞泉（東日本旅客鉄道 釜石線）
broader: g000927
in scheme: scheme
notation: 000927
scope note: 運営会社: 東日本旅客鉄道。路線名: 釜石線。鉄道区分: 普通鉄道JR（11）。事業者種別: JR在来線（2）。

川辺
type: Concept
alternative label: 川辺（由利高原鉄道 鳥海山ろく線）
broader: g000928
in scheme: scheme
notation: 000928
scope note: 運営会社: 由利高原鉄道。路線名: 鳥海山ろく線。鉄道区分: 普通鉄道（12）。事業者種別: 第三セクター（5）。

醍醐
type: Concept
alternative label: 醍醐（東日本旅客鉄道 奥羽線）
broader: g000929
in scheme: scheme
notation: 000929
scope note: 運営会社: 東日本旅客鉄道。路線名: 奥羽線。鉄道区分: 普通鉄道JR（11）。事業者種別: JR在来線（2）。

平田
type: Concept
alternative label: 平田（三陸鉄道 南リアス線）
broader: g000930
in scheme: scheme
notation: 000930
scope note: 運営会社: 三陸鉄道。路線名: 南リアス線。鉄道区分: 普通鉄道（12）。事業者種別: 第三セクター（5）。

上有住
type: Concept
alternative label: 上有住（東日本旅客鉄道 釜石線）
broader: g000931
in scheme: scheme
notation: 000931
scope note: 運営会社: 東日本旅客鉄道。路線名: 釜石線。鉄道区分: 普通鉄道JR（11）。事業者種別: JR在来線（2）。

矢島
type: Concept
alternative label: 矢島（由利高原鉄道 鳥海山ろく線）
broader: g000932
in scheme: scheme
notation: 000932
scope note: 運営会社: 由利高原鉄道。路線名: 鳥海山ろく線。鉄道区分: 普通鉄道（12）。事業者種別: 第三セクター（5）。

六原
type: Concept
alternative label: 六原（東日本旅客鉄道 東北線）
broader: g000933
in scheme: scheme
notation: 000933
scope note: 運営会社: 東日本旅客鉄道。路線名: 東北線。鉄道区分: 普通鉄道JR（11）。事業者種別: JR在来線（2）。

十文字
type: Concept
alternative label: 十文字（東日本旅客鉄道 奥羽線）
broader: g000934
in scheme: scheme
notation: 000934
scope note: 運営会社: 東日本旅客鉄道。路線名: 奥羽線。鉄道区分: 普通鉄道JR（11）。事業者種別: JR在来線（2）。

象潟
type: Concept
alternative label: 象潟（東日本旅客鉄道 羽越線）
broader: g000935
in scheme: scheme
notation: 000935
scope note: 運営会社: 東日本旅客鉄道。路線名: 羽越線。鉄道区分: 普通鉄道JR（11）。事業者種別: JR在来線（2）。

唐丹
type: Concept
alternative label: 唐丹（三陸鉄道 南リアス線）
broader: g000936
in scheme: scheme
notation: 000936
scope note: 運営会社: 三陸鉄道。路線名: 南リアス線。鉄道区分: 普通鉄道（12）。事業者種別: 第三セクター（5）。

金ヶ崎
type: Concept
alternative label: 金ヶ崎（東日本旅客鉄道 東北線）
broader: g000937
in scheme: scheme
notation: 000937
scope note: 運営会社: 東日本旅客鉄道。路線名: 東北線。鉄道区分: 普通鉄道JR（11）。事業者種別: JR在来線（2）。

下湯沢
type: Concept
alternative label: 下湯沢（東日本旅客鉄道 奥羽線）
broader: g000938
in scheme: scheme
notation: 000938
scope note: 運営会社: 東日本旅客鉄道。路線名: 奥羽線。鉄道区分: 普通鉄道JR（11）。事業者種別: JR在来線（2）。

上浜
type: Concept
alternative label: 上浜（東日本旅客鉄道 羽越線）
broader: g000939
in scheme: scheme
notation: 000939
scope note: 運営会社: 東日本旅客鉄道。路線名: 羽越線。鉄道区分: 普通鉄道JR（11）。事業者種別: JR在来線（2）。

湯沢
type: Concept
alternative label: 湯沢（東日本旅客鉄道 奥羽線）
broader: g000940
in scheme: scheme
notation: 000940
scope note: 運営会社: 東日本旅客鉄道。路線名: 奥羽線。鉄道区分: 普通鉄道JR（11）。事業者種別: JR在来線（2）。

吉浜
type: Concept
alternative label: 吉浜（三陸鉄道 南リアス線）
broader: g000941
in scheme: scheme
notation: 000941
scope note: 運営会社: 三陸鉄道。路線名: 南リアス線。鉄道区分: 普通鉄道（12）。事業者種別: 第三セクター（5）。

水沢江刺
type: Concept
alternative label: 水沢江刺（東日本旅客鉄道 東北新幹線）
broader: g000942
in scheme: scheme
notation: 000942
scope note: 運営会社: 東日本旅客鉄道。路線名: 東北新幹線。鉄道区分: 普通鉄道JR（11）。事業者種別: JRの新幹線（1）。

水沢
type: Concept
alternative label: 水沢（東日本旅客鉄道 東北線）
broader: g000943
in scheme: scheme
notation: 000943
scope note: 運営会社: 東日本旅客鉄道。路線名: 東北線。鉄道区分: 普通鉄道JR（11）。事業者種別: JR在来線（2）。

小砂川
type: Concept
alternative label: 小砂川（東日本旅客鉄道 羽越線）
broader: g000944
in scheme: scheme
notation: 000944
scope note: 運営会社: 東日本旅客鉄道。路線名: 羽越線。鉄道区分: 普通鉄道JR（11）。事業者種別: JR在来線（2）。

上湯沢
type: Concept
alternative label: 上湯沢（東日本旅客鉄道 奥羽線）
broader: g000945
in scheme: scheme
notation: 000945
scope note: 運営会社: 東日本旅客鉄道。路線名: 奥羽線。鉄道区分: 普通鉄道JR（11）。事業者種別: JR在来線（2）。

三陸
type: Concept
alternative label: 三陸（三陸鉄道 南リアス線）
broader: g000946
in scheme: scheme
notation: 000946
scope note: 運営会社: 三陸鉄道。路線名: 南リアス線。鉄道区分: 普通鉄道（12）。事業者種別: 第三セクター（5）。

三関
type: Concept
alternative label: 三関（東日本旅客鉄道 奥羽線）
broader: g000947
in scheme: scheme
notation: 000947
scope note: 運営会社: 東日本旅客鉄道。路線名: 奥羽線。鉄道区分: 普通鉄道JR（11）。事業者種別: JR在来線（2）。

女鹿
type: Concept
alternative label: 女鹿（東日本旅客鉄道 羽越線）
broader: g000948
in scheme: scheme
notation: 000948
scope note: 運営会社: 東日本旅客鉄道。路線名: 羽越線。鉄道区分: 普通鉄道JR（11）。事業者種別: JR在来線（2）。

陸中折居
type: Concept
alternative label: 陸中折居（東日本旅客鉄道 東北線）
broader: g000949
in scheme: scheme
notation: 000949
scope note: 運営会社: 東日本旅客鉄道。路線名: 東北線。鉄道区分: 普通鉄道JR（11）。事業者種別: JR在来線（2）。

甫嶺
type: Concept
alternative label: 甫嶺（三陸鉄道 南リアス線）
broader: g000950
in scheme: scheme
notation: 000950
scope note: 運営会社: 三陸鉄道。路線名: 南リアス線。鉄道区分: 普通鉄道（12）。事業者種別: 第三セクター（5）。

盛
type: Concept
alternative label: 盛（三陸鉄道 南リアス線）
broader: g000951
in scheme: scheme
notation: 000951
scope note: 運営会社: 三陸鉄道。路線名: 南リアス線。鉄道区分: 普通鉄道（12）。事業者種別: 第三セクター（5）。

恋し浜
type: Concept
alternative label: 恋し浜（三陸鉄道 南リアス線）
broader: g000952
in scheme: scheme
notation: 000952
scope note: 運営会社: 三陸鉄道。路線名: 南リアス線。鉄道区分: 普通鉄道（12）。事業者種別: 第三セクター（5）。

吹浦
type: Concept
alternative label: 吹浦（東日本旅客鉄道 羽越線）
broader: g000953
in scheme: scheme
notation: 000953
scope note: 運営会社: 東日本旅客鉄道。路線名: 羽越線。鉄道区分: 普通鉄道JR（11）。事業者種別: JR在来線（2）。

陸前赤崎
type: Concept
alternative label: 陸前赤崎（三陸鉄道 南リアス線）
broader: g000954
in scheme: scheme
notation: 000954
scope note: 運営会社: 三陸鉄道。路線名: 南リアス線。鉄道区分: 普通鉄道（12）。事業者種別: 第三セクター（5）。

横堀
type: Concept
alternative label: 横堀（東日本旅客鉄道 奥羽線）
broader: g000955
in scheme: scheme
notation: 000955
scope note: 運営会社: 東日本旅客鉄道。路線名: 奥羽線。鉄道区分: 普通鉄道JR（11）。事業者種別: JR在来線（2）。

綾里
type: Concept
alternative label: 綾里（三陸鉄道 南リアス線）
broader: g000956
in scheme: scheme
notation: 000956
scope note: 運営会社: 三陸鉄道。路線名: 南リアス線。鉄道区分: 普通鉄道（12）。事業者種別: 第三セクター（5）。

院内
type: Concept
alternative label: 院内（東日本旅客鉄道 奥羽線）
broader: g000957
in scheme: scheme
notation: 000957
scope note: 運営会社: 東日本旅客鉄道。路線名: 奥羽線。鉄道区分: 普通鉄道JR（11）。事業者種別: JR在来線（2）。

前沢
type: Concept
alternative label: 前沢（東日本旅客鉄道 東北線）
broader: g000958
in scheme: scheme
notation: 000958
scope note: 運営会社: 東日本旅客鉄道。路線名: 東北線。鉄道区分: 普通鉄道JR（11）。事業者種別: JR在来線（2）。

遊佐
type: Concept
alternative label: 遊佐（東日本旅客鉄道 羽越線）
broader: g000959
in scheme: scheme
notation: 000959
scope note: 運営会社: 東日本旅客鉄道。路線名: 羽越線。鉄道区分: 普通鉄道JR（11）。事業者種別: JR在来線（2）。

柴宿
type: Concept
alternative label: 柴宿（東日本旅客鉄道 大船渡線）
broader: g000960
in scheme: scheme
notation: 000960
scope note: 運営会社: 東日本旅客鉄道。路線名: 大船渡線。鉄道区分: 普通鉄道JR（11）。事業者種別: JR在来線（2）。

摺沢
type: Concept
alternative label: 摺沢（東日本旅客鉄道 大船渡線）
broader: g000961
in scheme: scheme
notation: 000961
scope note: 運営会社: 東日本旅客鉄道。路線名: 大船渡線。鉄道区分: 普通鉄道JR（11）。事業者種別: JR在来線（2）。

及位
type: Concept
alternative label: 及位（東日本旅客鉄道 奥羽線）
broader: g000962
in scheme: scheme
notation: 000962
scope note: 運営会社: 東日本旅客鉄道。路線名: 奥羽線。鉄道区分: 普通鉄道JR（11）。事業者種別: JR在来線（2）。

猊鼻渓
type: Concept
alternative label: 猊鼻渓（東日本旅客鉄道 大船渡線）
broader: g000963
in scheme: scheme
notation: 000963
scope note: 運営会社: 東日本旅客鉄道。路線名: 大船渡線。鉄道区分: 普通鉄道JR（11）。事業者種別: JR在来線（2）。

平泉
type: Concept
alternative label: 平泉（東日本旅客鉄道 東北線）
broader: g000964
in scheme: scheme
notation: 000964
scope note: 運営会社: 東日本旅客鉄道。路線名: 東北線。鉄道区分: 普通鉄道JR（11）。事業者種別: JR在来線（2）。

南鳥海
type: Concept
alternative label: 南鳥海（東日本旅客鉄道 羽越線）
broader: g000965
in scheme: scheme
notation: 000965
scope note: 運営会社: 東日本旅客鉄道。路線名: 羽越線。鉄道区分: 普通鉄道JR（11）。事業者種別: JR在来線（2）。

陸中松川
type: Concept
alternative label: 陸中松川（東日本旅客鉄道 大船渡線）
broader: g000966
in scheme: scheme
notation: 000966
scope note: 運営会社: 東日本旅客鉄道。路線名: 大船渡線。鉄道区分: 普通鉄道JR（11）。事業者種別: JR在来線（2）。

大滝
type: Concept
alternative label: 大滝（東日本旅客鉄道 奥羽線）
broader: g000967
in scheme: scheme
notation: 000967
scope note: 運営会社: 東日本旅客鉄道。路線名: 奥羽線。鉄道区分: 普通鉄道JR（11）。事業者種別: JR在来線（2）。

本楯
type: Concept
alternative label: 本楯（東日本旅客鉄道 羽越線）
broader: g000968
in scheme: scheme
notation: 000968
scope note: 運営会社: 東日本旅客鉄道。路線名: 羽越線。鉄道区分: 普通鉄道JR（11）。事業者種別: JR在来線（2）。

山ノ目
type: Concept
alternative label: 山ノ目（東日本旅客鉄道 東北線）
broader: g000969
in scheme: scheme
notation: 000969
scope note: 運営会社: 東日本旅客鉄道。路線名: 東北線。鉄道区分: 普通鉄道JR（11）。事業者種別: JR在来線（2）。

岩ノ下
type: Concept
alternative label: 岩ノ下（東日本旅客鉄道 大船渡線）
broader: g000970
in scheme: scheme
notation: 000970
scope note: 運営会社: 東日本旅客鉄道。路線名: 大船渡線。鉄道区分: 普通鉄道JR（11）。事業者種別: JR在来線（2）。

折壁
type: Concept
alternative label: 折壁（東日本旅客鉄道 大船渡線）
broader: g000971
in scheme: scheme
notation: 000971
scope note: 運営会社: 東日本旅客鉄道。路線名: 大船渡線。鉄道区分: 普通鉄道JR（11）。事業者種別: JR在来線（2）。

矢越
type: Concept
alternative label: 矢越（東日本旅客鉄道 大船渡線）
broader: g000972
in scheme: scheme
notation: 000972
scope note: 運営会社: 東日本旅客鉄道。路線名: 大船渡線。鉄道区分: 普通鉄道JR（11）。事業者種別: JR在来線（2）。

釜淵
type: Concept
alternative label: 釜淵（東日本旅客鉄道 奥羽線）
broader: g000973
in scheme: scheme
notation: 000973
scope note: 運営会社: 東日本旅客鉄道。路線名: 奥羽線。鉄道区分: 普通鉄道JR（11）。事業者種別: JR在来線（2）。

小梨
type: Concept
alternative label: 小梨（東日本旅客鉄道 大船渡線）
broader: g000974
in scheme: scheme
notation: 000974
scope note: 運営会社: 東日本旅客鉄道。路線名: 大船渡線。鉄道区分: 普通鉄道JR（11）。事業者種別: JR在来線（2）。

一ノ関
type: Concept
alternative label: 一ノ関（東日本旅客鉄道 大船渡線）
broader: g000975
in scheme: scheme
notation: 000975
scope note: 運営会社: 東日本旅客鉄道。路線名: 大船渡線。鉄道区分: 普通鉄道JR（11）。事業者種別: JR在来線（2）。

一ノ関
type: Concept
alternative label: 一ノ関（東日本旅客鉄道 東北線）
broader: g000975
in scheme: scheme
notation: 000976
scope note: 運営会社: 東日本旅客鉄道。路線名: 東北線。鉄道区分: 普通鉄道JR（11）。事業者種別: JR在来線（2）。

一ノ関
type: Concept
alternative label: 一ノ関（東日本旅客鉄道 東北新幹線）
broader: g000975
in scheme: scheme
notation: 000977
scope note: 運営会社: 東日本旅客鉄道。路線名: 東北新幹線。鉄道区分: 普通鉄道JR（11）。事業者種別: JRの新幹線（1）。

千厩
type: Concept
alternative label: 千厩（東日本旅客鉄道 大船渡線）
broader: g000978
in scheme: scheme
notation: 000978
scope note: 運営会社: 東日本旅客鉄道。路線名: 大船渡線。鉄道区分: 普通鉄道JR（11）。事業者種別: JR在来線（2）。

酒田
type: Concept
alternative label: 酒田（東日本旅客鉄道 羽越線）
broader: g000979
in scheme: scheme
notation: 000979
scope note: 運営会社: 東日本旅客鉄道。路線名: 羽越線。鉄道区分: 普通鉄道JR（11）。事業者種別: JR在来線（2）。

陸中門崎
type: Concept
alternative label: 陸中門崎（東日本旅客鉄道 大船渡線）
broader: g000980
in scheme: scheme
notation: 000980
scope note: 運営会社: 東日本旅客鉄道。路線名: 大船渡線。鉄道区分: 普通鉄道JR（11）。事業者種別: JR在来線（2）。

新月
type: Concept
alternative label: 新月（東日本旅客鉄道 大船渡線）
broader: g000981
in scheme: scheme
notation: 000981
scope note: 運営会社: 東日本旅客鉄道。路線名: 大船渡線。鉄道区分: 普通鉄道JR（11）。事業者種別: JR在来線（2）。

気仙沼
type: Concept
alternative label: 気仙沼（東日本旅客鉄道 大船渡線）
broader: g000982
in scheme: scheme
notation: 000982
scope note: 運営会社: 東日本旅客鉄道。路線名: 大船渡線。鉄道区分: 普通鉄道JR（11）。事業者種別: JR在来線（2）。

真滝
type: Concept
alternative label: 真滝（東日本旅客鉄道 大船渡線）
broader: g000983
in scheme: scheme
notation: 000983
scope note: 運営会社: 東日本旅客鉄道。路線名: 大船渡線。鉄道区分: 普通鉄道JR（11）。事業者種別: JR在来線（2）。

東酒田
type: Concept
alternative label: 東酒田（東日本旅客鉄道 羽越線）
broader: g000984
in scheme: scheme
notation: 000984
scope note: 運営会社: 東日本旅客鉄道。路線名: 羽越線。鉄道区分: 普通鉄道JR（11）。事業者種別: JR在来線（2）。

砂越
type: Concept
alternative label: 砂越（東日本旅客鉄道 羽越線）
broader: g000985
in scheme: scheme
notation: 000985
scope note: 運営会社: 東日本旅客鉄道。路線名: 羽越線。鉄道区分: 普通鉄道JR（11）。事業者種別: JR在来線（2）。

北余目
type: Concept
alternative label: 北余目（東日本旅客鉄道 羽越線）
broader: g000986
in scheme: scheme
notation: 000986
scope note: 運営会社: 東日本旅客鉄道。路線名: 羽越線。鉄道区分: 普通鉄道JR（11）。事業者種別: JR在来線（2）。

有壁
type: Concept
alternative label: 有壁（東日本旅客鉄道 東北線）
broader: g000987
in scheme: scheme
notation: 000987
scope note: 運営会社: 東日本旅客鉄道。路線名: 東北線。鉄道区分: 普通鉄道JR（11）。事業者種別: JR在来線（2）。

真室川
type: Concept
alternative label: 真室川（東日本旅客鉄道 奥羽線）
broader: g000988
in scheme: scheme
notation: 000988
scope note: 運営会社: 東日本旅客鉄道。路線名: 奥羽線。鉄道区分: 普通鉄道JR（11）。事業者種別: JR在来線（2）。

清水原
type: Concept
alternative label: 清水原（東日本旅客鉄道 東北線）
broader: g000989
in scheme: scheme
notation: 000989
scope note: 運営会社: 東日本旅客鉄道。路線名: 東北線。鉄道区分: 普通鉄道JR（11）。事業者種別: JR在来線（2）。

余目
type: Concept
alternative label: 余目（東日本旅客鉄道 羽越線）
broader: g000990
in scheme: scheme
notation: 000990
scope note: 運営会社: 東日本旅客鉄道。路線名: 羽越線。鉄道区分: 普通鉄道JR（11）。事業者種別: JR在来線（2）。

余目
type: Concept
alternative label: 余目（東日本旅客鉄道 陸羽西線）
broader: g000990
in scheme: scheme
notation: 000991
scope note: 運営会社: 東日本旅客鉄道。路線名: 陸羽西線。鉄道区分: 普通鉄道JR（11）。事業者種別: JR在来線（2）。

羽前豊里
type: Concept
alternative label: 羽前豊里（東日本旅客鉄道 奥羽線）
broader: g000992
in scheme: scheme
notation: 000992
scope note: 運営会社: 東日本旅客鉄道。路線名: 奥羽線。鉄道区分: 普通鉄道JR（11）。事業者種別: JR在来線（2）。

花泉
type: Concept
alternative label: 花泉（東日本旅客鉄道 東北線）
broader: g000993
in scheme: scheme
notation: 000993
scope note: 運営会社: 東日本旅客鉄道。路線名: 東北線。鉄道区分: 普通鉄道JR（11）。事業者種別: JR在来線（2）。

南野
type: Concept
alternative label: 南野（東日本旅客鉄道 陸羽西線）
broader: g000994
in scheme: scheme
notation: 000994
scope note: 運営会社: 東日本旅客鉄道。路線名: 陸羽西線。鉄道区分: 普通鉄道JR（11）。事業者種別: JR在来線（2）。

泉田
type: Concept
alternative label: 泉田（東日本旅客鉄道 奥羽線）
broader: g000995
in scheme: scheme
notation: 000995
scope note: 運営会社: 東日本旅客鉄道。路線名: 奥羽線。鉄道区分: 普通鉄道JR（11）。事業者種別: JR在来線（2）。

西袋
type: Concept
alternative label: 西袋（東日本旅客鉄道 羽越線）
broader: g000996
in scheme: scheme
notation: 000996
scope note: 運営会社: 東日本旅客鉄道。路線名: 羽越線。鉄道区分: 普通鉄道JR（11）。事業者種別: JR在来線（2）。

油島
type: Concept
alternative label: 油島（東日本旅客鉄道 東北線）
broader: g000997
in scheme: scheme
notation: 000997
scope note: 運営会社: 東日本旅客鉄道。路線名: 東北線。鉄道区分: 普通鉄道JR（11）。事業者種別: JR在来線（2）。

狩川
type: Concept
alternative label: 狩川（東日本旅客鉄道 陸羽西線）
broader: g000998
in scheme: scheme
notation: 000998
scope note: 運営会社: 東日本旅客鉄道。路線名: 陸羽西線。鉄道区分: 普通鉄道JR（11）。事業者種別: JR在来線（2）。

清川
type: Concept
alternative label: 清川（東日本旅客鉄道 陸羽西線）
broader: g000999
in scheme: scheme
notation: 000999
scope note: 運営会社: 東日本旅客鉄道。路線名: 陸羽西線。鉄道区分: 普通鉄道JR（11）。事業者種別: JR在来線（2）。

石越
type: Concept
alternative label: 石越（東日本旅客鉄道 東北線）
broader: g001000
in scheme: scheme
notation: 001000
scope note: 運営会社: 東日本旅客鉄道。路線名: 東北線。鉄道区分: 普通鉄道JR（11）。事業者種別: JR在来線（2）。

藤島
type: Concept
alternative label: 藤島（東日本旅客鉄道 羽越線）
broader: g001001
in scheme: scheme
notation: 001001
scope note: 運営会社: 東日本旅客鉄道。路線名: 羽越線。鉄道区分: 普通鉄道JR（11）。事業者種別: JR在来線（2）。

大堀
type: Concept
alternative label: 大堀（東日本旅客鉄道 陸羽東線）
broader: g001002
in scheme: scheme
notation: 001002
scope note: 運営会社: 東日本旅客鉄道。路線名: 陸羽東線。鉄道区分: 普通鉄道JR（11）。事業者種別: JR在来線（2）。

鵜杉
type: Concept
alternative label: 鵜杉（東日本旅客鉄道 陸羽東線）
broader: g001003
in scheme: scheme
notation: 001003
scope note: 運営会社: 東日本旅客鉄道。路線名: 陸羽東線。鉄道区分: 普通鉄道JR（11）。事業者種別: JR在来線（2）。

新庄
type: Concept
alternative label: 新庄（東日本旅客鉄道 奥羽線）
broader: g001004
in scheme: scheme
notation: 001004
scope note: 運営会社: 東日本旅客鉄道。路線名: 奥羽線。鉄道区分: 普通鉄道JR（11）。事業者種別: JR在来線（2）。

新庄
type: Concept
alternative label: 新庄（東日本旅客鉄道 陸羽西線）
broader: g001004
in scheme: scheme
notation: 001005
scope note: 運営会社: 東日本旅客鉄道。路線名: 陸羽西線。鉄道区分: 普通鉄道JR（11）。事業者種別: JR在来線（2）。

新庄
type: Concept
alternative label: 新庄（東日本旅客鉄道 陸羽東線）
broader: g001004
in scheme: scheme
notation: 001006
scope note: 運営会社: 東日本旅客鉄道。路線名: 陸羽東線。鉄道区分: 普通鉄道JR（11）。事業者種別: JR在来線（2）。

最上
type: Concept
alternative label: 最上（東日本旅客鉄道 陸羽東線）
broader: g001007
in scheme: scheme
notation: 001007
scope note: 運営会社: 東日本旅客鉄道。路線名: 陸羽東線。鉄道区分: 普通鉄道JR（11）。事業者種別: JR在来線（2）。

瀬見温泉
type: Concept
alternative label: 瀬見温泉（東日本旅客鉄道 陸羽東線）
broader: g001008
in scheme: scheme
notation: 001008
scope note: 運営会社: 東日本旅客鉄道。路線名: 陸羽東線。鉄道区分: 普通鉄道JR（11）。事業者種別: JR在来線（2）。

高屋
type: Concept
alternative label: 高屋（東日本旅客鉄道 陸羽西線）
broader: g001009
in scheme: scheme
notation: 001009
scope note: 運営会社: 東日本旅客鉄道。路線名: 陸羽西線。鉄道区分: 普通鉄道JR（11）。事業者種別: JR在来線（2）。

升形
type: Concept
alternative label: 升形（東日本旅客鉄道 陸羽西線）
broader: g001010
in scheme: scheme
notation: 001010
scope note: 運営会社: 東日本旅客鉄道。路線名: 陸羽西線。鉄道区分: 普通鉄道JR（11）。事業者種別: JR在来線（2）。

くりこま高原
type: Concept
alternative label: くりこま高原（東日本旅客鉄道 東北新幹線）
broader: g001011
in scheme: scheme
notation: 001011
scope note: 運営会社: 東日本旅客鉄道。路線名: 東北新幹線。鉄道区分: 普通鉄道JR（11）。事業者種別: JRの新幹線（1）。

羽前前波
type: Concept
alternative label: 羽前前波（東日本旅客鉄道 陸羽西線）
broader: g001012
in scheme: scheme
notation: 001012
scope note: 運営会社: 東日本旅客鉄道。路線名: 陸羽西線。鉄道区分: 普通鉄道JR（11）。事業者種別: JR在来線（2）。

鳴子御殿湯
type: Concept
alternative label: 鳴子御殿湯（東日本旅客鉄道 陸羽東線）
broader: g001013
in scheme: scheme
notation: 001013
scope note: 運営会社: 東日本旅客鉄道。路線名: 陸羽東線。鉄道区分: 普通鉄道JR（11）。事業者種別: JR在来線（2）。

鳴子温泉
type: Concept
alternative label: 鳴子温泉（東日本旅客鉄道 陸羽東線）
broader: g001014
in scheme: scheme
notation: 001014
scope note: 運営会社: 東日本旅客鉄道。路線名: 陸羽東線。鉄道区分: 普通鉄道JR（11）。事業者種別: JR在来線（2）。

羽前大山
type: Concept
alternative label: 羽前大山（東日本旅客鉄道 羽越線）
broader: g001015
in scheme: scheme
notation: 001015
scope note: 運営会社: 東日本旅客鉄道。路線名: 羽越線。鉄道区分: 普通鉄道JR（11）。事業者種別: JR在来線（2）。

立小路
type: Concept
alternative label: 立小路（東日本旅客鉄道 陸羽東線）
broader: g001016
in scheme: scheme
notation: 001016
scope note: 運営会社: 東日本旅客鉄道。路線名: 陸羽東線。鉄道区分: 普通鉄道JR（11）。事業者種別: JR在来線（2）。

鶴岡
type: Concept
alternative label: 鶴岡（東日本旅客鉄道 羽越線）
broader: g001017
in scheme: scheme
notation: 001017
scope note: 運営会社: 東日本旅客鉄道。路線名: 羽越線。鉄道区分: 普通鉄道JR（11）。事業者種別: JR在来線（2）。

津谷
type: Concept
alternative label: 津谷（東日本旅客鉄道 陸羽西線）
broader: g001018
in scheme: scheme
notation: 001018
scope note: 運営会社: 東日本旅客鉄道。路線名: 陸羽西線。鉄道区分: 普通鉄道JR（11）。事業者種別: JR在来線（2）。

古口
type: Concept
alternative label: 古口（東日本旅客鉄道 陸羽西線）
broader: g001019
in scheme: scheme
notation: 001019
scope note: 運営会社: 東日本旅客鉄道。路線名: 陸羽西線。鉄道区分: 普通鉄道JR（11）。事業者種別: JR在来線（2）。

川渡温泉
type: Concept
alternative label: 川渡温泉（東日本旅客鉄道 陸羽東線）
broader: g001020
in scheme: scheme
notation: 001020
scope note: 運営会社: 東日本旅客鉄道。路線名: 陸羽東線。鉄道区分: 普通鉄道JR（11）。事業者種別: JR在来線（2）。

堺田
type: Concept
alternative label: 堺田（東日本旅客鉄道 陸羽東線）
broader: g001021
in scheme: scheme
notation: 001021
scope note: 運営会社: 東日本旅客鉄道。路線名: 陸羽東線。鉄道区分: 普通鉄道JR（11）。事業者種別: JR在来線（2）。

赤倉温泉
type: Concept
alternative label: 赤倉温泉（東日本旅客鉄道 陸羽東線）
broader: g001022
in scheme: scheme
notation: 001022
scope note: 運営会社: 東日本旅客鉄道。路線名: 陸羽東線。鉄道区分: 普通鉄道JR（11）。事業者種別: JR在来線（2）。

中山平温泉
type: Concept
alternative label: 中山平温泉（東日本旅客鉄道 陸羽東線）
broader: g001023
in scheme: scheme
notation: 001023
scope note: 運営会社: 東日本旅客鉄道。路線名: 陸羽東線。鉄道区分: 普通鉄道JR（11）。事業者種別: JR在来線（2）。

南新庄
type: Concept
alternative label: 南新庄（東日本旅客鉄道 陸羽東線）
broader: g001024
in scheme: scheme
notation: 001024
scope note: 運営会社: 東日本旅客鉄道。路線名: 陸羽東線。鉄道区分: 普通鉄道JR（11）。事業者種別: JR在来線（2）。

東長沢
type: Concept
alternative label: 東長沢（東日本旅客鉄道 陸羽東線）
broader: g001025
in scheme: scheme
notation: 001025
scope note: 運営会社: 東日本旅客鉄道。路線名: 陸羽東線。鉄道区分: 普通鉄道JR（11）。事業者種別: JR在来線（2）。

羽前水沢
type: Concept
alternative label: 羽前水沢（東日本旅客鉄道 羽越線）
broader: g001026
in scheme: scheme
notation: 001026
scope note: 運営会社: 東日本旅客鉄道。路線名: 羽越線。鉄道区分: 普通鉄道JR（11）。事業者種別: JR在来線（2）。

新田
type: Concept
alternative label: 新田（東日本旅客鉄道 東北線）
broader: g001027
in scheme: scheme
notation: 001027
scope note: 運営会社: 東日本旅客鉄道。路線名: 東北線。鉄道区分: 普通鉄道JR（11）。事業者種別: JR在来線（2）。

長沢
type: Concept
alternative label: 長沢（東日本旅客鉄道 陸羽東線）
broader: g001028
in scheme: scheme
notation: 001028
scope note: 運営会社: 東日本旅客鉄道。路線名: 陸羽東線。鉄道区分: 普通鉄道JR（11）。事業者種別: JR在来線（2）。

池月
type: Concept
alternative label: 池月（東日本旅客鉄道 陸羽東線）
broader: g001029
in scheme: scheme
notation: 001029
scope note: 運営会社: 東日本旅客鉄道。路線名: 陸羽東線。鉄道区分: 普通鉄道JR（11）。事業者種別: JR在来線（2）。

三瀬
type: Concept
alternative label: 三瀬（東日本旅客鉄道 羽越線）
broader: g001030
in scheme: scheme
notation: 001030
scope note: 運営会社: 東日本旅客鉄道。路線名: 羽越線。鉄道区分: 普通鉄道JR（11）。事業者種別: JR在来線（2）。

小波渡
type: Concept
alternative label: 小波渡（東日本旅客鉄道 羽越線）
broader: g001031
in scheme: scheme
notation: 001031
scope note: 運営会社: 東日本旅客鉄道。路線名: 羽越線。鉄道区分: 普通鉄道JR（11）。事業者種別: JR在来線（2）。

舟形
type: Concept
alternative label: 舟形（東日本旅客鉄道 奥羽線）
broader: g001032
in scheme: scheme
notation: 001032
scope note: 運営会社: 東日本旅客鉄道。路線名: 奥羽線。鉄道区分: 普通鉄道JR（11）。事業者種別: JR在来線（2）。

梅ヶ沢
type: Concept
alternative label: 梅ヶ沢（東日本旅客鉄道 東北線）
broader: g001033
in scheme: scheme
notation: 001033
scope note: 運営会社: 東日本旅客鉄道。路線名: 東北線。鉄道区分: 普通鉄道JR（11）。事業者種別: JR在来線（2）。

上野目
type: Concept
alternative label: 上野目（東日本旅客鉄道 陸羽東線）
broader: g001034
in scheme: scheme
notation: 001034
scope note: 運営会社: 東日本旅客鉄道。路線名: 陸羽東線。鉄道区分: 普通鉄道JR（11）。事業者種別: JR在来線（2）。

五十川
type: Concept
alternative label: 五十川（東日本旅客鉄道 羽越線）
broader: g001035
in scheme: scheme
notation: 001035
scope note: 運営会社: 東日本旅客鉄道。路線名: 羽越線。鉄道区分: 普通鉄道JR（11）。事業者種別: JR在来線（2）。

有備館
type: Concept
alternative label: 有備館（東日本旅客鉄道 陸羽東線）
broader: g001036
in scheme: scheme
notation: 001036
scope note: 運営会社: 東日本旅客鉄道。路線名: 陸羽東線。鉄道区分: 普通鉄道JR（11）。事業者種別: JR在来線（2）。

瀬峰
type: Concept
alternative label: 瀬峰（東日本旅客鉄道 東北線）
broader: g001037
in scheme: scheme
notation: 001037
scope note: 運営会社: 東日本旅客鉄道。路線名: 東北線。鉄道区分: 普通鉄道JR（11）。事業者種別: JR在来線（2）。

芦沢
type: Concept
alternative label: 芦沢（東日本旅客鉄道 奥羽線）
broader: g001038
in scheme: scheme
notation: 001038
scope note: 運営会社: 東日本旅客鉄道。路線名: 奥羽線。鉄道区分: 普通鉄道JR（11）。事業者種別: JR在来線（2）。

岩出山
type: Concept
alternative label: 岩出山（東日本旅客鉄道 陸羽東線）
broader: g001039
in scheme: scheme
notation: 001039
scope note: 運営会社: 東日本旅客鉄道。路線名: 陸羽東線。鉄道区分: 普通鉄道JR（11）。事業者種別: JR在来線（2）。

西大崎
type: Concept
alternative label: 西大崎（東日本旅客鉄道 陸羽東線）
broader: g001040
in scheme: scheme
notation: 001040
scope note: 運営会社: 東日本旅客鉄道。路線名: 陸羽東線。鉄道区分: 普通鉄道JR（11）。事業者種別: JR在来線（2）。

北大石田
type: Concept
alternative label: 北大石田（東日本旅客鉄道 奥羽線）
broader: g001041
in scheme: scheme
notation: 001041
scope note: 運営会社: 東日本旅客鉄道。路線名: 奥羽線。鉄道区分: 普通鉄道JR（11）。事業者種別: JR在来線（2）。

あつみ温泉
type: Concept
alternative label: あつみ温泉（東日本旅客鉄道 羽越線）
broader: g001042
in scheme: scheme
notation: 001042
scope note: 運営会社: 東日本旅客鉄道。路線名: 羽越線。鉄道区分: 普通鉄道JR（11）。事業者種別: JR在来線（2）。

柳津
type: Concept
alternative label: 柳津（東日本旅客鉄道 気仙沼線）
broader: g001043
in scheme: scheme
notation: 001043
scope note: 運営会社: 東日本旅客鉄道。路線名: 気仙沼線。鉄道区分: 普通鉄道JR（11）。事業者種別: JR在来線（2）。

御岳堂
type: Concept
alternative label: 御岳堂（東日本旅客鉄道 気仙沼線）
broader: g001044
in scheme: scheme
notation: 001044
scope note: 運営会社: 東日本旅客鉄道。路線名: 気仙沼線。鉄道区分: 普通鉄道JR（11）。事業者種別: JR在来線（2）。

東大崎
type: Concept
alternative label: 東大崎（東日本旅客鉄道 陸羽東線）
broader: g001045
in scheme: scheme
notation: 001045
scope note: 運営会社: 東日本旅客鉄道。路線名: 陸羽東線。鉄道区分: 普通鉄道JR（11）。事業者種別: JR在来線（2）。

田尻
type: Concept
alternative label: 田尻（東日本旅客鉄道 東北線）
broader: g001046
in scheme: scheme
notation: 001046
scope note: 運営会社: 東日本旅客鉄道。路線名: 東北線。鉄道区分: 普通鉄道JR（11）。事業者種別: JR在来線（2）。

大石田
type: Concept
alternative label: 大石田（東日本旅客鉄道 奥羽線）
broader: g001047
in scheme: scheme
notation: 001047
scope note: 運営会社: 東日本旅客鉄道。路線名: 奥羽線。鉄道区分: 普通鉄道JR（11）。事業者種別: JR在来線（2）。

小岩川
type: Concept
alternative label: 小岩川（東日本旅客鉄道 羽越線）
broader: g001048
in scheme: scheme
notation: 001048
scope note: 運営会社: 東日本旅客鉄道。路線名: 羽越線。鉄道区分: 普通鉄道JR（11）。事業者種別: JR在来線（2）。

陸前豊里
type: Concept
alternative label: 陸前豊里（東日本旅客鉄道 気仙沼線）
broader: g001049
in scheme: scheme
notation: 001049
scope note: 運営会社: 東日本旅客鉄道。路線名: 気仙沼線。鉄道区分: 普通鉄道JR（11）。事業者種別: JR在来線（2）。

西古川
type: Concept
alternative label: 西古川（東日本旅客鉄道 陸羽東線）
broader: g001050
in scheme: scheme
notation: 001050
scope note: 運営会社: 東日本旅客鉄道。路線名: 陸羽東線。鉄道区分: 普通鉄道JR（11）。事業者種別: JR在来線（2）。

塚目
type: Concept
alternative label: 塚目（東日本旅客鉄道 陸羽東線）
broader: g001051
in scheme: scheme
notation: 001051
scope note: 運営会社: 東日本旅客鉄道。路線名: 陸羽東線。鉄道区分: 普通鉄道JR（11）。事業者種別: JR在来線（2）。

古川
type: Concept
alternative label: 古川（東日本旅客鉄道 東北新幹線）
broader: g001052
in scheme: scheme
notation: 001052
scope note: 運営会社: 東日本旅客鉄道。路線名: 東北新幹線。鉄道区分: 普通鉄道JR（11）。事業者種別: JRの新幹線（1）。

古川
type: Concept
alternative label: 古川（東日本旅客鉄道 陸羽東線）
broader: g001052
in scheme: scheme
notation: 001053
scope note: 運営会社: 東日本旅客鉄道。路線名: 陸羽東線。鉄道区分: 普通鉄道JR（11）。事業者種別: JR在来線（2）。

陸前谷地
type: Concept
alternative label: 陸前谷地（東日本旅客鉄道 陸羽東線）
broader: g001054
in scheme: scheme
notation: 001054
scope note: 運営会社: 東日本旅客鉄道。路線名: 陸羽東線。鉄道区分: 普通鉄道JR（11）。事業者種別: JR在来線（2）。

北浦
type: Concept
alternative label: 北浦（東日本旅客鉄道 陸羽東線）
broader: g001055
in scheme: scheme
notation: 001055
scope note: 運営会社: 東日本旅客鉄道。路線名: 陸羽東線。鉄道区分: 普通鉄道JR（11）。事業者種別: JR在来線（2）。

鼠ヶ関
type: Concept
alternative label: 鼠ヶ関（東日本旅客鉄道 羽越線）
broader: g001056
in scheme: scheme
notation: 001056
scope note: 運営会社: 東日本旅客鉄道。路線名: 羽越線。鉄道区分: 普通鉄道JR（11）。事業者種別: JR在来線（2）。

のの岳
type: Concept
alternative label: のの岳（東日本旅客鉄道 気仙沼線）
broader: g001057
in scheme: scheme
notation: 001057
scope note: 運営会社: 東日本旅客鉄道。路線名: 気仙沼線。鉄道区分: 普通鉄道JR（11）。事業者種別: JR在来線（2）。

上涌谷
type: Concept
alternative label: 上涌谷（東日本旅客鉄道 石巻線）
broader: g001058
in scheme: scheme
notation: 001058
scope note: 運営会社: 東日本旅客鉄道。路線名: 石巻線。鉄道区分: 普通鉄道JR（11）。事業者種別: JR在来線（2）。

袖崎
type: Concept
alternative label: 袖崎（東日本旅客鉄道 奥羽線）
broader: g001059
in scheme: scheme
notation: 001059
scope note: 運営会社: 東日本旅客鉄道。路線名: 奥羽線。鉄道区分: 普通鉄道JR（11）。事業者種別: JR在来線（2）。

小牛田
type: Concept
alternative label: 小牛田（東日本旅客鉄道 石巻線）
broader: g001060
in scheme: scheme
notation: 001060
scope note: 運営会社: 東日本旅客鉄道。路線名: 石巻線。鉄道区分: 普通鉄道JR（11）。事業者種別: JR在来線（2）。

小牛田
type: Concept
alternative label: 小牛田（東日本旅客鉄道 東北線）
broader: g001060
in scheme: scheme
notation: 001061
scope note: 運営会社: 東日本旅客鉄道。路線名: 東北線。鉄道区分: 普通鉄道JR（11）。事業者種別: JR在来線（2）。

小牛田
type: Concept
alternative label: 小牛田（東日本旅客鉄道 陸羽東線）
broader: g001060
in scheme: scheme
notation: 001062
scope note: 運営会社: 東日本旅客鉄道。路線名: 陸羽東線。鉄道区分: 普通鉄道JR（11）。事業者種別: JR在来線（2）。

涌谷
type: Concept
alternative label: 涌谷（東日本旅客鉄道 石巻線）
broader: g001063
in scheme: scheme
notation: 001063
scope note: 運営会社: 東日本旅客鉄道。路線名: 石巻線。鉄道区分: 普通鉄道JR（11）。事業者種別: JR在来線（2）。

和渕
type: Concept
alternative label: 和渕（東日本旅客鉄道 気仙沼線）
broader: g001064
in scheme: scheme
notation: 001064
scope note: 運営会社: 東日本旅客鉄道。路線名: 気仙沼線。鉄道区分: 普通鉄道JR（11）。事業者種別: JR在来線（2）。

府屋
type: Concept
alternative label: 府屋（東日本旅客鉄道 羽越線）
broader: g001065
in scheme: scheme
notation: 001065
scope note: 運営会社: 東日本旅客鉄道。路線名: 羽越線。鉄道区分: 普通鉄道JR（11）。事業者種別: JR在来線（2）。

松山町
type: Concept
alternative label: 松山町（東日本旅客鉄道 東北線）
broader: g001066
in scheme: scheme
notation: 001066
scope note: 運営会社: 東日本旅客鉄道。路線名: 東北線。鉄道区分: 普通鉄道JR（11）。事業者種別: JR在来線（2）。

前谷地
type: Concept
alternative label: 前谷地（東日本旅客鉄道 気仙沼線）
broader: g001067
in scheme: scheme
notation: 001067
scope note: 運営会社: 東日本旅客鉄道。路線名: 気仙沼線。鉄道区分: 普通鉄道JR（11）。事業者種別: JR在来線（2）。

前谷地
type: Concept
alternative label: 前谷地（東日本旅客鉄道 石巻線）
broader: g001067
in scheme: scheme
notation: 001068
scope note: 運営会社: 東日本旅客鉄道。路線名: 石巻線。鉄道区分: 普通鉄道JR（11）。事業者種別: JR在来線（2）。

佳景山
type: Concept
alternative label: 佳景山（東日本旅客鉄道 石巻線）
broader: g001069
in scheme: scheme
notation: 001069
scope note: 運営会社: 東日本旅客鉄道。路線名: 石巻線。鉄道区分: 普通鉄道JR（11）。事業者種別: JR在来線（2）。

勝木
type: Concept
alternative label: 勝木（東日本旅客鉄道 羽越線）
broader: g001070
in scheme: scheme
notation: 001070
scope note: 運営会社: 東日本旅客鉄道。路線名: 羽越線。鉄道区分: 普通鉄道JR（11）。事業者種別: JR在来線（2）。

鹿又
type: Concept
alternative label: 鹿又（東日本旅客鉄道 石巻線）
broader: g001071
in scheme: scheme
notation: 001071
scope note: 運営会社: 東日本旅客鉄道。路線名: 石巻線。鉄道区分: 普通鉄道JR（11）。事業者種別: JR在来線（2）。

村山
type: Concept
alternative label: 村山（東日本旅客鉄道 奥羽線）
broader: g001072
in scheme: scheme
notation: 001072
scope note: 運営会社: 東日本旅客鉄道。路線名: 奥羽線。鉄道区分: 普通鉄道JR（11）。事業者種別: JR在来線（2）。

鹿島台
type: Concept
alternative label: 鹿島台（東日本旅客鉄道 東北線）
broader: g001073
in scheme: scheme
notation: 001073
scope note: 運営会社: 東日本旅客鉄道。路線名: 東北線。鉄道区分: 普通鉄道JR（11）。事業者種別: JR在来線（2）。

曽波神
type: Concept
alternative label: 曽波神（東日本旅客鉄道 石巻線）
broader: g001074
in scheme: scheme
notation: 001074
scope note: 運営会社: 東日本旅客鉄道。路線名: 石巻線。鉄道区分: 普通鉄道JR（11）。事業者種別: JR在来線（2）。

東根
type: Concept
alternative label: 東根（東日本旅客鉄道 奥羽線）
broader: g001075
in scheme: scheme
notation: 001075
scope note: 運営会社: 東日本旅客鉄道。路線名: 奥羽線。鉄道区分: 普通鉄道JR（11）。事業者種別: JR在来線（2）。

越後寒川
type: Concept
alternative label: 越後寒川（東日本旅客鉄道 羽越線）
broader: g001076
in scheme: scheme
notation: 001076
scope note: 運営会社: 東日本旅客鉄道。路線名: 羽越線。鉄道区分: 普通鉄道JR（11）。事業者種別: JR在来線（2）。

女川
type: Concept
alternative label: 女川（東日本旅客鉄道 石巻線）
broader: g001077
in scheme: scheme
notation: 001077
scope note: 運営会社: 東日本旅客鉄道。路線名: 石巻線。鉄道区分: 普通鉄道JR（11）。事業者種別: JR在来線（2）。

陸前稲井
type: Concept
alternative label: 陸前稲井（東日本旅客鉄道 石巻線）
broader: g001078
in scheme: scheme
notation: 001078
scope note: 運営会社: 東日本旅客鉄道。路線名: 石巻線。鉄道区分: 普通鉄道JR（11）。事業者種別: JR在来線（2）。

蛇田
type: Concept
alternative label: 蛇田（東日本旅客鉄道 仙石線）
broader: g001079
in scheme: scheme
notation: 001079
scope note: 運営会社: 東日本旅客鉄道。路線名: 仙石線。鉄道区分: 普通鉄道JR（11）。事業者種別: JR在来線（2）。

陸前山下
type: Concept
alternative label: 陸前山下（東日本旅客鉄道 仙石線）
broader: g001080
in scheme: scheme
notation: 001080
scope note: 運営会社: 東日本旅客鉄道。路線名: 仙石線。鉄道区分: 普通鉄道JR（11）。事業者種別: JR在来線（2）。

浦宿
type: Concept
alternative label: 浦宿（東日本旅客鉄道 石巻線）
broader: g001081
in scheme: scheme
notation: 001081
scope note: 運営会社: 東日本旅客鉄道。路線名: 石巻線。鉄道区分: 普通鉄道JR（11）。事業者種別: JR在来線（2）。

石巻あゆみ野
type: Concept
alternative label: 石巻あゆみ野（東日本旅客鉄道 仙石線）
broader: g001082
in scheme: scheme
notation: 001082
scope note: 運営会社: 東日本旅客鉄道。路線名: 仙石線。鉄道区分: 普通鉄道JR（11）。事業者種別: JR在来線（2）。

石巻
type: Concept
alternative label: 石巻（東日本旅客鉄道 石巻線）
broader: g001083
in scheme: scheme
notation: 001083
scope note: 運営会社: 東日本旅客鉄道。路線名: 石巻線。鉄道区分: 普通鉄道JR（11）。事業者種別: JR在来線（2）。

石巻
type: Concept
alternative label: 石巻（東日本旅客鉄道 仙石線）
broader: g001083
in scheme: scheme
notation: 001084
scope note: 運営会社: 東日本旅客鉄道。路線名: 仙石線。鉄道区分: 普通鉄道JR（11）。事業者種別: JR在来線（2）。

陸前赤井
type: Concept
alternative label: 陸前赤井（東日本旅客鉄道 仙石線）
broader: g001085
in scheme: scheme
notation: 001085
scope note: 運営会社: 東日本旅客鉄道。路線名: 仙石線。鉄道区分: 普通鉄道JR（11）。事業者種別: JR在来線（2）。

沢田
type: Concept
alternative label: 沢田（東日本旅客鉄道 石巻線）
broader: g001086
in scheme: scheme
notation: 001086
scope note: 運営会社: 東日本旅客鉄道。路線名: 石巻線。鉄道区分: 普通鉄道JR（11）。事業者種別: JR在来線（2）。

品井沼
type: Concept
alternative label: 品井沼（東日本旅客鉄道 東北線）
broader: g001087
in scheme: scheme
notation: 001087
scope note: 運営会社: 東日本旅客鉄道。路線名: 東北線。鉄道区分: 普通鉄道JR（11）。事業者種別: JR在来線（2）。

万石浦
type: Concept
alternative label: 万石浦（東日本旅客鉄道 石巻線）
broader: g001088
in scheme: scheme
notation: 001088
scope note: 運営会社: 東日本旅客鉄道。路線名: 石巻線。鉄道区分: 普通鉄道JR（11）。事業者種別: JR在来線（2）。

さくらんぼ東根
type: Concept
alternative label: さくらんぼ東根（東日本旅客鉄道 奥羽線）
broader: g001089
in scheme: scheme
notation: 001089
scope note: 運営会社: 東日本旅客鉄道。路線名: 奥羽線。鉄道区分: 普通鉄道JR（11）。事業者種別: JR在来線（2）。

東矢本
type: Concept
alternative label: 東矢本（東日本旅客鉄道 仙石線）
broader: g001090
in scheme: scheme
notation: 001090
scope note: 運営会社: 東日本旅客鉄道。路線名: 仙石線。鉄道区分: 普通鉄道JR（11）。事業者種別: JR在来線（2）。

矢本
type: Concept
alternative label: 矢本（東日本旅客鉄道 仙石線）
broader: g001091
in scheme: scheme
notation: 001091
scope note: 運営会社: 東日本旅客鉄道。路線名: 仙石線。鉄道区分: 普通鉄道JR（11）。事業者種別: JR在来線（2）。

渡波
type: Concept
alternative label: 渡波（東日本旅客鉄道 石巻線）
broader: g001092
in scheme: scheme
notation: 001092
scope note: 運営会社: 東日本旅客鉄道。路線名: 石巻線。鉄道区分: 普通鉄道JR（11）。事業者種別: JR在来線（2）。

神町
type: Concept
alternative label: 神町（東日本旅客鉄道 奥羽線）
broader: g001093
in scheme: scheme
notation: 001093
scope note: 運営会社: 東日本旅客鉄道。路線名: 奥羽線。鉄道区分: 普通鉄道JR（11）。事業者種別: JR在来線（2）。

今川
type: Concept
alternative label: 今川（東日本旅客鉄道 羽越線）
broader: g001094
in scheme: scheme
notation: 001094
scope note: 運営会社: 東日本旅客鉄道。路線名: 羽越線。鉄道区分: 普通鉄道JR（11）。事業者種別: JR在来線（2）。

鹿妻
type: Concept
alternative label: 鹿妻（東日本旅客鉄道 仙石線）
broader: g001095
in scheme: scheme
notation: 001095
scope note: 運営会社: 東日本旅客鉄道。路線名: 仙石線。鉄道区分: 普通鉄道JR（11）。事業者種別: JR在来線（2）。

愛宕
type: Concept
alternative label: 愛宕（東日本旅客鉄道 東北線）
broader: g001096
in scheme: scheme
notation: 001096
scope note: 運営会社: 東日本旅客鉄道。路線名: 東北線。鉄道区分: 普通鉄道JR（11）。事業者種別: JR在来線（2）。

羽前高松
type: Concept
alternative label: 羽前高松（東日本旅客鉄道 左沢線）
broader: g001097
in scheme: scheme
notation: 001097
scope note: 運営会社: 東日本旅客鉄道。路線名: 左沢線。鉄道区分: 普通鉄道JR（11）。事業者種別: JR在来線（2）。

陸前小野
type: Concept
alternative label: 陸前小野（東日本旅客鉄道 仙石線）
broader: g001098
in scheme: scheme
notation: 001098
scope note: 運営会社: 東日本旅客鉄道。路線名: 仙石線。鉄道区分: 普通鉄道JR（11）。事業者種別: JR在来線（2）。

手樽
type: Concept
alternative label: 手樽（東日本旅客鉄道 仙石線）
broader: g001099
in scheme: scheme
notation: 001099
scope note: 運営会社: 東日本旅客鉄道。路線名: 仙石線。鉄道区分: 普通鉄道JR（11）。事業者種別: JR在来線（2）。

乱川
type: Concept
alternative label: 乱川（東日本旅客鉄道 奥羽線）
broader: g001100
in scheme: scheme
notation: 001100
scope note: 運営会社: 東日本旅客鉄道。路線名: 奥羽線。鉄道区分: 普通鉄道JR（11）。事業者種別: JR在来線（2）。

陸前富山
type: Concept
alternative label: 陸前富山（東日本旅客鉄道 仙石線）
broader: g001101
in scheme: scheme
notation: 001101
scope note: 運営会社: 東日本旅客鉄道。路線名: 仙石線。鉄道区分: 普通鉄道JR（11）。事業者種別: JR在来線（2）。

高城町
type: Concept
alternative label: 高城町（東日本旅客鉄道 仙石線）
broader: g001102
in scheme: scheme
notation: 001102
scope note: 運営会社: 東日本旅客鉄道。路線名: 仙石線。鉄道区分: 普通鉄道JR（11）。事業者種別: JR在来線（2）。

高城町
type: Concept
alternative label: 高城町（東日本旅客鉄道 東北線）
broader: g001102
in scheme: scheme
notation: 001103
scope note: 運営会社: 東日本旅客鉄道。路線名: 東北線。鉄道区分: 普通鉄道JR（11）。事業者種別: JR在来線（2）。

左沢
type: Concept
alternative label: 左沢（東日本旅客鉄道 左沢線）
broader: g001104
in scheme: scheme
notation: 001104
scope note: 運営会社: 東日本旅客鉄道。路線名: 左沢線。鉄道区分: 普通鉄道JR（11）。事業者種別: JR在来線（2）。

柴橋
type: Concept
alternative label: 柴橋（東日本旅客鉄道 左沢線）
broader: g001105
in scheme: scheme
notation: 001105
scope note: 運営会社: 東日本旅客鉄道。路線名: 左沢線。鉄道区分: 普通鉄道JR（11）。事業者種別: JR在来線（2）。

西寒河江
type: Concept
alternative label: 西寒河江（東日本旅客鉄道 左沢線）
broader: g001106
in scheme: scheme
notation: 001106
scope note: 運営会社: 東日本旅客鉄道。路線名: 左沢線。鉄道区分: 普通鉄道JR（11）。事業者種別: JR在来線（2）。

松島
type: Concept
alternative label: 松島（東日本旅客鉄道 東北線）
broader: g001107
in scheme: scheme
notation: 001107
scope note: 運営会社: 東日本旅客鉄道。路線名: 東北線。鉄道区分: 普通鉄道JR（11）。事業者種別: JR在来線（2）。

陸前大塚
type: Concept
alternative label: 陸前大塚（東日本旅客鉄道 仙石線）
broader: g001108
in scheme: scheme
notation: 001108
scope note: 運営会社: 東日本旅客鉄道。路線名: 仙石線。鉄道区分: 普通鉄道JR（11）。事業者種別: JR在来線（2）。

野蒜
type: Concept
alternative label: 野蒜（東日本旅客鉄道 仙石線）
broader: g001109
in scheme: scheme
notation: 001109
scope note: 運営会社: 東日本旅客鉄道。路線名: 仙石線。鉄道区分: 普通鉄道JR（11）。事業者種別: JR在来線（2）。

東名
type: Concept
alternative label: 東名（東日本旅客鉄道 仙石線）
broader: g001110
in scheme: scheme
notation: 001110
scope note: 運営会社: 東日本旅客鉄道。路線名: 仙石線。鉄道区分: 普通鉄道JR（11）。事業者種別: JR在来線（2）。

桑川
type: Concept
alternative label: 桑川（東日本旅客鉄道 羽越線）
broader: g001111
in scheme: scheme
notation: 001111
scope note: 運営会社: 東日本旅客鉄道。路線名: 羽越線。鉄道区分: 普通鉄道JR（11）。事業者種別: JR在来線（2）。

寒河江
type: Concept
alternative label: 寒河江（東日本旅客鉄道 左沢線）
broader: g001112
in scheme: scheme
notation: 001112
scope note: 運営会社: 東日本旅客鉄道。路線名: 左沢線。鉄道区分: 普通鉄道JR（11）。事業者種別: JR在来線（2）。

松島海岸
type: Concept
alternative label: 松島海岸（東日本旅客鉄道 仙石線）
broader: g001113
in scheme: scheme
notation: 001113
scope note: 運営会社: 東日本旅客鉄道。路線名: 仙石線。鉄道区分: 普通鉄道JR（11）。事業者種別: JR在来線（2）。

天童
type: Concept
alternative label: 天童（東日本旅客鉄道 奥羽線）
broader: g001114
in scheme: scheme
notation: 001114
scope note: 運営会社: 東日本旅客鉄道。路線名: 奥羽線。鉄道区分: 普通鉄道JR（11）。事業者種別: JR在来線（2）。

南寒河江
type: Concept
alternative label: 南寒河江（東日本旅客鉄道 左沢線）
broader: g001115
in scheme: scheme
notation: 001115
scope note: 運営会社: 東日本旅客鉄道。路線名: 左沢線。鉄道区分: 普通鉄道JR（11）。事業者種別: JR在来線（2）。

陸前浜田
type: Concept
alternative label: 陸前浜田（東日本旅客鉄道 仙石線）
broader: g001116
in scheme: scheme
notation: 001116
scope note: 運営会社: 東日本旅客鉄道。路線名: 仙石線。鉄道区分: 普通鉄道JR（11）。事業者種別: JR在来線（2）。

天童南
type: Concept
alternative label: 天童南（東日本旅客鉄道 奥羽線）
broader: g001117
in scheme: scheme
notation: 001117
scope note: 運営会社: 東日本旅客鉄道。路線名: 奥羽線。鉄道区分: 普通鉄道JR（11）。事業者種別: JR在来線（2）。

面白山高原
type: Concept
alternative label: 面白山高原（東日本旅客鉄道 仙山線）
broader: g001118
in scheme: scheme
notation: 001118
scope note: 運営会社: 東日本旅客鉄道。路線名: 仙山線。鉄道区分: 普通鉄道JR（11）。事業者種別: JR在来線（2）。

羽前長崎
type: Concept
alternative label: 羽前長崎（東日本旅客鉄道 左沢線）
broader: g001119
in scheme: scheme
notation: 001119
scope note: 運営会社: 東日本旅客鉄道。路線名: 左沢線。鉄道区分: 普通鉄道JR（11）。事業者種別: JR在来線（2）。

高擶
type: Concept
alternative label: 高擶（東日本旅客鉄道 奥羽線）
broader: g001120
in scheme: scheme
notation: 001120
scope note: 運営会社: 東日本旅客鉄道。路線名: 奥羽線。鉄道区分: 普通鉄道JR（11）。事業者種別: JR在来線（2）。

利府
type: Concept
alternative label: 利府（東日本旅客鉄道 東北線）
broader: g001121
in scheme: scheme
notation: 001121
scope note: 運営会社: 東日本旅客鉄道。路線名: 東北線。鉄道区分: 普通鉄道JR（11）。事業者種別: JR在来線（2）。

奥新川
type: Concept
alternative label: 奥新川（東日本旅客鉄道 仙山線）
broader: g001122
in scheme: scheme
notation: 001122
scope note: 運営会社: 東日本旅客鉄道。路線名: 仙山線。鉄道区分: 普通鉄道JR（11）。事業者種別: JR在来線（2）。

東塩釜
type: Concept
alternative label: 東塩釜（東日本旅客鉄道 仙石線）
broader: g001123
in scheme: scheme
notation: 001123
scope note: 運営会社: 東日本旅客鉄道。路線名: 仙石線。鉄道区分: 普通鉄道JR（11）。事業者種別: JR在来線（2）。

泉中央
type: Concept
alternative label: 泉中央（仙台市 南北線）
broader: g001124
in scheme: scheme
notation: 001124
scope note: 運営会社: 仙台市。路線名: 南北線。鉄道区分: 普通鉄道（12）。事業者種別: 公営鉄道（3）。

羽前金沢
type: Concept
alternative label: 羽前金沢（東日本旅客鉄道 左沢線）
broader: g001125
in scheme: scheme
notation: 001125
scope note: 運営会社: 東日本旅客鉄道。路線名: 左沢線。鉄道区分: 普通鉄道JR（11）。事業者種別: JR在来線（2）。

作並
type: Concept
alternative label: 作並（東日本旅客鉄道 仙山線）
broader: g001126
in scheme: scheme
notation: 001126
scope note: 運営会社: 東日本旅客鉄道。路線名: 仙山線。鉄道区分: 普通鉄道JR（11）。事業者種別: JR在来線（2）。

本塩釜
type: Concept
alternative label: 本塩釜（東日本旅客鉄道 仙石線）
broader: g001127
in scheme: scheme
notation: 001127
scope note: 運営会社: 東日本旅客鉄道。路線名: 仙石線。鉄道区分: 普通鉄道JR（11）。事業者種別: JR在来線（2）。

新利府
type: Concept
alternative label: 新利府（東日本旅客鉄道 東北線）
broader: g001128
in scheme: scheme
notation: 001128
scope note: 運営会社: 東日本旅客鉄道。路線名: 東北線。鉄道区分: 普通鉄道JR（11）。事業者種別: JR在来線（2）。

越後早川
type: Concept
alternative label: 越後早川（東日本旅客鉄道 羽越線）
broader: g001129
in scheme: scheme
notation: 001129
scope note: 運営会社: 東日本旅客鉄道。路線名: 羽越線。鉄道区分: 普通鉄道JR（11）。事業者種別: JR在来線（2）。

漆山
type: Concept
alternative label: 漆山（東日本旅客鉄道 奥羽線）
broader: g001130
in scheme: scheme
notation: 001130
scope note: 運営会社: 東日本旅客鉄道。路線名: 奥羽線。鉄道区分: 普通鉄道JR（11）。事業者種別: JR在来線（2）。

八乙女
type: Concept
alternative label: 八乙女（仙台市 南北線）
broader: g001131
in scheme: scheme
notation: 001131
scope note: 運営会社: 仙台市。路線名: 南北線。鉄道区分: 普通鉄道（12）。事業者種別: 公営鉄道（3）。

西塩釜
type: Concept
alternative label: 西塩釜（東日本旅客鉄道 仙石線）
broader: g001132
in scheme: scheme
notation: 001132
scope note: 運営会社: 東日本旅客鉄道。路線名: 仙石線。鉄道区分: 普通鉄道JR（11）。事業者種別: JR在来線（2）。

塩釜
type: Concept
alternative label: 塩釜（東日本旅客鉄道 東北線）
broader: g001133
in scheme: scheme
notation: 001133
scope note: 運営会社: 東日本旅客鉄道。路線名: 東北線。鉄道区分: 普通鉄道JR（11）。事業者種別: JR在来線（2）。

山寺
type: Concept
alternative label: 山寺（東日本旅客鉄道 仙山線）
broader: g001134
in scheme: scheme
notation: 001134
scope note: 運営会社: 東日本旅客鉄道。路線名: 仙山線。鉄道区分: 普通鉄道JR（11）。事業者種別: JR在来線（2）。

下馬
type: Concept
alternative label: 下馬（東日本旅客鉄道 仙石線）
broader: g001135
in scheme: scheme
notation: 001135
scope note: 運営会社: 東日本旅客鉄道。路線名: 仙石線。鉄道区分: 普通鉄道JR（11）。事業者種別: JR在来線（2）。

黒松
type: Concept
alternative label: 黒松（仙台市 南北線）
broader: g001136
in scheme: scheme
notation: 001136
scope note: 運営会社: 仙台市。路線名: 南北線。鉄道区分: 普通鉄道（12）。事業者種別: 公営鉄道（3）。

南出羽
type: Concept
alternative label: 南出羽（東日本旅客鉄道 奥羽線）
broader: g001137
in scheme: scheme
notation: 001137
scope note: 運営会社: 東日本旅客鉄道。路線名: 奥羽線。鉄道区分: 普通鉄道JR（11）。事業者種別: JR在来線（2）。

楯山
type: Concept
alternative label: 楯山（東日本旅客鉄道 仙山線）
broader: g001138
in scheme: scheme
notation: 001138
scope note: 運営会社: 東日本旅客鉄道。路線名: 仙山線。鉄道区分: 普通鉄道JR（11）。事業者種別: JR在来線（2）。

高瀬
type: Concept
alternative label: 高瀬（東日本旅客鉄道 仙山線）
broader: g001139
in scheme: scheme
notation: 001139
scope note: 運営会社: 東日本旅客鉄道。路線名: 仙山線。鉄道区分: 普通鉄道JR（11）。事業者種別: JR在来線（2）。

国府多賀城
type: Concept
alternative label: 国府多賀城（東日本旅客鉄道 東北線）
broader: g001140
in scheme: scheme
notation: 001140
scope note: 運営会社: 東日本旅客鉄道。路線名: 東北線。鉄道区分: 普通鉄道JR（11）。事業者種別: JR在来線（2）。

岩切
type: Concept
alternative label: 岩切（東日本旅客鉄道 東北線）
broader: g001141
in scheme: scheme
notation: 001141
scope note: 運営会社: 東日本旅客鉄道。路線名: 東北線。鉄道区分: 普通鉄道JR（11）。事業者種別: JR在来線（2）。

陸前山王
type: Concept
alternative label: 陸前山王（東日本旅客鉄道 東北線）
broader: g001142
in scheme: scheme
notation: 001142
scope note: 運営会社: 東日本旅客鉄道。路線名: 東北線。鉄道区分: 普通鉄道JR（11）。事業者種別: JR在来線（2）。

熊ヶ根
type: Concept
alternative label: 熊ヶ根（東日本旅客鉄道 仙山線）
broader: g001143
in scheme: scheme
notation: 001143
scope note: 運営会社: 東日本旅客鉄道。路線名: 仙山線。鉄道区分: 普通鉄道JR（11）。事業者種別: JR在来線（2）。

旭ヶ丘
type: Concept
alternative label: 旭ヶ丘（仙台市 南北線）
broader: g001144
in scheme: scheme
notation: 001144
scope note: 運営会社: 仙台市。路線名: 南北線。鉄道区分: 普通鉄道（12）。事業者種別: 公営鉄道（3）。

羽前山辺
type: Concept
alternative label: 羽前山辺（東日本旅客鉄道 左沢線）
broader: g001145
in scheme: scheme
notation: 001145
scope note: 運営会社: 東日本旅客鉄道。路線名: 左沢線。鉄道区分: 普通鉄道JR（11）。事業者種別: JR在来線（2）。

多賀城
type: Concept
alternative label: 多賀城（東日本旅客鉄道 仙石線）
broader: g001146
in scheme: scheme
notation: 001146
scope note: 運営会社: 東日本旅客鉄道。路線名: 仙石線。鉄道区分: 普通鉄道JR（11）。事業者種別: JR在来線（2）。

台原
type: Concept
alternative label: 台原（仙台市 南北線）
broader: g001147
in scheme: scheme
notation: 001147
scope note: 運営会社: 仙台市。路線名: 南北線。鉄道区分: 普通鉄道（12）。事業者種別: 公営鉄道（3）。

羽前千歳
type: Concept
alternative label: 羽前千歳（東日本旅客鉄道 奥羽線）
broader: g001148
in scheme: scheme
notation: 001148
scope note: 運営会社: 東日本旅客鉄道。路線名: 奥羽線。鉄道区分: 普通鉄道JR（11）。事業者種別: JR在来線（2）。

羽前千歳
type: Concept
alternative label: 羽前千歳（東日本旅客鉄道 仙山線）
broader: g001148
in scheme: scheme
notation: 001149
scope note: 運営会社: 東日本旅客鉄道。路線名: 仙山線。鉄道区分: 普通鉄道JR（11）。事業者種別: JR在来線（2）。

北山
type: Concept
alternative label: 北山（東日本旅客鉄道 仙山線）
broader: g001150
in scheme: scheme
notation: 001150
scope note: 運営会社: 東日本旅客鉄道。路線名: 仙山線。鉄道区分: 普通鉄道JR（11）。事業者種別: JR在来線（2）。

北仙台
type: Concept
alternative label: 北仙台（仙台市 南北線）
broader: g001151
in scheme: scheme
notation: 001151
scope note: 運営会社: 仙台市。路線名: 南北線。鉄道区分: 普通鉄道（12）。事業者種別: 公営鉄道（3）。

北仙台
type: Concept
alternative label: 北仙台（東日本旅客鉄道 仙山線）
broader: g001151
in scheme: scheme
notation: 001152
scope note: 運営会社: 東日本旅客鉄道。路線名: 仙山線。鉄道区分: 普通鉄道JR（11）。事業者種別: JR在来線（2）。

中野栄
type: Concept
alternative label: 中野栄（東日本旅客鉄道 仙石線）
broader: g001153
in scheme: scheme
notation: 001153
scope note: 運営会社: 東日本旅客鉄道。路線名: 仙石線。鉄道区分: 普通鉄道JR（11）。事業者種別: JR在来線（2）。

東北福祉大前
type: Concept
alternative label: 東北福祉大前（東日本旅客鉄道 仙山線）
broader: g001154
in scheme: scheme
notation: 001154
scope note: 運営会社: 東日本旅客鉄道。路線名: 仙山線。鉄道区分: 普通鉄道JR（11）。事業者種別: JR在来線（2）。

陸前白沢
type: Concept
alternative label: 陸前白沢（東日本旅客鉄道 仙山線）
broader: g001155
in scheme: scheme
notation: 001155
scope note: 運営会社: 東日本旅客鉄道。路線名: 仙山線。鉄道区分: 普通鉄道JR（11）。事業者種別: JR在来線（2）。

東照宮
type: Concept
alternative label: 東照宮（東日本旅客鉄道 仙山線）
broader: g001156
in scheme: scheme
notation: 001156
scope note: 運営会社: 東日本旅客鉄道。路線名: 仙山線。鉄道区分: 普通鉄道JR（11）。事業者種別: JR在来線（2）。

東金井
type: Concept
alternative label: 東金井（東日本旅客鉄道 左沢線）
broader: g001157
in scheme: scheme
notation: 001157
scope note: 運営会社: 東日本旅客鉄道。路線名: 左沢線。鉄道区分: 普通鉄道JR（11）。事業者種別: JR在来線（2）。

東仙台
type: Concept
alternative label: 東仙台（東日本旅客鉄道 東北線）
broader: g001158
in scheme: scheme
notation: 001158
scope note: 運営会社: 東日本旅客鉄道。路線名: 東北線。鉄道区分: 普通鉄道JR（11）。事業者種別: JR在来線（2）。

福田町
type: Concept
alternative label: 福田町（東日本旅客鉄道 仙石線）
broader: g001159
in scheme: scheme
notation: 001159
scope note: 運営会社: 東日本旅客鉄道。路線名: 仙石線。鉄道区分: 普通鉄道JR（11）。事業者種別: JR在来線（2）。

国見
type: Concept
alternative label: 国見（東日本旅客鉄道 仙山線）
broader: g001160
in scheme: scheme
notation: 001160
scope note: 運営会社: 東日本旅客鉄道。路線名: 仙山線。鉄道区分: 普通鉄道JR（11）。事業者種別: JR在来線（2）。

陸前高砂
type: Concept
alternative label: 陸前高砂（東日本旅客鉄道 仙石線）
broader: g001161
in scheme: scheme
notation: 001161
scope note: 運営会社: 東日本旅客鉄道。路線名: 仙石線。鉄道区分: 普通鉄道JR（11）。事業者種別: JR在来線（2）。

陸前落合
type: Concept
alternative label: 陸前落合（東日本旅客鉄道 仙山線）
broader: g001162
in scheme: scheme
notation: 001162
scope note: 運営会社: 東日本旅客鉄道。路線名: 仙山線。鉄道区分: 普通鉄道JR（11）。事業者種別: JR在来線（2）。

小鶴新田
type: Concept
alternative label: 小鶴新田（東日本旅客鉄道 仙石線）
broader: g001163
in scheme: scheme
notation: 001163
scope note: 運営会社: 東日本旅客鉄道。路線名: 仙石線。鉄道区分: 普通鉄道JR（11）。事業者種別: JR在来線（2）。

間島
type: Concept
alternative label: 間島（東日本旅客鉄道 羽越線）
broader: g001164
in scheme: scheme
notation: 001164
scope note: 運営会社: 東日本旅客鉄道。路線名: 羽越線。鉄道区分: 普通鉄道JR（11）。事業者種別: JR在来線（2）。

愛子
type: Concept
alternative label: 愛子（東日本旅客鉄道 仙山線）
broader: g001165
in scheme: scheme
notation: 001165
scope note: 運営会社: 東日本旅客鉄道。路線名: 仙山線。鉄道区分: 普通鉄道JR（11）。事業者種別: JR在来線（2）。

北四番丁
type: Concept
alternative label: 北四番丁（仙台市 南北線）
broader: g001166
in scheme: scheme
notation: 001166
scope note: 運営会社: 仙台市。路線名: 南北線。鉄道区分: 普通鉄道（12）。事業者種別: 公営鉄道（3）。

葛岡
type: Concept
alternative label: 葛岡（東日本旅客鉄道 仙山線）
broader: g001167
in scheme: scheme
notation: 001167
scope note: 運営会社: 東日本旅客鉄道。路線名: 仙山線。鉄道区分: 普通鉄道JR（11）。事業者種別: JR在来線（2）。

苦竹
type: Concept
alternative label: 苦竹（東日本旅客鉄道 仙石線）
broader: g001168
in scheme: scheme
notation: 001168
scope note: 運営会社: 東日本旅客鉄道。路線名: 仙石線。鉄道区分: 普通鉄道JR（11）。事業者種別: JR在来線（2）。

勾当台公園
type: Concept
alternative label: 勾当台公園（仙台市 南北線）
broader: g001169
in scheme: scheme
notation: 001169
scope note: 運営会社: 仙台市。路線名: 南北線。鉄道区分: 普通鉄道（12）。事業者種別: 公営鉄道（3）。

陸前原ノ町
type: Concept
alternative label: 陸前原ノ町（東日本旅客鉄道 仙石線）
broader: g001170
in scheme: scheme
notation: 001170
scope note: 運営会社: 東日本旅客鉄道。路線名: 仙石線。鉄道区分: 普通鉄道JR（11）。事業者種別: JR在来線（2）。

北山形
type: Concept
alternative label: 北山形（東日本旅客鉄道 奥羽線）
broader: g001171
in scheme: scheme
notation: 001171
scope note: 運営会社: 東日本旅客鉄道。路線名: 奥羽線。鉄道区分: 普通鉄道JR（11）。事業者種別: JR在来線（2）。

北山形
type: Concept
alternative label: 北山形（東日本旅客鉄道 左沢線）
broader: g001171
in scheme: scheme
notation: 001172
scope note: 運営会社: 東日本旅客鉄道。路線名: 左沢線。鉄道区分: 普通鉄道JR（11）。事業者種別: JR在来線（2）。

広瀬通
type: Concept
alternative label: 広瀬通（仙台市 南北線）
broader: g001173
in scheme: scheme
notation: 001173
scope note: 運営会社: 仙台市。路線名: 南北線。鉄道区分: 普通鉄道（12）。事業者種別: 公営鉄道（3）。

川内
type: Concept
alternative label: 川内（仙台市 東西線）
broader: g001174
in scheme: scheme
notation: 001174
scope note: 運営会社: 仙台市。路線名: 東西線。鉄道区分: 普通鉄道（12）。事業者種別: 公営鉄道（3）。

あおば通
type: Concept
alternative label: あおば通（東日本旅客鉄道 仙石線）
broader: g001175
in scheme: scheme
notation: 001175
scope note: 運営会社: 東日本旅客鉄道。路線名: 仙石線。鉄道区分: 普通鉄道JR（11）。事業者種別: JR在来線（2）。

宮城野原
type: Concept
alternative label: 宮城野原（東日本旅客鉄道 仙石線）
broader: g001176
in scheme: scheme
notation: 001176
scope note: 運営会社: 東日本旅客鉄道。路線名: 仙石線。鉄道区分: 普通鉄道JR（11）。事業者種別: JR在来線（2）。

仙台
type: Concept
alternative label: 仙台（東日本旅客鉄道 東北新幹線）
broader: g001177
in scheme: scheme
notation: 001177
scope note: 運営会社: 東日本旅客鉄道。路線名: 東北新幹線。鉄道区分: 普通鉄道JR（11）。事業者種別: JRの新幹線（1）。

国際センター
type: Concept
alternative label: 国際センター（仙台市 東西線）
broader: g001178
in scheme: scheme
notation: 001178
scope note: 運営会社: 仙台市。路線名: 東西線。鉄道区分: 普通鉄道（12）。事業者種別: 公営鉄道（3）。

仙台
type: Concept
alternative label: 仙台（東日本旅客鉄道 仙石線）
broader: g001177
in scheme: scheme
notation: 001179
scope note: 運営会社: 東日本旅客鉄道。路線名: 仙石線。鉄道区分: 普通鉄道JR（11）。事業者種別: JR在来線（2）。

仙台
type: Concept
alternative label: 仙台（仙台市 東西線）
broader: g001177
in scheme: scheme
notation: 001180
scope note: 運営会社: 仙台市。路線名: 東西線。鉄道区分: 普通鉄道（12）。事業者種別: 公営鉄道（3）。

仙台
type: Concept
alternative label: 仙台（東日本旅客鉄道 仙山線）
broader: g001177
in scheme: scheme
notation: 001181
scope note: 運営会社: 東日本旅客鉄道。路線名: 仙山線。鉄道区分: 普通鉄道JR（11）。事業者種別: JR在来線（2）。

仙台
type: Concept
alternative label: 仙台（東日本旅客鉄道 東北線）
broader: g001177
in scheme: scheme
notation: 001182
scope note: 運営会社: 東日本旅客鉄道。路線名: 東北線。鉄道区分: 普通鉄道JR（11）。事業者種別: JR在来線（2）。

仙台
type: Concept
alternative label: 仙台（仙台市 南北線）
broader: g001177
in scheme: scheme
notation: 001183
scope note: 運営会社: 仙台市。路線名: 南北線。鉄道区分: 普通鉄道（12）。事業者種別: 公営鉄道（3）。

青葉通一番町
type: Concept
alternative label: 青葉通一番町（仙台市 東西線）
broader: g001184
in scheme: scheme
notation: 001184
scope note: 運営会社: 仙台市。路線名: 東西線。鉄道区分: 普通鉄道（12）。事業者種別: 公営鉄道（3）。

大町西公園
type: Concept
alternative label: 大町西公園（仙台市 東西線）
broader: g001185
in scheme: scheme
notation: 001185
scope note: 運営会社: 仙台市。路線名: 東西線。鉄道区分: 普通鉄道（12）。事業者種別: 公営鉄道（3）。

榴ヶ岡
type: Concept
alternative label: 榴ヶ岡（東日本旅客鉄道 仙石線）
broader: g001186
in scheme: scheme
notation: 001186
scope note: 運営会社: 東日本旅客鉄道。路線名: 仙石線。鉄道区分: 普通鉄道JR（11）。事業者種別: JR在来線（2）。

宮城野通
type: Concept
alternative label: 宮城野通（仙台市 東西線）
broader: g001187
in scheme: scheme
notation: 001187
scope note: 運営会社: 仙台市。路線名: 東西線。鉄道区分: 普通鉄道（12）。事業者種別: 公営鉄道（3）。

青葉山
type: Concept
alternative label: 青葉山（仙台市 東西線）
broader: g001188
in scheme: scheme
notation: 001188
scope note: 運営会社: 仙台市。路線名: 東西線。鉄道区分: 普通鉄道（12）。事業者種別: 公営鉄道（3）。

五橋
type: Concept
alternative label: 五橋（仙台市 南北線）
broader: g001189
in scheme: scheme
notation: 001189
scope note: 運営会社: 仙台市。路線名: 南北線。鉄道区分: 普通鉄道（12）。事業者種別: 公営鉄道（3）。

卸町
type: Concept
alternative label: 卸町（仙台市 東西線）
broader: g001190
in scheme: scheme
notation: 001190
scope note: 運営会社: 仙台市。路線名: 東西線。鉄道区分: 普通鉄道（12）。事業者種別: 公営鉄道（3）。

連坊
type: Concept
alternative label: 連坊（仙台市 東西線）
broader: g001191
in scheme: scheme
notation: 001191
scope note: 運営会社: 仙台市。路線名: 東西線。鉄道区分: 普通鉄道（12）。事業者種別: 公営鉄道（3）。

六丁の目
type: Concept
alternative label: 六丁の目（仙台市 東西線）
broader: g001192
in scheme: scheme
notation: 001192
scope note: 運営会社: 仙台市。路線名: 東西線。鉄道区分: 普通鉄道（12）。事業者種別: 公営鉄道（3）。

薬師堂
type: Concept
alternative label: 薬師堂（仙台市 東西線）
broader: g001193
in scheme: scheme
notation: 001193
scope note: 運営会社: 仙台市。路線名: 東西線。鉄道区分: 普通鉄道（12）。事業者種別: 公営鉄道（3）。

山形
type: Concept
alternative label: 山形（東日本旅客鉄道 奥羽線）
broader: g001194
in scheme: scheme
notation: 001194
scope note: 運営会社: 東日本旅客鉄道。路線名: 奥羽線。鉄道区分: 普通鉄道JR（11）。事業者種別: JR在来線（2）。

愛宕橋
type: Concept
alternative label: 愛宕橋（仙台市 南北線）
broader: g001195
in scheme: scheme
notation: 001195
scope note: 運営会社: 仙台市。路線名: 南北線。鉄道区分: 普通鉄道（12）。事業者種別: 公営鉄道（3）。

荒井
type: Concept
alternative label: 荒井（仙台市 東西線）
broader: g001196
in scheme: scheme
notation: 001196
scope note: 運営会社: 仙台市。路線名: 東西線。鉄道区分: 普通鉄道（12）。事業者種別: 公営鉄道（3）。

八木山動物公園
type: Concept
alternative label: 八木山動物公園（仙台市 東西線）
broader: g001197
in scheme: scheme
notation: 001197
scope note: 運営会社: 仙台市。路線名: 東西線。鉄道区分: 普通鉄道（12）。事業者種別: 公営鉄道（3）。

河原町
type: Concept
alternative label: 河原町（仙台市 南北線）
broader: g001198
in scheme: scheme
notation: 001198
scope note: 運営会社: 仙台市。路線名: 南北線。鉄道区分: 普通鉄道（12）。事業者種別: 公営鉄道（3）。

長町一丁目
type: Concept
alternative label: 長町一丁目（仙台市 南北線）
broader: g001199
in scheme: scheme
notation: 001199
scope note: 運営会社: 仙台市。路線名: 南北線。鉄道区分: 普通鉄道（12）。事業者種別: 公営鉄道（3）。

長町
type: Concept
alternative label: 長町（仙台市 南北線）
broader: g001200
in scheme: scheme
notation: 001200
scope note: 運営会社: 仙台市。路線名: 南北線。鉄道区分: 普通鉄道（12）。事業者種別: 公営鉄道（3）。

長町
type: Concept
alternative label: 長町（東日本旅客鉄道 東北線）
broader: g001200
in scheme: scheme
notation: 001201
scope note: 運営会社: 東日本旅客鉄道。路線名: 東北線。鉄道区分: 普通鉄道JR（11）。事業者種別: JR在来線（2）。

長町南
type: Concept
alternative label: 長町南（仙台市 南北線）
broader: g001202
in scheme: scheme
notation: 001202
scope note: 運営会社: 仙台市。路線名: 南北線。鉄道区分: 普通鉄道（12）。事業者種別: 公営鉄道（3）。

村上
type: Concept
alternative label: 村上（東日本旅客鉄道 羽越線）
broader: g001203
in scheme: scheme
notation: 001203
scope note: 運営会社: 東日本旅客鉄道。路線名: 羽越線。鉄道区分: 普通鉄道JR（11）。事業者種別: JR在来線（2）。

太子堂
type: Concept
alternative label: 太子堂（東日本旅客鉄道 東北線）
broader: g001204
in scheme: scheme
notation: 001204
scope note: 運営会社: 東日本旅客鉄道。路線名: 東北線。鉄道区分: 普通鉄道JR（11）。事業者種別: JR在来線（2）。

富沢
type: Concept
alternative label: 富沢（仙台市 南北線）
broader: g001205
in scheme: scheme
notation: 001205
scope note: 運営会社: 仙台市。路線名: 南北線。鉄道区分: 普通鉄道（12）。事業者種別: 公営鉄道（3）。

蔵王
type: Concept
alternative label: 蔵王（東日本旅客鉄道 奥羽線）
broader: g001206
in scheme: scheme
notation: 001206
scope note: 運営会社: 東日本旅客鉄道。路線名: 奥羽線。鉄道区分: 普通鉄道JR（11）。事業者種別: JR在来線（2）。

南仙台
type: Concept
alternative label: 南仙台（東日本旅客鉄道 東北線）
broader: g001207
in scheme: scheme
notation: 001207
scope note: 運営会社: 東日本旅客鉄道。路線名: 東北線。鉄道区分: 普通鉄道JR（11）。事業者種別: JR在来線（2）。

荒砥
type: Concept
alternative label: 荒砥（山形鉄道 フラワー長井線）
broader: g001208
in scheme: scheme
notation: 001208
scope note: 運営会社: 山形鉄道。路線名: フラワー長井線。鉄道区分: 普通鉄道（12）。事業者種別: 第三セクター（5）。

四季の郷
type: Concept
alternative label: 四季の郷（山形鉄道 フラワー長井線）
broader: g001209
in scheme: scheme
notation: 001209
scope note: 運営会社: 山形鉄道。路線名: フラワー長井線。鉄道区分: 普通鉄道（12）。事業者種別: 第三セクター（5）。

岩船町
type: Concept
alternative label: 岩船町（東日本旅客鉄道 羽越線）
broader: g001210
in scheme: scheme
notation: 001210
scope note: 運営会社: 東日本旅客鉄道。路線名: 羽越線。鉄道区分: 普通鉄道JR（11）。事業者種別: JR在来線（2）。

鮎貝
type: Concept
alternative label: 鮎貝（山形鉄道 フラワー長井線）
broader: g001211
in scheme: scheme
notation: 001211
scope note: 運営会社: 山形鉄道。路線名: フラワー長井線。鉄道区分: 普通鉄道（12）。事業者種別: 第三セクター（5）。

名取
type: Concept
alternative label: 名取（東日本旅客鉄道 東北線）
broader: g001212
in scheme: scheme
notation: 001212
scope note: 運営会社: 東日本旅客鉄道。路線名: 東北線。鉄道区分: 普通鉄道JR（11）。事業者種別: JR在来線（2）。

名取
type: Concept
alternative label: 名取（仙台空港鉄道 仙台空港線）
broader: g001212
in scheme: scheme
notation: 001213
scope note: 運営会社: 仙台空港鉄道。路線名: 仙台空港線。鉄道区分: 普通鉄道（12）。事業者種別: 第三セクター（5）。

茂吉記念館前
type: Concept
alternative label: 茂吉記念館前（東日本旅客鉄道 奥羽線）
broader: g001214
in scheme: scheme
notation: 001214
scope note: 運営会社: 東日本旅客鉄道。路線名: 奥羽線。鉄道区分: 普通鉄道JR（11）。事業者種別: JR在来線（2）。

杜せきのした
type: Concept
alternative label: 杜せきのした（仙台空港鉄道 仙台空港線）
broader: g001215
in scheme: scheme
notation: 001215
scope note: 運営会社: 仙台空港鉄道。路線名: 仙台空港線。鉄道区分: 普通鉄道（12）。事業者種別: 第三セクター（5）。

蚕桑
type: Concept
alternative label: 蚕桑（山形鉄道 フラワー長井線）
broader: g001216
in scheme: scheme
notation: 001216
scope note: 運営会社: 山形鉄道。路線名: フラワー長井線。鉄道区分: 普通鉄道（12）。事業者種別: 第三セクター（5）。

美田園
type: Concept
alternative label: 美田園（仙台空港鉄道 仙台空港線）
broader: g001217
in scheme: scheme
notation: 001217
scope note: 運営会社: 仙台空港鉄道。路線名: 仙台空港線。鉄道区分: 普通鉄道（12）。事業者種別: 第三セクター（5）。

かみのやま温泉
type: Concept
alternative label: かみのやま温泉（東日本旅客鉄道 奥羽線）
broader: g001218
in scheme: scheme
notation: 001218
scope note: 運営会社: 東日本旅客鉄道。路線名: 奥羽線。鉄道区分: 普通鉄道JR（11）。事業者種別: JR在来線（2）。

平林
type: Concept
alternative label: 平林（東日本旅客鉄道 羽越線）
broader: g001219
in scheme: scheme
notation: 001219
scope note: 運営会社: 東日本旅客鉄道。路線名: 羽越線。鉄道区分: 普通鉄道JR（11）。事業者種別: JR在来線（2）。

白兎
type: Concept
alternative label: 白兎（山形鉄道 フラワー長井線）
broader: g001220
in scheme: scheme
notation: 001220
scope note: 運営会社: 山形鉄道。路線名: フラワー長井線。鉄道区分: 普通鉄道（12）。事業者種別: 第三セクター（5）。

館腰
type: Concept
alternative label: 館腰（東日本旅客鉄道 東北線）
broader: g001221
in scheme: scheme
notation: 001221
scope note: 運営会社: 東日本旅客鉄道。路線名: 東北線。鉄道区分: 普通鉄道JR（11）。事業者種別: JR在来線（2）。

仙台空港
type: Concept
alternative label: 仙台空港（仙台空港鉄道 仙台空港線）
broader: g001222
in scheme: scheme
notation: 001222
scope note: 運営会社: 仙台空港鉄道。路線名: 仙台空港線。鉄道区分: 普通鉄道（12）。事業者種別: 第三セクター（5）。

羽前成田
type: Concept
alternative label: 羽前成田（山形鉄道 フラワー長井線）
broader: g001223
in scheme: scheme
notation: 001223
scope note: 運営会社: 山形鉄道。路線名: フラワー長井線。鉄道区分: 普通鉄道（12）。事業者種別: 第三セクター（5）。

羽前中山
type: Concept
alternative label: 羽前中山（東日本旅客鉄道 奥羽線）
broader: g001224
in scheme: scheme
notation: 001224
scope note: 運営会社: 東日本旅客鉄道。路線名: 奥羽線。鉄道区分: 普通鉄道JR（11）。事業者種別: JR在来線（2）。

坂町
type: Concept
alternative label: 坂町（東日本旅客鉄道 羽越線）
broader: g001225
in scheme: scheme
notation: 001225
scope note: 運営会社: 東日本旅客鉄道。路線名: 羽越線。鉄道区分: 普通鉄道JR（11）。事業者種別: JR在来線（2）。

坂町
type: Concept
alternative label: 坂町（東日本旅客鉄道 米坂線）
broader: g001225
in scheme: scheme
notation: 001226
scope note: 運営会社: 東日本旅客鉄道。路線名: 米坂線。鉄道区分: 普通鉄道JR（11）。事業者種別: JR在来線（2）。

あやめ公園
type: Concept
alternative label: あやめ公園（山形鉄道 フラワー長井線）
broader: g001227
in scheme: scheme
notation: 001227
scope note: 運営会社: 山形鉄道。路線名: フラワー長井線。鉄道区分: 普通鉄道（12）。事業者種別: 第三セクター（5）。

岩沼
type: Concept
alternative label: 岩沼（東日本旅客鉄道 常磐線）
broader: g001228
in scheme: scheme
notation: 001228
scope note: 運営会社: 東日本旅客鉄道。路線名: 常磐線。鉄道区分: 普通鉄道JR（11）。事業者種別: JR在来線（2）。

岩沼
type: Concept
alternative label: 岩沼（東日本旅客鉄道 東北線）
broader: g001228
in scheme: scheme
notation: 001229
scope note: 運営会社: 東日本旅客鉄道。路線名: 東北線。鉄道区分: 普通鉄道JR（11）。事業者種別: JR在来線（2）。

長井
type: Concept
alternative label: 長井（山形鉄道 フラワー長井線）
broader: g001230
in scheme: scheme
notation: 001230
scope note: 運営会社: 山形鉄道。路線名: フラワー長井線。鉄道区分: 普通鉄道（12）。事業者種別: 第三セクター（5）。

越後大島
type: Concept
alternative label: 越後大島（東日本旅客鉄道 米坂線）
broader: g001231
in scheme: scheme
notation: 001231
scope note: 運営会社: 東日本旅客鉄道。路線名: 米坂線。鉄道区分: 普通鉄道JR（11）。事業者種別: JR在来線（2）。

南長井
type: Concept
alternative label: 南長井（山形鉄道 フラワー長井線）
broader: g001232
in scheme: scheme
notation: 001232
scope note: 運営会社: 山形鉄道。路線名: フラワー長井線。鉄道区分: 普通鉄道（12）。事業者種別: 第三セクター（5）。

平木田
type: Concept
alternative label: 平木田（東日本旅客鉄道 羽越線）
broader: g001233
in scheme: scheme
notation: 001233
scope note: 運営会社: 東日本旅客鉄道。路線名: 羽越線。鉄道区分: 普通鉄道JR（11）。事業者種別: JR在来線（2）。

中川
type: Concept
alternative label: 中川（東日本旅客鉄道 奥羽線）
broader: g001234
in scheme: scheme
notation: 001234
scope note: 運営会社: 東日本旅客鉄道。路線名: 奥羽線。鉄道区分: 普通鉄道JR（11）。事業者種別: JR在来線（2）。

越後下関
type: Concept
alternative label: 越後下関（東日本旅客鉄道 米坂線）
broader: g001235
in scheme: scheme
notation: 001235
scope note: 運営会社: 東日本旅客鉄道。路線名: 米坂線。鉄道区分: 普通鉄道JR（11）。事業者種別: JR在来線（2）。

槻木
type: Concept
alternative label: 槻木（東日本旅客鉄道 東北線）
broader: g001236
in scheme: scheme
notation: 001236
scope note: 運営会社: 東日本旅客鉄道。路線名: 東北線。鉄道区分: 普通鉄道JR（11）。事業者種別: JR在来線（2）。

槻木
type: Concept
alternative label: 槻木（阿武隈急行 阿武隈急行線）
broader: g001236
in scheme: scheme
notation: 001237
scope note: 運営会社: 阿武隈急行。路線名: 阿武隈急行線。鉄道区分: 普通鉄道（12）。事業者種別: 第三セクター（5）。

時庭
type: Concept
alternative label: 時庭（山形鉄道 フラワー長井線）
broader: g001238
in scheme: scheme
notation: 001238
scope note: 運営会社: 山形鉄道。路線名: フラワー長井線。鉄道区分: 普通鉄道（12）。事業者種別: 第三セクター（5）。

宮内
type: Concept
alternative label: 宮内（山形鉄道 フラワー長井線）
broader: g001239
in scheme: scheme
notation: 001239
scope note: 運営会社: 山形鉄道。路線名: フラワー長井線。鉄道区分: 普通鉄道（12）。事業者種別: 第三セクター（5）。

越後片貝
type: Concept
alternative label: 越後片貝（東日本旅客鉄道 米坂線）
broader: g001240
in scheme: scheme
notation: 001240
scope note: 運営会社: 東日本旅客鉄道。路線名: 米坂線。鉄道区分: 普通鉄道JR（11）。事業者種別: JR在来線（2）。

逢隈
type: Concept
alternative label: 逢隈（東日本旅客鉄道 常磐線）
broader: g001241
in scheme: scheme
notation: 001241
scope note: 運営会社: 東日本旅客鉄道。路線名: 常磐線。鉄道区分: 普通鉄道JR（11）。事業者種別: JR在来線（2）。

越後金丸
type: Concept
alternative label: 越後金丸（東日本旅客鉄道 米坂線）
broader: g001242
in scheme: scheme
notation: 001242
scope note: 運営会社: 東日本旅客鉄道。路線名: 米坂線。鉄道区分: 普通鉄道JR（11）。事業者種別: JR在来線（2）。

おりはた
type: Concept
alternative label: おりはた（山形鉄道 フラワー長井線）
broader: g001243
in scheme: scheme
notation: 001243
scope note: 運営会社: 山形鉄道。路線名: フラワー長井線。鉄道区分: 普通鉄道（12）。事業者種別: 第三セクター（5）。

萩生
type: Concept
alternative label: 萩生（東日本旅客鉄道 米坂線）
broader: g001244
in scheme: scheme
notation: 001244
scope note: 運営会社: 東日本旅客鉄道。路線名: 米坂線。鉄道区分: 普通鉄道JR（11）。事業者種別: JR在来線（2）。

小国
type: Concept
alternative label: 小国（東日本旅客鉄道 米坂線）
broader: g001245
in scheme: scheme
notation: 001245
scope note: 運営会社: 東日本旅客鉄道。路線名: 米坂線。鉄道区分: 普通鉄道JR（11）。事業者種別: JR在来線（2）。

船岡
type: Concept
alternative label: 船岡（東日本旅客鉄道 東北線）
broader: g001246
in scheme: scheme
notation: 001246
scope note: 運営会社: 東日本旅客鉄道。路線名: 東北線。鉄道区分: 普通鉄道JR（11）。事業者種別: JR在来線（2）。

梨郷
type: Concept
alternative label: 梨郷（山形鉄道 フラワー長井線）
broader: g001247
in scheme: scheme
notation: 001247
scope note: 運営会社: 山形鉄道。路線名: フラワー長井線。鉄道区分: 普通鉄道（12）。事業者種別: 第三セクター（5）。

今泉
type: Concept
alternative label: 今泉（東日本旅客鉄道 米坂線）
broader: g001248
in scheme: scheme
notation: 001248
scope note: 運営会社: 東日本旅客鉄道。路線名: 米坂線。鉄道区分: 普通鉄道JR（11）。事業者種別: JR在来線（2）。

今泉
type: Concept
alternative label: 今泉（山形鉄道 フラワー長井線）
broader: g001248
in scheme: scheme
notation: 001249
scope note: 運営会社: 山形鉄道。路線名: フラワー長井線。鉄道区分: 普通鉄道（12）。事業者種別: 第三セクター（5）。

南陽市役所
type: Concept
alternative label: 南陽市役所（山形鉄道 フラワー長井線）
broader: g001250
in scheme: scheme
notation: 001250
scope note: 運営会社: 山形鉄道。路線名: フラワー長井線。鉄道区分: 普通鉄道（12）。事業者種別: 第三セクター（5）。

西大塚
type: Concept
alternative label: 西大塚（山形鉄道 フラワー長井線）
broader: g001251
in scheme: scheme
notation: 001251
scope note: 運営会社: 山形鉄道。路線名: フラワー長井線。鉄道区分: 普通鉄道（12）。事業者種別: 第三セクター（5）。

伊佐領
type: Concept
alternative label: 伊佐領（東日本旅客鉄道 米坂線）
broader: g001252
in scheme: scheme
notation: 001252
scope note: 運営会社: 東日本旅客鉄道。路線名: 米坂線。鉄道区分: 普通鉄道JR（11）。事業者種別: JR在来線（2）。

東船岡
type: Concept
alternative label: 東船岡（阿武隈急行 阿武隈急行線）
broader: g001253
in scheme: scheme
notation: 001253
scope note: 運営会社: 阿武隈急行。路線名: 阿武隈急行線。鉄道区分: 普通鉄道（12）。事業者種別: 第三セクター（5）。

中条
type: Concept
alternative label: 中条（東日本旅客鉄道 羽越線）
broader: g001254
in scheme: scheme
notation: 001254
scope note: 運営会社: 東日本旅客鉄道。路線名: 羽越線。鉄道区分: 普通鉄道JR（11）。事業者種別: JR在来線（2）。

大河原
type: Concept
alternative label: 大河原（東日本旅客鉄道 東北線）
broader: g001255
in scheme: scheme
notation: 001255
scope note: 運営会社: 東日本旅客鉄道。路線名: 東北線。鉄道区分: 普通鉄道JR（11）。事業者種別: JR在来線（2）。

赤湯
type: Concept
alternative label: 赤湯（東日本旅客鉄道 奥羽線）
broader: g001256
in scheme: scheme
notation: 001256
scope note: 運営会社: 東日本旅客鉄道。路線名: 奥羽線。鉄道区分: 普通鉄道JR（11）。事業者種別: JR在来線（2）。

赤湯
type: Concept
alternative label: 赤湯（山形鉄道 フラワー長井線）
broader: g001256
in scheme: scheme
notation: 001257
scope note: 運営会社: 山形鉄道。路線名: フラワー長井線。鉄道区分: 普通鉄道（12）。事業者種別: 第三セクター（5）。

羽前松岡
type: Concept
alternative label: 羽前松岡（東日本旅客鉄道 米坂線）
broader: g001258
in scheme: scheme
notation: 001258
scope note: 運営会社: 東日本旅客鉄道。路線名: 米坂線。鉄道区分: 普通鉄道JR（11）。事業者種別: JR在来線（2）。

亘理
type: Concept
alternative label: 亘理（東日本旅客鉄道 常磐線）
broader: g001259
in scheme: scheme
notation: 001259
scope note: 運営会社: 東日本旅客鉄道。路線名: 常磐線。鉄道区分: 普通鉄道JR（11）。事業者種別: JR在来線（2）。

羽前椿
type: Concept
alternative label: 羽前椿（東日本旅客鉄道 米坂線）
broader: g001260
in scheme: scheme
notation: 001260
scope note: 運営会社: 東日本旅客鉄道。路線名: 米坂線。鉄道区分: 普通鉄道JR（11）。事業者種別: JR在来線（2）。

東白石
type: Concept
alternative label: 東白石（東日本旅客鉄道 東北線）
broader: g001261
in scheme: scheme
notation: 001261
scope note: 運営会社: 東日本旅客鉄道。路線名: 東北線。鉄道区分: 普通鉄道JR（11）。事業者種別: JR在来線（2）。

北白川
type: Concept
alternative label: 北白川（東日本旅客鉄道 東北線）
broader: g001262
in scheme: scheme
notation: 001262
scope note: 運営会社: 東日本旅客鉄道。路線名: 東北線。鉄道区分: 普通鉄道JR（11）。事業者種別: JR在来線（2）。

羽前沼沢
type: Concept
alternative label: 羽前沼沢（東日本旅客鉄道 米坂線）
broader: g001263
in scheme: scheme
notation: 001263
scope note: 運営会社: 東日本旅客鉄道。路線名: 米坂線。鉄道区分: 普通鉄道JR（11）。事業者種別: JR在来線（2）。

犬川
type: Concept
alternative label: 犬川（東日本旅客鉄道 米坂線）
broader: g001264
in scheme: scheme
notation: 001264
scope note: 運営会社: 東日本旅客鉄道。路線名: 米坂線。鉄道区分: 普通鉄道JR（11）。事業者種別: JR在来線（2）。

金塚
type: Concept
alternative label: 金塚（東日本旅客鉄道 羽越線）
broader: g001265
in scheme: scheme
notation: 001265
scope note: 運営会社: 東日本旅客鉄道。路線名: 羽越線。鉄道区分: 普通鉄道JR（11）。事業者種別: JR在来線（2）。

岡
type: Concept
alternative label: 岡（阿武隈急行 阿武隈急行線）
broader: g001266
in scheme: scheme
notation: 001266
scope note: 運営会社: 阿武隈急行。路線名: 阿武隈急行線。鉄道区分: 普通鉄道（12）。事業者種別: 第三セクター（5）。

手ノ子
type: Concept
alternative label: 手ノ子（東日本旅客鉄道 米坂線）
broader: g001267
in scheme: scheme
notation: 001267
scope note: 運営会社: 東日本旅客鉄道。路線名: 米坂線。鉄道区分: 普通鉄道JR（11）。事業者種別: JR在来線（2）。

羽前小松
type: Concept
alternative label: 羽前小松（東日本旅客鉄道 米坂線）
broader: g001268
in scheme: scheme
notation: 001268
scope note: 運営会社: 東日本旅客鉄道。路線名: 米坂線。鉄道区分: 普通鉄道JR（11）。事業者種別: JR在来線（2）。

白石
type: Concept
alternative label: 白石（東日本旅客鉄道 東北線）
broader: g001269
in scheme: scheme
notation: 001269
scope note: 運営会社: 東日本旅客鉄道。路線名: 東北線。鉄道区分: 普通鉄道JR（11）。事業者種別: JR在来線（2）。

浜吉田
type: Concept
alternative label: 浜吉田（東日本旅客鉄道 常磐線）
broader: g001270
in scheme: scheme
notation: 001270
scope note: 運営会社: 東日本旅客鉄道。路線名: 常磐線。鉄道区分: 普通鉄道JR（11）。事業者種別: JR在来線（2）。

横倉
type: Concept
alternative label: 横倉（阿武隈急行 阿武隈急行線）
broader: g001271
in scheme: scheme
notation: 001271
scope note: 運営会社: 阿武隈急行。路線名: 阿武隈急行線。鉄道区分: 普通鉄道（12）。事業者種別: 第三セクター（5）。

白石蔵王
type: Concept
alternative label: 白石蔵王（東日本旅客鉄道 東北新幹線）
broader: g001272
in scheme: scheme
notation: 001272
scope note: 運営会社: 東日本旅客鉄道。路線名: 東北新幹線。鉄道区分: 普通鉄道JR（11）。事業者種別: JRの新幹線（1）。

高畠
type: Concept
alternative label: 高畠（東日本旅客鉄道 奥羽線）
broader: g001273
in scheme: scheme
notation: 001273
scope note: 運営会社: 東日本旅客鉄道。路線名: 奥羽線。鉄道区分: 普通鉄道JR（11）。事業者種別: JR在来線（2）。

角田
type: Concept
alternative label: 角田（阿武隈急行 阿武隈急行線）
broader: g001274
in scheme: scheme
notation: 001274
scope note: 運営会社: 阿武隈急行。路線名: 阿武隈急行線。鉄道区分: 普通鉄道（12）。事業者種別: 第三セクター（5）。

加治
type: Concept
alternative label: 加治（東日本旅客鉄道 羽越線）
broader: g001275
in scheme: scheme
notation: 001275
scope note: 運営会社: 東日本旅客鉄道。路線名: 羽越線。鉄道区分: 普通鉄道JR（11）。事業者種別: JR在来線（2）。

中郡
type: Concept
alternative label: 中郡（東日本旅客鉄道 米坂線）
broader: g001276
in scheme: scheme
notation: 001276
scope note: 運営会社: 東日本旅客鉄道。路線名: 米坂線。鉄道区分: 普通鉄道JR（11）。事業者種別: JR在来線（2）。

山下
type: Concept
alternative label: 山下（東日本旅客鉄道 常磐線）
broader: g001277
in scheme: scheme
notation: 001277
scope note: 運営会社: 東日本旅客鉄道。路線名: 常磐線。鉄道区分: 普通鉄道JR（11）。事業者種別: JR在来線（2）。

南角田
type: Concept
alternative label: 南角田（阿武隈急行 阿武隈急行線）
broader: g001278
in scheme: scheme
notation: 001278
scope note: 運営会社: 阿武隈急行。路線名: 阿武隈急行線。鉄道区分: 普通鉄道（12）。事業者種別: 第三セクター（5）。

置賜
type: Concept
alternative label: 置賜（東日本旅客鉄道 奥羽線）
broader: g001279
in scheme: scheme
notation: 001279
scope note: 運営会社: 東日本旅客鉄道。路線名: 奥羽線。鉄道区分: 普通鉄道JR（11）。事業者種別: JR在来線（2）。

佐々木
type: Concept
alternative label: 佐々木（東日本旅客鉄道 白新線）
broader: g001280
in scheme: scheme
notation: 001280
scope note: 運営会社: 東日本旅客鉄道。路線名: 白新線。鉄道区分: 普通鉄道JR（11）。事業者種別: JR在来線（2）。

新発田
type: Concept
alternative label: 新発田（東日本旅客鉄道 羽越線）
broader: g001281
in scheme: scheme
notation: 001281
scope note: 運営会社: 東日本旅客鉄道。路線名: 羽越線。鉄道区分: 普通鉄道JR（11）。事業者種別: JR在来線（2）。

新発田
type: Concept
alternative label: 新発田（東日本旅客鉄道 白新線）
broader: g001281
in scheme: scheme
notation: 001282
scope note: 運営会社: 東日本旅客鉄道。路線名: 白新線。鉄道区分: 普通鉄道JR（11）。事業者種別: JR在来線（2）。

成島
type: Concept
alternative label: 成島（東日本旅客鉄道 米坂線）
broader: g001283
in scheme: scheme
notation: 001283
scope note: 運営会社: 東日本旅客鉄道。路線名: 米坂線。鉄道区分: 普通鉄道JR（11）。事業者種別: JR在来線（2）。

北丸森
type: Concept
alternative label: 北丸森（阿武隈急行 阿武隈急行線）
broader: g001284
in scheme: scheme
notation: 001284
scope note: 運営会社: 阿武隈急行。路線名: 阿武隈急行線。鉄道区分: 普通鉄道（12）。事業者種別: 第三セクター（5）。

西新発田
type: Concept
alternative label: 西新発田（東日本旅客鉄道 白新線）
broader: g001285
in scheme: scheme
notation: 001285
scope note: 運営会社: 東日本旅客鉄道。路線名: 白新線。鉄道区分: 普通鉄道JR（11）。事業者種別: JR在来線（2）。

黒山
type: Concept
alternative label: 黒山（東日本旅客鉄道 白新線）
broader: g001286
in scheme: scheme
notation: 001286
scope note: 運営会社: 東日本旅客鉄道。路線名: 白新線。鉄道区分: 普通鉄道JR（11）。事業者種別: JR在来線（2）。

越河
type: Concept
alternative label: 越河（東日本旅客鉄道 東北線）
broader: g001287
in scheme: scheme
notation: 001287
scope note: 運営会社: 東日本旅客鉄道。路線名: 東北線。鉄道区分: 普通鉄道JR（11）。事業者種別: JR在来線（2）。

丸森
type: Concept
alternative label: 丸森（阿武隈急行 阿武隈急行線）
broader: g001288
in scheme: scheme
notation: 001288
scope note: 運営会社: 阿武隈急行。路線名: 阿武隈急行線。鉄道区分: 普通鉄道（12）。事業者種別: 第三セクター（5）。

坂元
type: Concept
alternative label: 坂元（東日本旅客鉄道 常磐線）
broader: g001289
in scheme: scheme
notation: 001289
scope note: 運営会社: 東日本旅客鉄道。路線名: 常磐線。鉄道区分: 普通鉄道JR（11）。事業者種別: JR在来線（2）。

新崎
type: Concept
alternative label: 新崎（東日本旅客鉄道 白新線）
broader: g001290
in scheme: scheme
notation: 001290
scope note: 運営会社: 東日本旅客鉄道。路線名: 白新線。鉄道区分: 普通鉄道JR（11）。事業者種別: JR在来線（2）。

早通
type: Concept
alternative label: 早通（東日本旅客鉄道 白新線）
broader: g001291
in scheme: scheme
notation: 001291
scope note: 運営会社: 東日本旅客鉄道。路線名: 白新線。鉄道区分: 普通鉄道JR（11）。事業者種別: JR在来線（2）。

豊栄
type: Concept
alternative label: 豊栄（東日本旅客鉄道 白新線）
broader: g001292
in scheme: scheme
notation: 001292
scope note: 運営会社: 東日本旅客鉄道。路線名: 白新線。鉄道区分: 普通鉄道JR（11）。事業者種別: JR在来線（2）。

西米沢
type: Concept
alternative label: 西米沢（東日本旅客鉄道 米坂線）
broader: g001293
in scheme: scheme
notation: 001293
scope note: 運営会社: 東日本旅客鉄道。路線名: 米坂線。鉄道区分: 普通鉄道JR（11）。事業者種別: JR在来線（2）。

大形
type: Concept
alternative label: 大形（東日本旅客鉄道 白新線）
broader: g001294
in scheme: scheme
notation: 001294
scope note: 運営会社: 東日本旅客鉄道。路線名: 白新線。鉄道区分: 普通鉄道JR（11）。事業者種別: JR在来線（2）。

あぶくま
type: Concept
alternative label: あぶくま（阿武隈急行 阿武隈急行線）
broader: g001295
in scheme: scheme
notation: 001295
scope note: 運営会社: 阿武隈急行。路線名: 阿武隈急行線。鉄道区分: 普通鉄道（12）。事業者種別: 第三セクター（5）。

新潟
type: Concept
alternative label: 新潟（東日本旅客鉄道 越後線）
broader: g001296
in scheme: scheme
notation: 001296
scope note: 運営会社: 東日本旅客鉄道。路線名: 越後線。鉄道区分: 普通鉄道JR（11）。事業者種別: JR在来線（2）。

新潟
type: Concept
alternative label: 新潟（東日本旅客鉄道 信越線）
broader: g001296
in scheme: scheme
notation: 001297
scope note: 運営会社: 東日本旅客鉄道。路線名: 信越線。鉄道区分: 普通鉄道JR（11）。事業者種別: JR在来線（2）。

新潟
type: Concept
alternative label: 新潟（東日本旅客鉄道 白新線）
broader: g001296
in scheme: scheme
notation: 001298
scope note: 運営会社: 東日本旅客鉄道。路線名: 白新線。鉄道区分: 普通鉄道JR（11）。事業者種別: JR在来線（2）。

中浦
type: Concept
alternative label: 中浦（東日本旅客鉄道 羽越線）
broader: g001299
in scheme: scheme
notation: 001299
scope note: 運営会社: 東日本旅客鉄道。路線名: 羽越線。鉄道区分: 普通鉄道JR（11）。事業者種別: JR在来線（2）。

新潟
type: Concept
alternative label: 新潟（東日本旅客鉄道 上越新幹線）
broader: g001296
in scheme: scheme
notation: 001300
scope note: 運営会社: 東日本旅客鉄道。路線名: 上越新幹線。鉄道区分: 普通鉄道JR（11）。事業者種別: JRの新幹線（1）。

白山
type: Concept
alternative label: 白山（東日本旅客鉄道 越後線）
broader: g001301
in scheme: scheme
notation: 001301
scope note: 運営会社: 東日本旅客鉄道。路線名: 越後線。鉄道区分: 普通鉄道JR（11）。事業者種別: JR在来線（2）。

米沢
type: Concept
alternative label: 米沢（東日本旅客鉄道 奥羽線）
broader: g001302
in scheme: scheme
notation: 001302
scope note: 運営会社: 東日本旅客鉄道。路線名: 奥羽線。鉄道区分: 普通鉄道JR（11）。事業者種別: JR在来線（2）。

米沢
type: Concept
alternative label: 米沢（東日本旅客鉄道 米坂線）
broader: g001302
in scheme: scheme
notation: 001303
scope note: 運営会社: 東日本旅客鉄道。路線名: 米坂線。鉄道区分: 普通鉄道JR（11）。事業者種別: JR在来線（2）。

東新潟
type: Concept
alternative label: 東新潟（東日本旅客鉄道 白新線）
broader: g001304
in scheme: scheme
notation: 001304
scope note: 運営会社: 東日本旅客鉄道。路線名: 白新線。鉄道区分: 普通鉄道JR（11）。事業者種別: JR在来線（2）。

貝田
type: Concept
alternative label: 貝田（東日本旅客鉄道 東北線）
broader: g001305
in scheme: scheme
notation: 001305
scope note: 運営会社: 東日本旅客鉄道。路線名: 東北線。鉄道区分: 普通鉄道JR（11）。事業者種別: JR在来線（2）。

関屋
type: Concept
alternative label: 関屋（東日本旅客鉄道 越後線）
broader: g001306
in scheme: scheme
notation: 001306
scope note: 運営会社: 東日本旅客鉄道。路線名: 越後線。鉄道区分: 普通鉄道JR（11）。事業者種別: JR在来線（2）。

青山
type: Concept
alternative label: 青山（東日本旅客鉄道 越後線）
broader: g001307
in scheme: scheme
notation: 001307
scope note: 運営会社: 東日本旅客鉄道。路線名: 越後線。鉄道区分: 普通鉄道JR（11）。事業者種別: JR在来線（2）。

越後石山
type: Concept
alternative label: 越後石山（東日本旅客鉄道 信越線）
broader: g001308
in scheme: scheme
notation: 001308
scope note: 運営会社: 東日本旅客鉄道。路線名: 信越線。鉄道区分: 普通鉄道JR（11）。事業者種別: JR在来線（2）。

南米沢
type: Concept
alternative label: 南米沢（東日本旅客鉄道 米坂線）
broader: g001309
in scheme: scheme
notation: 001309
scope note: 運営会社: 東日本旅客鉄道。路線名: 米坂線。鉄道区分: 普通鉄道JR（11）。事業者種別: JR在来線（2）。

兜
type: Concept
alternative label: 兜（阿武隈急行 阿武隈急行線）
broader: g001310
in scheme: scheme
notation: 001310
scope note: 運営会社: 阿武隈急行。路線名: 阿武隈急行線。鉄道区分: 普通鉄道（12）。事業者種別: 第三セクター（5）。

小針
type: Concept
alternative label: 小針（東日本旅客鉄道 越後線）
broader: g001311
in scheme: scheme
notation: 001311
scope note: 運営会社: 東日本旅客鉄道。路線名: 越後線。鉄道区分: 普通鉄道JR（11）。事業者種別: JR在来線（2）。

月岡
type: Concept
alternative label: 月岡（東日本旅客鉄道 羽越線）
broader: g001312
in scheme: scheme
notation: 001312
scope note: 運営会社: 東日本旅客鉄道。路線名: 羽越線。鉄道区分: 普通鉄道JR（11）。事業者種別: JR在来線（2）。

新地
type: Concept
alternative label: 新地（東日本旅客鉄道 常磐線）
broader: g001313
in scheme: scheme
notation: 001313
scope note: 運営会社: 東日本旅客鉄道。路線名: 常磐線。鉄道区分: 普通鉄道JR（11）。事業者種別: JR在来線（2）。

寺尾
type: Concept
alternative label: 寺尾（東日本旅客鉄道 越後線）
broader: g001314
in scheme: scheme
notation: 001314
scope note: 運営会社: 東日本旅客鉄道。路線名: 越後線。鉄道区分: 普通鉄道JR（11）。事業者種別: JR在来線（2）。

藤田
type: Concept
alternative label: 藤田（東日本旅客鉄道 東北線）
broader: g001315
in scheme: scheme
notation: 001315
scope note: 運営会社: 東日本旅客鉄道。路線名: 東北線。鉄道区分: 普通鉄道JR（11）。事業者種別: JR在来線（2）。

亀田
type: Concept
alternative label: 亀田（東日本旅客鉄道 信越線）
broader: g001316
in scheme: scheme
notation: 001316
scope note: 運営会社: 東日本旅客鉄道。路線名: 信越線。鉄道区分: 普通鉄道JR（11）。事業者種別: JR在来線（2）。

富野
type: Concept
alternative label: 富野（阿武隈急行 阿武隈急行線）
broader: g001317
in scheme: scheme
notation: 001317
scope note: 運営会社: 阿武隈急行。路線名: 阿武隈急行線。鉄道区分: 普通鉄道（12）。事業者種別: 第三セクター（5）。

新潟大学前
type: Concept
alternative label: 新潟大学前（東日本旅客鉄道 越後線）
broader: g001318
in scheme: scheme
notation: 001318
scope note: 運営会社: 東日本旅客鉄道。路線名: 越後線。鉄道区分: 普通鉄道JR（11）。事業者種別: JR在来線（2）。

関根
type: Concept
alternative label: 関根（東日本旅客鉄道 奥羽線）
broader: g001319
in scheme: scheme
notation: 001319
scope note: 運営会社: 東日本旅客鉄道。路線名: 奥羽線。鉄道区分: 普通鉄道JR（11）。事業者種別: JR在来線（2）。

神山
type: Concept
alternative label: 神山（東日本旅客鉄道 羽越線）
broader: g001320
in scheme: scheme
notation: 001320
scope note: 運営会社: 東日本旅客鉄道。路線名: 羽越線。鉄道区分: 普通鉄道JR（11）。事業者種別: JR在来線（2）。

内野
type: Concept
alternative label: 内野（東日本旅客鉄道 越後線）
broader: g001321
in scheme: scheme
notation: 001321
scope note: 運営会社: 東日本旅客鉄道。路線名: 越後線。鉄道区分: 普通鉄道JR（11）。事業者種別: JR在来線（2）。

やながわ希望の森公園前
type: Concept
alternative label: やながわ希望の森公園前（阿武隈急行 阿武隈急行線）
broader: g001322
in scheme: scheme
notation: 001322
scope note: 運営会社: 阿武隈急行。路線名: 阿武隈急行線。鉄道区分: 普通鉄道（12）。事業者種別: 第三セクター（5）。

桑折
type: Concept
alternative label: 桑折（東日本旅客鉄道 東北線）
broader: g001323
in scheme: scheme
notation: 001323
scope note: 運営会社: 東日本旅客鉄道。路線名: 東北線。鉄道区分: 普通鉄道JR（11）。事業者種別: JR在来線（2）。

内野西が丘
type: Concept
alternative label: 内野西が丘（東日本旅客鉄道 越後線）
broader: g001324
in scheme: scheme
notation: 001324
scope note: 運営会社: 東日本旅客鉄道。路線名: 越後線。鉄道区分: 普通鉄道JR（11）。事業者種別: JR在来線（2）。

梁川
type: Concept
alternative label: 梁川（阿武隈急行 阿武隈急行線）
broader: g001325
in scheme: scheme
notation: 001325
scope note: 運営会社: 阿武隈急行。路線名: 阿武隈急行線。鉄道区分: 普通鉄道（12）。事業者種別: 第三セクター（5）。

駒ヶ嶺
type: Concept
alternative label: 駒ヶ嶺（東日本旅客鉄道 常磐線）
broader: g001326
in scheme: scheme
notation: 001326
scope note: 運営会社: 東日本旅客鉄道。路線名: 常磐線。鉄道区分: 普通鉄道JR（11）。事業者種別: JR在来線（2）。

新田
type: Concept
alternative label: 新田（阿武隈急行 阿武隈急行線）
broader: g001327
in scheme: scheme
notation: 001327
scope note: 運営会社: 阿武隈急行。路線名: 阿武隈急行線。鉄道区分: 普通鉄道（12）。事業者種別: 第三セクター（5）。

大沢
type: Concept
alternative label: 大沢（東日本旅客鉄道 奥羽線）
broader: g001328
in scheme: scheme
notation: 001328
scope note: 運営会社: 東日本旅客鉄道。路線名: 奥羽線。鉄道区分: 普通鉄道JR（11）。事業者種別: JR在来線（2）。

水原
type: Concept
alternative label: 水原（東日本旅客鉄道 羽越線）
broader: g001329
in scheme: scheme
notation: 001329
scope note: 運営会社: 東日本旅客鉄道。路線名: 羽越線。鉄道区分: 普通鉄道JR（11）。事業者種別: JR在来線（2）。

荻川
type: Concept
alternative label: 荻川（東日本旅客鉄道 信越線）
broader: g001330
in scheme: scheme
notation: 001330
scope note: 運営会社: 東日本旅客鉄道。路線名: 信越線。鉄道区分: 普通鉄道JR（11）。事業者種別: JR在来線（2）。

飯坂温泉
type: Concept
alternative label: 飯坂温泉（福島交通 飯坂線）
broader: g001331
in scheme: scheme
notation: 001331
scope note: 運営会社: 福島交通。路線名: 飯坂線。鉄道区分: 普通鉄道（12）。事業者種別: 民営鉄道（4）。

二井田
type: Concept
alternative label: 二井田（阿武隈急行 阿武隈急行線）
broader: g001332
in scheme: scheme
notation: 001332
scope note: 運営会社: 阿武隈急行。路線名: 阿武隈急行線。鉄道区分: 普通鉄道（12）。事業者種別: 第三セクター（5）。

花水坂
type: Concept
alternative label: 花水坂（福島交通 飯坂線）
broader: g001333
in scheme: scheme
notation: 001333
scope note: 運営会社: 福島交通。路線名: 飯坂線。鉄道区分: 普通鉄道（12）。事業者種別: 民営鉄道（4）。

伊達
type: Concept
alternative label: 伊達（東日本旅客鉄道 東北線）
broader: g001334
in scheme: scheme
notation: 001334
scope note: 運営会社: 東日本旅客鉄道。路線名: 東北線。鉄道区分: 普通鉄道JR（11）。事業者種別: JR在来線（2）。

大泉
type: Concept
alternative label: 大泉（阿武隈急行 阿武隈急行線）
broader: g001335
in scheme: scheme
notation: 001335
scope note: 運営会社: 阿武隈急行。路線名: 阿武隈急行線。鉄道区分: 普通鉄道（12）。事業者種別: 第三セクター（5）。

京ヶ瀬
type: Concept
alternative label: 京ヶ瀬（東日本旅客鉄道 羽越線）
broader: g001336
in scheme: scheme
notation: 001336
scope note: 運営会社: 東日本旅客鉄道。路線名: 羽越線。鉄道区分: 普通鉄道JR（11）。事業者種別: JR在来線（2）。

医王寺前
type: Concept
alternative label: 医王寺前（福島交通 飯坂線）
broader: g001337
in scheme: scheme
notation: 001337
scope note: 運営会社: 福島交通。路線名: 飯坂線。鉄道区分: 普通鉄道（12）。事業者種別: 民営鉄道（4）。

越後赤塚
type: Concept
alternative label: 越後赤塚（東日本旅客鉄道 越後線）
broader: g001338
in scheme: scheme
notation: 001338
scope note: 運営会社: 東日本旅客鉄道。路線名: 越後線。鉄道区分: 普通鉄道JR（11）。事業者種別: JR在来線（2）。

保原
type: Concept
alternative label: 保原（阿武隈急行 阿武隈急行線）
broader: g001339
in scheme: scheme
notation: 001339
scope note: 運営会社: 阿武隈急行。路線名: 阿武隈急行線。鉄道区分: 普通鉄道（12）。事業者種別: 第三セクター（5）。

さつき野
type: Concept
alternative label: さつき野（東日本旅客鉄道 信越線）
broader: g001340
in scheme: scheme
notation: 001340
scope note: 運営会社: 東日本旅客鉄道。路線名: 信越線。鉄道区分: 普通鉄道JR（11）。事業者種別: JR在来線（2）。

峠
type: Concept
alternative label: 峠（東日本旅客鉄道 奥羽線）
broader: g001341
in scheme: scheme
notation: 001341
scope note: 運営会社: 東日本旅客鉄道。路線名: 奥羽線。鉄道区分: 普通鉄道JR（11）。事業者種別: JR在来線（2）。

板谷
type: Concept
alternative label: 板谷（東日本旅客鉄道 奥羽線）
broader: g001342
in scheme: scheme
notation: 001342
scope note: 運営会社: 東日本旅客鉄道。路線名: 奥羽線。鉄道区分: 普通鉄道JR（11）。事業者種別: JR在来線（2）。

上保原
type: Concept
alternative label: 上保原（阿武隈急行 阿武隈急行線）
broader: g001343
in scheme: scheme
notation: 001343
scope note: 運営会社: 阿武隈急行。路線名: 阿武隈急行線。鉄道区分: 普通鉄道（12）。事業者種別: 第三セクター（5）。

高子
type: Concept
alternative label: 高子（阿武隈急行 阿武隈急行線）
broader: g001344
in scheme: scheme
notation: 001344
scope note: 運営会社: 阿武隈急行。路線名: 阿武隈急行線。鉄道区分: 普通鉄道（12）。事業者種別: 第三セクター（5）。

向瀬上
type: Concept
alternative label: 向瀬上（阿武隈急行 阿武隈急行線）
broader: g001345
in scheme: scheme
notation: 001345
scope note: 運営会社: 阿武隈急行。路線名: 阿武隈急行線。鉄道区分: 普通鉄道（12）。事業者種別: 第三セクター（5）。

平野
type: Concept
alternative label: 平野（福島交通 飯坂線）
broader: g001346
in scheme: scheme
notation: 001346
scope note: 運営会社: 福島交通。路線名: 飯坂線。鉄道区分: 普通鉄道（12）。事業者種別: 民営鉄道（4）。

相馬
type: Concept
alternative label: 相馬（東日本旅客鉄道 常磐線）
broader: g001347
in scheme: scheme
notation: 001347
scope note: 運営会社: 東日本旅客鉄道。路線名: 常磐線。鉄道区分: 普通鉄道JR（11）。事業者種別: JR在来線（2）。

瀬上
type: Concept
alternative label: 瀬上（阿武隈急行 阿武隈急行線）
broader: g001348
in scheme: scheme
notation: 001348
scope note: 運営会社: 阿武隈急行。路線名: 阿武隈急行線。鉄道区分: 普通鉄道（12）。事業者種別: 第三セクター（5）。

新津
type: Concept
alternative label: 新津（東日本旅客鉄道 羽越線）
broader: g001349
in scheme: scheme
notation: 001349
scope note: 運営会社: 東日本旅客鉄道。路線名: 羽越線。鉄道区分: 普通鉄道JR（11）。事業者種別: JR在来線（2）。

新津
type: Concept
alternative label: 新津（東日本旅客鉄道 信越線）
broader: g001349
in scheme: scheme
notation: 001350
scope note: 運営会社: 東日本旅客鉄道。路線名: 信越線。鉄道区分: 普通鉄道JR（11）。事業者種別: JR在来線（2）。

新津
type: Concept
alternative label: 新津（東日本旅客鉄道 磐越西線）
broader: g001349
in scheme: scheme
notation: 001351
scope note: 運営会社: 東日本旅客鉄道。路線名: 磐越西線。鉄道区分: 普通鉄道JR（11）。事業者種別: JR在来線（2）。

東福島
type: Concept
alternative label: 東福島（東日本旅客鉄道 東北線）
broader: g001352
in scheme: scheme
notation: 001352
scope note: 運営会社: 東日本旅客鉄道。路線名: 東北線。鉄道区分: 普通鉄道JR（11）。事業者種別: JR在来線（2）。

福島学院前
type: Concept
alternative label: 福島学院前（阿武隈急行 阿武隈急行線）
broader: g001353
in scheme: scheme
notation: 001353
scope note: 運営会社: 阿武隈急行。路線名: 阿武隈急行線。鉄道区分: 普通鉄道（12）。事業者種別: 第三セクター（5）。

桜水
type: Concept
alternative label: 桜水（福島交通 飯坂線）
broader: g001354
in scheme: scheme
notation: 001354
scope note: 運営会社: 福島交通。路線名: 飯坂線。鉄道区分: 普通鉄道（12）。事業者種別: 民営鉄道（4）。

卸町
type: Concept
alternative label: 卸町（阿武隈急行 阿武隈急行線）
broader: g001355
in scheme: scheme
notation: 001355
scope note: 運営会社: 阿武隈急行。路線名: 阿武隈急行線。鉄道区分: 普通鉄道（12）。事業者種別: 第三セクター（5）。

越後曽根
type: Concept
alternative label: 越後曽根（東日本旅客鉄道 越後線）
broader: g001356
in scheme: scheme
notation: 001356
scope note: 運営会社: 東日本旅客鉄道。路線名: 越後線。鉄道区分: 普通鉄道JR（11）。事業者種別: JR在来線（2）。

東新津
type: Concept
alternative label: 東新津（東日本旅客鉄道 磐越西線）
broader: g001357
in scheme: scheme
notation: 001357
scope note: 運営会社: 東日本旅客鉄道。路線名: 磐越西線。鉄道区分: 普通鉄道JR（11）。事業者種別: JR在来線（2）。

笹谷
type: Concept
alternative label: 笹谷（福島交通 飯坂線）
broader: g001358
in scheme: scheme
notation: 001358
scope note: 運営会社: 福島交通。路線名: 飯坂線。鉄道区分: 普通鉄道（12）。事業者種別: 民営鉄道（4）。

上松川
type: Concept
alternative label: 上松川（福島交通 飯坂線）
broader: g001359
in scheme: scheme
notation: 001359
scope note: 運営会社: 福島交通。路線名: 飯坂線。鉄道区分: 普通鉄道（12）。事業者種別: 民営鉄道（4）。

泉
type: Concept
alternative label: 泉（福島交通 飯坂線）
broader: g001360
in scheme: scheme
notation: 001360
scope note: 運営会社: 福島交通。路線名: 飯坂線。鉄道区分: 普通鉄道（12）。事業者種別: 民営鉄道（4）。

岩代清水
type: Concept
alternative label: 岩代清水（福島交通 飯坂線）
broader: g001361
in scheme: scheme
notation: 001361
scope note: 運営会社: 福島交通。路線名: 飯坂線。鉄道区分: 普通鉄道（12）。事業者種別: 民営鉄道（4）。

古津
type: Concept
alternative label: 古津（東日本旅客鉄道 信越線）
broader: g001362
in scheme: scheme
notation: 001362
scope note: 運営会社: 東日本旅客鉄道。路線名: 信越線。鉄道区分: 普通鉄道JR（11）。事業者種別: JR在来線（2）。

庭坂
type: Concept
alternative label: 庭坂（東日本旅客鉄道 奥羽線）
broader: g001363
in scheme: scheme
notation: 001363
scope note: 運営会社: 東日本旅客鉄道。路線名: 奥羽線。鉄道区分: 普通鉄道JR（11）。事業者種別: JR在来線（2）。

新関
type: Concept
alternative label: 新関（東日本旅客鉄道 磐越西線）
broader: g001364
in scheme: scheme
notation: 001364
scope note: 運営会社: 東日本旅客鉄道。路線名: 磐越西線。鉄道区分: 普通鉄道JR（11）。事業者種別: JR在来線（2）。

美術館図書館前
type: Concept
alternative label: 美術館図書館前（福島交通 飯坂線）
broader: g001365
in scheme: scheme
notation: 001365
scope note: 運営会社: 福島交通。路線名: 飯坂線。鉄道区分: 普通鉄道（12）。事業者種別: 民営鉄道（4）。

笹木野
type: Concept
alternative label: 笹木野（東日本旅客鉄道 奥羽線）
broader: g001366
in scheme: scheme
notation: 001366
scope note: 運営会社: 東日本旅客鉄道。路線名: 奥羽線。鉄道区分: 普通鉄道JR（11）。事業者種別: JR在来線（2）。

曽根田
type: Concept
alternative label: 曽根田（福島交通 飯坂線）
broader: g001367
in scheme: scheme
notation: 001367
scope note: 運営会社: 福島交通。路線名: 飯坂線。鉄道区分: 普通鉄道（12）。事業者種別: 民営鉄道（4）。

巻
type: Concept
alternative label: 巻（東日本旅客鉄道 越後線）
broader: g001368
in scheme: scheme
notation: 001368
scope note: 運営会社: 東日本旅客鉄道。路線名: 越後線。鉄道区分: 普通鉄道JR（11）。事業者種別: JR在来線（2）。

日立木
type: Concept
alternative label: 日立木（東日本旅客鉄道 常磐線）
broader: g001369
in scheme: scheme
notation: 001369
scope note: 運営会社: 東日本旅客鉄道。路線名: 常磐線。鉄道区分: 普通鉄道JR（11）。事業者種別: JR在来線（2）。

福島
type: Concept
alternative label: 福島（東日本旅客鉄道 東北線）
broader: g001373
in scheme: scheme
notation: 001370
scope note: 運営会社: 東日本旅客鉄道。路線名: 東北線。鉄道区分: 普通鉄道JR（11）。事業者種別: JR在来線（2）。

福島
type: Concept
alternative label: 福島（福島交通 飯坂線）
broader: g001373
in scheme: scheme
notation: 001371
scope note: 運営会社: 福島交通。路線名: 飯坂線。鉄道区分: 普通鉄道（12）。事業者種別: 民営鉄道（4）。

福島
type: Concept
alternative label: 福島（阿武隈急行 阿武隈急行線）
broader: g001373
in scheme: scheme
notation: 001372
scope note: 運営会社: 阿武隈急行。路線名: 阿武隈急行線。鉄道区分: 普通鉄道（12）。事業者種別: 第三セクター（5）。

福島
type: Concept
alternative label: 福島（東日本旅客鉄道 奥羽線）
broader: g001373
in scheme: scheme
notation: 001373
scope note: 運営会社: 東日本旅客鉄道。路線名: 奥羽線。鉄道区分: 普通鉄道JR（11）。事業者種別: JR在来線（2）。

福島
type: Concept
alternative label: 福島（東日本旅客鉄道 東北新幹線）
broader: g001373
in scheme: scheme
notation: 001374
scope note: 運営会社: 東日本旅客鉄道。路線名: 東北新幹線。鉄道区分: 普通鉄道JR（11）。事業者種別: JRの新幹線（1）。

矢代田
type: Concept
alternative label: 矢代田（東日本旅客鉄道 信越線）
broader: g001375
in scheme: scheme
notation: 001375
scope note: 運営会社: 東日本旅客鉄道。路線名: 信越線。鉄道区分: 普通鉄道JR（11）。事業者種別: JR在来線（2）。

北五泉
type: Concept
alternative label: 北五泉（東日本旅客鉄道 磐越西線）
broader: g001376
in scheme: scheme
notation: 001376
scope note: 運営会社: 東日本旅客鉄道。路線名: 磐越西線。鉄道区分: 普通鉄道JR（11）。事業者種別: JR在来線（2）。

馬下
type: Concept
alternative label: 馬下（東日本旅客鉄道 磐越西線）
broader: g001377
in scheme: scheme
notation: 001377
scope note: 運営会社: 東日本旅客鉄道。路線名: 磐越西線。鉄道区分: 普通鉄道JR（11）。事業者種別: JR在来線（2）。

東下条
type: Concept
alternative label: 東下条（東日本旅客鉄道 磐越西線）
broader: g001378
in scheme: scheme
notation: 001378
scope note: 運営会社: 東日本旅客鉄道。路線名: 磐越西線。鉄道区分: 普通鉄道JR（11）。事業者種別: JR在来線（2）。

咲花
type: Concept
alternative label: 咲花（東日本旅客鉄道 磐越西線）
broader: g001379
in scheme: scheme
notation: 001379
scope note: 運営会社: 東日本旅客鉄道。路線名: 磐越西線。鉄道区分: 普通鉄道JR（11）。事業者種別: JR在来線（2）。

五泉
type: Concept
alternative label: 五泉（東日本旅客鉄道 磐越西線）
broader: g001380
in scheme: scheme
notation: 001380
scope note: 運営会社: 東日本旅客鉄道。路線名: 磐越西線。鉄道区分: 普通鉄道JR（11）。事業者種別: JR在来線（2）。

猿和田
type: Concept
alternative label: 猿和田（東日本旅客鉄道 磐越西線）
broader: g001381
in scheme: scheme
notation: 001381
scope note: 運営会社: 東日本旅客鉄道。路線名: 磐越西線。鉄道区分: 普通鉄道JR（11）。事業者種別: JR在来線（2）。

南福島
type: Concept
alternative label: 南福島（東日本旅客鉄道 東北線）
broader: g001382
in scheme: scheme
notation: 001382
scope note: 運営会社: 東日本旅客鉄道。路線名: 東北線。鉄道区分: 普通鉄道JR（11）。事業者種別: JR在来線（2）。

岩室
type: Concept
alternative label: 岩室（東日本旅客鉄道 越後線）
broader: g001383
in scheme: scheme
notation: 001383
scope note: 運営会社: 東日本旅客鉄道。路線名: 越後線。鉄道区分: 普通鉄道JR（11）。事業者種別: JR在来線（2）。

田上
type: Concept
alternative label: 田上（東日本旅客鉄道 信越線）
broader: g001384
in scheme: scheme
notation: 001384
scope note: 運営会社: 東日本旅客鉄道。路線名: 信越線。鉄道区分: 普通鉄道JR（11）。事業者種別: JR在来線（2）。

五十島
type: Concept
alternative label: 五十島（東日本旅客鉄道 磐越西線）
broader: g001385
in scheme: scheme
notation: 001385
scope note: 運営会社: 東日本旅客鉄道。路線名: 磐越西線。鉄道区分: 普通鉄道JR（11）。事業者種別: JR在来線（2）。

三川
type: Concept
alternative label: 三川（東日本旅客鉄道 磐越西線）
broader: g001386
in scheme: scheme
notation: 001386
scope note: 運営会社: 東日本旅客鉄道。路線名: 磐越西線。鉄道区分: 普通鉄道JR（11）。事業者種別: JR在来線（2）。

日出谷
type: Concept
alternative label: 日出谷（東日本旅客鉄道 磐越西線）
broader: g001387
in scheme: scheme
notation: 001387
scope note: 運営会社: 東日本旅客鉄道。路線名: 磐越西線。鉄道区分: 普通鉄道JR（11）。事業者種別: JR在来線（2）。

鹿島
type: Concept
alternative label: 鹿島（東日本旅客鉄道 常磐線）
broader: g001388
in scheme: scheme
notation: 001388
scope note: 運営会社: 東日本旅客鉄道。路線名: 常磐線。鉄道区分: 普通鉄道JR（11）。事業者種別: JR在来線（2）。

北吉田
type: Concept
alternative label: 北吉田（東日本旅客鉄道 越後線）
broader: g001389
in scheme: scheme
notation: 001389
scope note: 運営会社: 東日本旅客鉄道。路線名: 越後線。鉄道区分: 普通鉄道JR（11）。事業者種別: JR在来線（2）。

弥彦
type: Concept
alternative label: 弥彦（東日本旅客鉄道 弥彦線）
broader: g001390
in scheme: scheme
notation: 001390
scope note: 運営会社: 東日本旅客鉄道。路線名: 弥彦線。鉄道区分: 普通鉄道JR（11）。事業者種別: JR在来線（2）。

鹿瀬
type: Concept
alternative label: 鹿瀬（東日本旅客鉄道 磐越西線）
broader: g001391
in scheme: scheme
notation: 001391
scope note: 運営会社: 東日本旅客鉄道。路線名: 磐越西線。鉄道区分: 普通鉄道JR（11）。事業者種別: JR在来線（2）。

羽生田
type: Concept
alternative label: 羽生田（東日本旅客鉄道 信越線）
broader: g001392
in scheme: scheme
notation: 001392
scope note: 運営会社: 東日本旅客鉄道。路線名: 信越線。鉄道区分: 普通鉄道JR（11）。事業者種別: JR在来線（2）。

矢作
type: Concept
alternative label: 矢作（東日本旅客鉄道 弥彦線）
broader: g001393
in scheme: scheme
notation: 001393
scope note: 運営会社: 東日本旅客鉄道。路線名: 弥彦線。鉄道区分: 普通鉄道JR（11）。事業者種別: JR在来線（2）。

津川
type: Concept
alternative label: 津川（東日本旅客鉄道 磐越西線）
broader: g001394
in scheme: scheme
notation: 001394
scope note: 運営会社: 東日本旅客鉄道。路線名: 磐越西線。鉄道区分: 普通鉄道JR（11）。事業者種別: JR在来線（2）。

吉田
type: Concept
alternative label: 吉田（東日本旅客鉄道 越後線）
broader: g001395
in scheme: scheme
notation: 001395
scope note: 運営会社: 東日本旅客鉄道。路線名: 越後線。鉄道区分: 普通鉄道JR（11）。事業者種別: JR在来線（2）。

吉田
type: Concept
alternative label: 吉田（東日本旅客鉄道 弥彦線）
broader: g001395
in scheme: scheme
notation: 001396
scope note: 運営会社: 東日本旅客鉄道。路線名: 弥彦線。鉄道区分: 普通鉄道JR（11）。事業者種別: JR在来線（2）。

金谷川
type: Concept
alternative label: 金谷川（東日本旅客鉄道 東北線）
broader: g001397
in scheme: scheme
notation: 001397
scope note: 運営会社: 東日本旅客鉄道。路線名: 東北線。鉄道区分: 普通鉄道JR（11）。事業者種別: JR在来線（2）。

豊実
type: Concept
alternative label: 豊実（東日本旅客鉄道 磐越西線）
broader: g001398
in scheme: scheme
notation: 001398
scope note: 運営会社: 東日本旅客鉄道。路線名: 磐越西線。鉄道区分: 普通鉄道JR（11）。事業者種別: JR在来線（2）。

西燕
type: Concept
alternative label: 西燕（東日本旅客鉄道 弥彦線）
broader: g001399
in scheme: scheme
notation: 001399
scope note: 運営会社: 東日本旅客鉄道。路線名: 弥彦線。鉄道区分: 普通鉄道JR（11）。事業者種別: JR在来線（2）。

南吉田
type: Concept
alternative label: 南吉田（東日本旅客鉄道 越後線）
broader: g001400
in scheme: scheme
notation: 001400
scope note: 運営会社: 東日本旅客鉄道。路線名: 越後線。鉄道区分: 普通鉄道JR（11）。事業者種別: JR在来線（2）。

燕
type: Concept
alternative label: 燕（東日本旅客鉄道 弥彦線）
broader: g001401
in scheme: scheme
notation: 001401
scope note: 運営会社: 東日本旅客鉄道。路線名: 弥彦線。鉄道区分: 普通鉄道JR（11）。事業者種別: JR在来線（2）。

徳沢
type: Concept
alternative label: 徳沢（東日本旅客鉄道 磐越西線）
broader: g001402
in scheme: scheme
notation: 001402
scope note: 運営会社: 東日本旅客鉄道。路線名: 磐越西線。鉄道区分: 普通鉄道JR（11）。事業者種別: JR在来線（2）。

加茂
type: Concept
alternative label: 加茂（東日本旅客鉄道 信越線）
broader: g001403
in scheme: scheme
notation: 001403
scope note: 運営会社: 東日本旅客鉄道。路線名: 信越線。鉄道区分: 普通鉄道JR（11）。事業者種別: JR在来線（2）。

粟生津
type: Concept
alternative label: 粟生津（東日本旅客鉄道 越後線）
broader: g001404
in scheme: scheme
notation: 001404
scope note: 運営会社: 東日本旅客鉄道。路線名: 越後線。鉄道区分: 普通鉄道JR（11）。事業者種別: JR在来線（2）。

松川
type: Concept
alternative label: 松川（東日本旅客鉄道 東北線）
broader: g001405
in scheme: scheme
notation: 001405
scope note: 運営会社: 東日本旅客鉄道。路線名: 東北線。鉄道区分: 普通鉄道JR（11）。事業者種別: JR在来線（2）。

燕三条
type: Concept
alternative label: 燕三条（東日本旅客鉄道 弥彦線）
broader: g001406
in scheme: scheme
notation: 001406
scope note: 運営会社: 東日本旅客鉄道。路線名: 弥彦線。鉄道区分: 普通鉄道JR（11）。事業者種別: JR在来線（2）。

燕三条
type: Concept
alternative label: 燕三条（東日本旅客鉄道 上越新幹線）
broader: g001406
in scheme: scheme
notation: 001407
scope note: 運営会社: 東日本旅客鉄道。路線名: 上越新幹線。鉄道区分: 普通鉄道JR（11）。事業者種別: JRの新幹線（1）。

喜多方
type: Concept
alternative label: 喜多方（東日本旅客鉄道 磐越西線）
broader: g001408
in scheme: scheme
notation: 001408
scope note: 運営会社: 東日本旅客鉄道。路線名: 磐越西線。鉄道区分: 普通鉄道JR（11）。事業者種別: JR在来線（2）。

保内
type: Concept
alternative label: 保内（東日本旅客鉄道 信越線）
broader: g001409
in scheme: scheme
notation: 001409
scope note: 運営会社: 東日本旅客鉄道。路線名: 信越線。鉄道区分: 普通鉄道JR（11）。事業者種別: JR在来線（2）。

山都
type: Concept
alternative label: 山都（東日本旅客鉄道 磐越西線）
broader: g001410
in scheme: scheme
notation: 001410
scope note: 運営会社: 東日本旅客鉄道。路線名: 磐越西線。鉄道区分: 普通鉄道JR（11）。事業者種別: JR在来線（2）。

原ノ町
type: Concept
alternative label: 原ノ町（東日本旅客鉄道 常磐線）
broader: g001411
in scheme: scheme
notation: 001411
scope note: 運営会社: 東日本旅客鉄道。路線名: 常磐線。鉄道区分: 普通鉄道JR（11）。事業者種別: JR在来線（2）。

会津豊川
type: Concept
alternative label: 会津豊川（東日本旅客鉄道 磐越西線）
broader: g001412
in scheme: scheme
notation: 001412
scope note: 運営会社: 東日本旅客鉄道。路線名: 磐越西線。鉄道区分: 普通鉄道JR（11）。事業者種別: JR在来線（2）。

北三条
type: Concept
alternative label: 北三条（東日本旅客鉄道 弥彦線）
broader: g001413
in scheme: scheme
notation: 001413
scope note: 運営会社: 東日本旅客鉄道。路線名: 弥彦線。鉄道区分: 普通鉄道JR（11）。事業者種別: JR在来線（2）。

分水
type: Concept
alternative label: 分水（東日本旅客鉄道 越後線）
broader: g001414
in scheme: scheme
notation: 001414
scope note: 運営会社: 東日本旅客鉄道。路線名: 越後線。鉄道区分: 普通鉄道JR（11）。事業者種別: JR在来線（2）。

東三条
type: Concept
alternative label: 東三条（東日本旅客鉄道 信越線）
broader: g001415
in scheme: scheme
notation: 001415
scope note: 運営会社: 東日本旅客鉄道。路線名: 信越線。鉄道区分: 普通鉄道JR（11）。事業者種別: JR在来線（2）。

東三条
type: Concept
alternative label: 東三条（東日本旅客鉄道 弥彦線）
broader: g001415
in scheme: scheme
notation: 001416
scope note: 運営会社: 東日本旅客鉄道。路線名: 弥彦線。鉄道区分: 普通鉄道JR（11）。事業者種別: JR在来線（2）。

上野尻
type: Concept
alternative label: 上野尻（東日本旅客鉄道 磐越西線）
broader: g001417
in scheme: scheme
notation: 001417
scope note: 運営会社: 東日本旅客鉄道。路線名: 磐越西線。鉄道区分: 普通鉄道JR（11）。事業者種別: JR在来線（2）。

三条
type: Concept
alternative label: 三条（東日本旅客鉄道 信越線）
broader: g001418
in scheme: scheme
notation: 001418
scope note: 運営会社: 東日本旅客鉄道。路線名: 信越線。鉄道区分: 普通鉄道JR（11）。事業者種別: JR在来線（2）。

寺泊
type: Concept
alternative label: 寺泊（東日本旅客鉄道 越後線）
broader: g001419
in scheme: scheme
notation: 001419
scope note: 運営会社: 東日本旅客鉄道。路線名: 越後線。鉄道区分: 普通鉄道JR（11）。事業者種別: JR在来線（2）。

荻野
type: Concept
alternative label: 荻野（東日本旅客鉄道 磐越西線）
broader: g001420
in scheme: scheme
notation: 001420
scope note: 運営会社: 東日本旅客鉄道。路線名: 磐越西線。鉄道区分: 普通鉄道JR（11）。事業者種別: JR在来線（2）。

姥堂
type: Concept
alternative label: 姥堂（東日本旅客鉄道 磐越西線）
broader: g001421
in scheme: scheme
notation: 001421
scope note: 運営会社: 東日本旅客鉄道。路線名: 磐越西線。鉄道区分: 普通鉄道JR（11）。事業者種別: JR在来線（2）。

安達
type: Concept
alternative label: 安達（東日本旅客鉄道 東北線）
broader: g001422
in scheme: scheme
notation: 001422
scope note: 運営会社: 東日本旅客鉄道。路線名: 東北線。鉄道区分: 普通鉄道JR（11）。事業者種別: JR在来線（2）。

尾登
type: Concept
alternative label: 尾登（東日本旅客鉄道 磐越西線）
broader: g001423
in scheme: scheme
notation: 001423
scope note: 運営会社: 東日本旅客鉄道。路線名: 磐越西線。鉄道区分: 普通鉄道JR（11）。事業者種別: JR在来線（2）。

磐城太田
type: Concept
alternative label: 磐城太田（東日本旅客鉄道 常磐線）
broader: g001424
in scheme: scheme
notation: 001424
scope note: 運営会社: 東日本旅客鉄道。路線名: 常磐線。鉄道区分: 普通鉄道JR（11）。事業者種別: JR在来線（2）。

桐原
type: Concept
alternative label: 桐原（東日本旅客鉄道 越後線）
broader: g001425
in scheme: scheme
notation: 001425
scope note: 運営会社: 東日本旅客鉄道。路線名: 越後線。鉄道区分: 普通鉄道JR（11）。事業者種別: JR在来線（2）。

塩川
type: Concept
alternative label: 塩川（東日本旅客鉄道 磐越西線）
broader: g001426
in scheme: scheme
notation: 001426
scope note: 運営会社: 東日本旅客鉄道。路線名: 磐越西線。鉄道区分: 普通鉄道JR（11）。事業者種別: JR在来線（2）。

東光寺
type: Concept
alternative label: 東光寺（東日本旅客鉄道 信越線）
broader: g001427
in scheme: scheme
notation: 001427
scope note: 運営会社: 東日本旅客鉄道。路線名: 信越線。鉄道区分: 普通鉄道JR（11）。事業者種別: JR在来線（2）。

野沢
type: Concept
alternative label: 野沢（東日本旅客鉄道 磐越西線）
broader: g001428
in scheme: scheme
notation: 001428
scope note: 運営会社: 東日本旅客鉄道。路線名: 磐越西線。鉄道区分: 普通鉄道JR（11）。事業者種別: JR在来線（2）。

二本松
type: Concept
alternative label: 二本松（東日本旅客鉄道 東北線）
broader: g001429
in scheme: scheme
notation: 001429
scope note: 運営会社: 東日本旅客鉄道。路線名: 東北線。鉄道区分: 普通鉄道JR（11）。事業者種別: JR在来線（2）。

笈川
type: Concept
alternative label: 笈川（東日本旅客鉄道 磐越西線）
broader: g001430
in scheme: scheme
notation: 001430
scope note: 運営会社: 東日本旅客鉄道。路線名: 磐越西線。鉄道区分: 普通鉄道JR（11）。事業者種別: JR在来線（2）。

小島谷
type: Concept
alternative label: 小島谷（東日本旅客鉄道 越後線）
broader: g001431
in scheme: scheme
notation: 001431
scope note: 運営会社: 東日本旅客鉄道。路線名: 越後線。鉄道区分: 普通鉄道JR（11）。事業者種別: JR在来線（2）。

帯織
type: Concept
alternative label: 帯織（東日本旅客鉄道 信越線）
broader: g001432
in scheme: scheme
notation: 001432
scope note: 運営会社: 東日本旅客鉄道。路線名: 信越線。鉄道区分: 普通鉄道JR（11）。事業者種別: JR在来線（2）。

塔寺
type: Concept
alternative label: 塔寺（東日本旅客鉄道 只見線）
broader: g001433
in scheme: scheme
notation: 001433
scope note: 運営会社: 東日本旅客鉄道。路線名: 只見線。鉄道区分: 普通鉄道JR（11）。事業者種別: JR在来線（2）。

東長原
type: Concept
alternative label: 東長原（東日本旅客鉄道 磐越西線）
broader: g001434
in scheme: scheme
notation: 001434
scope note: 運営会社: 東日本旅客鉄道。路線名: 磐越西線。鉄道区分: 普通鉄道JR（11）。事業者種別: JR在来線（2）。

妙法寺
type: Concept
alternative label: 妙法寺（東日本旅客鉄道 越後線）
broader: g001435
in scheme: scheme
notation: 001435
scope note: 運営会社: 東日本旅客鉄道。路線名: 越後線。鉄道区分: 普通鉄道JR（11）。事業者種別: JR在来線（2）。

杉田
type: Concept
alternative label: 杉田（東日本旅客鉄道 東北線）
broader: g001436
in scheme: scheme
notation: 001436
scope note: 運営会社: 東日本旅客鉄道。路線名: 東北線。鉄道区分: 普通鉄道JR（11）。事業者種別: JR在来線（2）。

小高
type: Concept
alternative label: 小高（東日本旅客鉄道 常磐線）
broader: g001437
in scheme: scheme
notation: 001437
scope note: 運営会社: 東日本旅客鉄道。路線名: 常磐線。鉄道区分: 普通鉄道JR（11）。事業者種別: JR在来線（2）。

磐梯町
type: Concept
alternative label: 磐梯町（東日本旅客鉄道 磐越西線）
broader: g001438
in scheme: scheme
notation: 001438
scope note: 運営会社: 東日本旅客鉄道。路線名: 磐越西線。鉄道区分: 普通鉄道JR（11）。事業者種別: JR在来線（2）。

会津坂下
type: Concept
alternative label: 会津坂下（東日本旅客鉄道 只見線）
broader: g001439
in scheme: scheme
notation: 001439
scope note: 運営会社: 東日本旅客鉄道。路線名: 只見線。鉄道区分: 普通鉄道JR（11）。事業者種別: JR在来線（2）。

堂島
type: Concept
alternative label: 堂島（東日本旅客鉄道 磐越西線）
broader: g001440
in scheme: scheme
notation: 001440
scope note: 運営会社: 東日本旅客鉄道。路線名: 磐越西線。鉄道区分: 普通鉄道JR（11）。事業者種別: JR在来線（2）。

会津坂本
type: Concept
alternative label: 会津坂本（東日本旅客鉄道 只見線）
broader: g001441
in scheme: scheme
notation: 001441
scope note: 運営会社: 東日本旅客鉄道。路線名: 只見線。鉄道区分: 普通鉄道JR（11）。事業者種別: JR在来線（2）。

翁島
type: Concept
alternative label: 翁島（東日本旅客鉄道 磐越西線）
broader: g001442
in scheme: scheme
notation: 001442
scope note: 運営会社: 東日本旅客鉄道。路線名: 磐越西線。鉄道区分: 普通鉄道JR（11）。事業者種別: JR在来線（2）。

広田
type: Concept
alternative label: 広田（東日本旅客鉄道 磐越西線）
broader: g001443
in scheme: scheme
notation: 001443
scope note: 運営会社: 東日本旅客鉄道。路線名: 磐越西線。鉄道区分: 普通鉄道JR（11）。事業者種別: JR在来線（2）。

猪苗代
type: Concept
alternative label: 猪苗代（東日本旅客鉄道 磐越西線）
broader: g001444
in scheme: scheme
notation: 001444
scope note: 運営会社: 東日本旅客鉄道。路線名: 磐越西線。鉄道区分: 普通鉄道JR（11）。事業者種別: JR在来線（2）。

見附
type: Concept
alternative label: 見附（東日本旅客鉄道 信越線）
broader: g001445
in scheme: scheme
notation: 001445
scope note: 運営会社: 東日本旅客鉄道。路線名: 信越線。鉄道区分: 普通鉄道JR（11）。事業者種別: JR在来線（2）。

会津柳津
type: Concept
alternative label: 会津柳津（東日本旅客鉄道 只見線）
broader: g001446
in scheme: scheme
notation: 001446
scope note: 運営会社: 東日本旅客鉄道。路線名: 只見線。鉄道区分: 普通鉄道JR（11）。事業者種別: JR在来線（2）。

川桁
type: Concept
alternative label: 川桁（東日本旅客鉄道 磐越西線）
broader: g001447
in scheme: scheme
notation: 001447
scope note: 運営会社: 東日本旅客鉄道。路線名: 磐越西線。鉄道区分: 普通鉄道JR（11）。事業者種別: JR在来線（2）。

若宮
type: Concept
alternative label: 若宮（東日本旅客鉄道 只見線）
broader: g001448
in scheme: scheme
notation: 001448
scope note: 運営会社: 東日本旅客鉄道。路線名: 只見線。鉄道区分: 普通鉄道JR（11）。事業者種別: JR在来線（2）。

出雲崎
type: Concept
alternative label: 出雲崎（東日本旅客鉄道 越後線）
broader: g001449
in scheme: scheme
notation: 001449
scope note: 運営会社: 東日本旅客鉄道。路線名: 越後線。鉄道区分: 普通鉄道JR（11）。事業者種別: JR在来線（2）。

桃内
type: Concept
alternative label: 桃内（東日本旅客鉄道 常磐線）
broader: g001450
in scheme: scheme
notation: 001450
scope note: 運営会社: 東日本旅客鉄道。路線名: 常磐線。鉄道区分: 普通鉄道JR（11）。事業者種別: JR在来線（2）。

新鶴
type: Concept
alternative label: 新鶴（東日本旅客鉄道 只見線）
broader: g001451
in scheme: scheme
notation: 001451
scope note: 運営会社: 東日本旅客鉄道。路線名: 只見線。鉄道区分: 普通鉄道JR（11）。事業者種別: JR在来線（2）。

郷戸
type: Concept
alternative label: 郷戸（東日本旅客鉄道 只見線）
broader: g001452
in scheme: scheme
notation: 001452
scope note: 運営会社: 東日本旅客鉄道。路線名: 只見線。鉄道区分: 普通鉄道JR（11）。事業者種別: JR在来線（2）。

関都
type: Concept
alternative label: 関都（東日本旅客鉄道 磐越西線）
broader: g001453
in scheme: scheme
notation: 001453
scope note: 運営会社: 東日本旅客鉄道。路線名: 磐越西線。鉄道区分: 普通鉄道JR（11）。事業者種別: JR在来線（2）。

小木ノ城
type: Concept
alternative label: 小木ノ城（東日本旅客鉄道 越後線）
broader: g001454
in scheme: scheme
notation: 001454
scope note: 運営会社: 東日本旅客鉄道。路線名: 越後線。鉄道区分: 普通鉄道JR（11）。事業者種別: JR在来線（2）。

本宮
type: Concept
alternative label: 本宮（東日本旅客鉄道 東北線）
broader: g001455
in scheme: scheme
notation: 001455
scope note: 運営会社: 東日本旅客鉄道。路線名: 東北線。鉄道区分: 普通鉄道JR（11）。事業者種別: JR在来線（2）。

会津若松
type: Concept
alternative label: 会津若松（東日本旅客鉄道 只見線）
broader: g001456
in scheme: scheme
notation: 001456
scope note: 運営会社: 東日本旅客鉄道。路線名: 只見線。鉄道区分: 普通鉄道JR（11）。事業者種別: JR在来線（2）。

会津若松
type: Concept
alternative label: 会津若松（東日本旅客鉄道 磐越西線）
broader: g001456
in scheme: scheme
notation: 001457
scope note: 運営会社: 東日本旅客鉄道。路線名: 磐越西線。鉄道区分: 普通鉄道JR（11）。事業者種別: JR在来線（2）。

押切
type: Concept
alternative label: 押切（東日本旅客鉄道 信越線）
broader: g001458
in scheme: scheme
notation: 001458
scope note: 運営会社: 東日本旅客鉄道。路線名: 信越線。鉄道区分: 普通鉄道JR（11）。事業者種別: JR在来線（2）。

根岸
type: Concept
alternative label: 根岸（東日本旅客鉄道 只見線）
broader: g001459
in scheme: scheme
notation: 001459
scope note: 運営会社: 東日本旅客鉄道。路線名: 只見線。鉄道区分: 普通鉄道JR（11）。事業者種別: JR在来線（2）。

七日町
type: Concept
alternative label: 七日町（東日本旅客鉄道 只見線）
broader: g001460
in scheme: scheme
notation: 001460
scope note: 運営会社: 東日本旅客鉄道。路線名: 只見線。鉄道区分: 普通鉄道JR（11）。事業者種別: JR在来線（2）。

猪苗代湖畔
type: Concept
alternative label: 猪苗代湖畔（東日本旅客鉄道 磐越西線）
broader: g001461
in scheme: scheme
notation: 001461
scope note: 運営会社: 東日本旅客鉄道。路線名: 磐越西線。鉄道区分: 普通鉄道JR（11）。事業者種別: JR在来線（2）。

中山宿
type: Concept
alternative label: 中山宿（東日本旅客鉄道 磐越西線）
broader: g001462
in scheme: scheme
notation: 001462
scope note: 運営会社: 東日本旅客鉄道。路線名: 磐越西線。鉄道区分: 普通鉄道JR（11）。事業者種別: JR在来線（2）。

滝谷
type: Concept
alternative label: 滝谷（東日本旅客鉄道 只見線）
broader: g001463
in scheme: scheme
notation: 001463
scope note: 運営会社: 東日本旅客鉄道。路線名: 只見線。鉄道区分: 普通鉄道JR（11）。事業者種別: JR在来線（2）。

浪江
type: Concept
alternative label: 浪江（東日本旅客鉄道 常磐線）
broader: g001464
in scheme: scheme
notation: 001464
scope note: 運営会社: 東日本旅客鉄道。路線名: 常磐線。鉄道区分: 普通鉄道JR（11）。事業者種別: JR在来線（2）。

会津桧原
type: Concept
alternative label: 会津桧原（東日本旅客鉄道 只見線）
broader: g001465
in scheme: scheme
notation: 001465
scope note: 運営会社: 東日本旅客鉄道。路線名: 只見線。鉄道区分: 普通鉄道JR（11）。事業者種別: JR在来線（2）。

上戸
type: Concept
alternative label: 上戸（東日本旅客鉄道 磐越西線）
broader: g001466
in scheme: scheme
notation: 001466
scope note: 運営会社: 東日本旅客鉄道。路線名: 磐越西線。鉄道区分: 普通鉄道JR（11）。事業者種別: JR在来線（2）。

西若松
type: Concept
alternative label: 西若松（東日本旅客鉄道 只見線）
broader: g001467
in scheme: scheme
notation: 001467
scope note: 運営会社: 東日本旅客鉄道。路線名: 只見線。鉄道区分: 普通鉄道JR（11）。事業者種別: JR在来線（2）。

西若松
type: Concept
alternative label: 西若松（会津鉄道 会津線）
broader: g001467
in scheme: scheme
notation: 001468
scope note: 運営会社: 会津鉄道。路線名: 会津線。鉄道区分: 普通鉄道（12）。事業者種別: 第三セクター（5）。

石地
type: Concept
alternative label: 石地（東日本旅客鉄道 越後線）
broader: g001469
in scheme: scheme
notation: 001469
scope note: 運営会社: 東日本旅客鉄道。路線名: 越後線。鉄道区分: 普通鉄道JR（11）。事業者種別: JR在来線（2）。

会津水沼
type: Concept
alternative label: 会津水沼（東日本旅客鉄道 只見線）
broader: g001470
in scheme: scheme
notation: 001470
scope note: 運営会社: 東日本旅客鉄道。路線名: 只見線。鉄道区分: 普通鉄道JR（11）。事業者種別: JR在来線（2）。

五百川
type: Concept
alternative label: 五百川（東日本旅客鉄道 東北線）
broader: g001471
in scheme: scheme
notation: 001471
scope note: 運営会社: 東日本旅客鉄道。路線名: 東北線。鉄道区分: 普通鉄道JR（11）。事業者種別: JR在来線（2）。

会津西方
type: Concept
alternative label: 会津西方（東日本旅客鉄道 只見線）
broader: g001472
in scheme: scheme
notation: 001472
scope note: 運営会社: 東日本旅客鉄道。路線名: 只見線。鉄道区分: 普通鉄道JR（11）。事業者種別: JR在来線（2）。

磐梯熱海
type: Concept
alternative label: 磐梯熱海（東日本旅客鉄道 磐越西線）
broader: g001473
in scheme: scheme
notation: 001473
scope note: 運営会社: 東日本旅客鉄道。路線名: 磐越西線。鉄道区分: 普通鉄道JR（11）。事業者種別: JR在来線（2）。

会津中川
type: Concept
alternative label: 会津中川（東日本旅客鉄道 只見線）
broader: g001474
in scheme: scheme
notation: 001474
scope note: 運営会社: 東日本旅客鉄道。路線名: 只見線。鉄道区分: 普通鉄道JR（11）。事業者種別: JR在来線（2）。

安子ヶ島
type: Concept
alternative label: 安子ヶ島（東日本旅客鉄道 磐越西線）
broader: g001475
in scheme: scheme
notation: 001475
scope note: 運営会社: 東日本旅客鉄道。路線名: 磐越西線。鉄道区分: 普通鉄道JR（11）。事業者種別: JR在来線（2）。

会津宮下
type: Concept
alternative label: 会津宮下（東日本旅客鉄道 只見線）
broader: g001476
in scheme: scheme
notation: 001476
scope note: 運営会社: 東日本旅客鉄道。路線名: 只見線。鉄道区分: 普通鉄道JR（11）。事業者種別: JR在来線（2）。

会津高田
type: Concept
alternative label: 会津高田（東日本旅客鉄道 只見線）
broader: g001477
in scheme: scheme
notation: 001477
scope note: 運営会社: 東日本旅客鉄道。路線名: 只見線。鉄道区分: 普通鉄道JR（11）。事業者種別: JR在来線（2）。

早戸
type: Concept
alternative label: 早戸（東日本旅客鉄道 只見線）
broader: g001478
in scheme: scheme
notation: 001478
scope note: 運営会社: 東日本旅客鉄道。路線名: 只見線。鉄道区分: 普通鉄道JR（11）。事業者種別: JR在来線（2）。

北長岡
type: Concept
alternative label: 北長岡（東日本旅客鉄道 信越線）
broader: g001479
in scheme: scheme
notation: 001479
scope note: 運営会社: 東日本旅客鉄道。路線名: 信越線。鉄道区分: 普通鉄道JR（11）。事業者種別: JR在来線（2）。

会津本郷
type: Concept
alternative label: 会津本郷（東日本旅客鉄道 只見線）
broader: g001480
in scheme: scheme
notation: 001480
scope note: 運営会社: 東日本旅客鉄道。路線名: 只見線。鉄道区分: 普通鉄道JR（11）。事業者種別: JR在来線（2）。

南若松
type: Concept
alternative label: 南若松（会津鉄道 会津線）
broader: g001481
in scheme: scheme
notation: 001481
scope note: 運営会社: 会津鉄道。路線名: 会津線。鉄道区分: 普通鉄道（12）。事業者種別: 第三セクター（5）。

礼拝
type: Concept
alternative label: 礼拝（東日本旅客鉄道 越後線）
broader: g001482
in scheme: scheme
notation: 001482
scope note: 運営会社: 東日本旅客鉄道。路線名: 越後線。鉄道区分: 普通鉄道JR（11）。事業者種別: JR在来線（2）。

会津川口
type: Concept
alternative label: 会津川口（東日本旅客鉄道 只見線）
broader: g001483
in scheme: scheme
notation: 001483
scope note: 運営会社: 東日本旅客鉄道。路線名: 只見線。鉄道区分: 普通鉄道JR（11）。事業者種別: JR在来線（2）。

要田
type: Concept
alternative label: 要田（東日本旅客鉄道 磐越東線）
broader: g001484
in scheme: scheme
notation: 001484
scope note: 運営会社: 東日本旅客鉄道。路線名: 磐越東線。鉄道区分: 普通鉄道JR（11）。事業者種別: JR在来線（2）。

双葉
type: Concept
alternative label: 双葉（東日本旅客鉄道 常磐線）
broader: g001485
in scheme: scheme
notation: 001485
scope note: 運営会社: 東日本旅客鉄道。路線名: 常磐線。鉄道区分: 普通鉄道JR（11）。事業者種別: JR在来線（2）。

喜久田
type: Concept
alternative label: 喜久田（東日本旅客鉄道 磐越西線）
broader: g001486
in scheme: scheme
notation: 001486
scope note: 運営会社: 東日本旅客鉄道。路線名: 磐越西線。鉄道区分: 普通鉄道JR（11）。事業者種別: JR在来線（2）。

三春
type: Concept
alternative label: 三春（東日本旅客鉄道 磐越東線）
broader: g001487
in scheme: scheme
notation: 001487
scope note: 運営会社: 東日本旅客鉄道。路線名: 磐越東線。鉄道区分: 普通鉄道JR（11）。事業者種別: JR在来線（2）。

西山
type: Concept
alternative label: 西山（東日本旅客鉄道 越後線）
broader: g001488
in scheme: scheme
notation: 001488
scope note: 運営会社: 東日本旅客鉄道。路線名: 越後線。鉄道区分: 普通鉄道JR（11）。事業者種別: JR在来線（2）。

長岡
type: Concept
alternative label: 長岡（東日本旅客鉄道 上越新幹線）
broader: g001489
in scheme: scheme
notation: 001489
scope note: 運営会社: 東日本旅客鉄道。路線名: 上越新幹線。鉄道区分: 普通鉄道JR（11）。事業者種別: JRの新幹線（1）。

長岡
type: Concept
alternative label: 長岡（東日本旅客鉄道 信越線）
broader: g001489
in scheme: scheme
notation: 001490
scope note: 運営会社: 東日本旅客鉄道。路線名: 信越線。鉄道区分: 普通鉄道JR（11）。事業者種別: JR在来線（2）。

日和田
type: Concept
alternative label: 日和田（東日本旅客鉄道 東北線）
broader: g001491
in scheme: scheme
notation: 001491
scope note: 運営会社: 東日本旅客鉄道。路線名: 東北線。鉄道区分: 普通鉄道JR（11）。事業者種別: JR在来線（2）。

本名
type: Concept
alternative label: 本名（東日本旅客鉄道 只見線）
broader: g001492
in scheme: scheme
notation: 001492
scope note: 運営会社: 東日本旅客鉄道。路線名: 只見線。鉄道区分: 普通鉄道JR（11）。事業者種別: JR在来線（2）。

船引
type: Concept
alternative label: 船引（東日本旅客鉄道 磐越東線）
broader: g001493
in scheme: scheme
notation: 001493
scope note: 運営会社: 東日本旅客鉄道。路線名: 磐越東線。鉄道区分: 普通鉄道JR（11）。事業者種別: JR在来線（2）。

門田
type: Concept
alternative label: 門田（会津鉄道 会津線）
broader: g001494
in scheme: scheme
notation: 001494
scope note: 運営会社: 会津鉄道。路線名: 会津線。鉄道区分: 普通鉄道（12）。事業者種別: 第三セクター（5）。

刈羽
type: Concept
alternative label: 刈羽（東日本旅客鉄道 越後線）
broader: g001495
in scheme: scheme
notation: 001495
scope note: 運営会社: 東日本旅客鉄道。路線名: 越後線。鉄道区分: 普通鉄道JR（11）。事業者種別: JR在来線（2）。

宮内
type: Concept
alternative label: 宮内（東日本旅客鉄道 上越線）
broader: g001496
in scheme: scheme
notation: 001496
scope note: 運営会社: 東日本旅客鉄道。路線名: 上越線。鉄道区分: 普通鉄道JR（11）。事業者種別: JR在来線（2）。

宮内
type: Concept
alternative label: 宮内（東日本旅客鉄道 信越線）
broader: g001496
in scheme: scheme
notation: 001497
scope note: 運営会社: 東日本旅客鉄道。路線名: 信越線。鉄道区分: 普通鉄道JR（11）。事業者種別: JR在来線（2）。

磐城常葉
type: Concept
alternative label: 磐城常葉（東日本旅客鉄道 磐越東線）
broader: g001498
in scheme: scheme
notation: 001498
scope note: 運営会社: 東日本旅客鉄道。路線名: 磐越東線。鉄道区分: 普通鉄道JR（11）。事業者種別: JR在来線（2）。

郡山富田
type: Concept
alternative label: 郡山富田（東日本旅客鉄道 磐越西線）
broader: g001499
in scheme: scheme
notation: 001499
scope note: 運営会社: 東日本旅客鉄道。路線名: 磐越西線。鉄道区分: 普通鉄道JR（11）。事業者種別: JR在来線（2）。

あまや
type: Concept
alternative label: あまや（会津鉄道 会津線）
broader: g001500
in scheme: scheme
notation: 001500
scope note: 運営会社: 会津鉄道。路線名: 会津線。鉄道区分: 普通鉄道（12）。事業者種別: 第三セクター（5）。

舞木
type: Concept
alternative label: 舞木（東日本旅客鉄道 磐越東線）
broader: g001501
in scheme: scheme
notation: 001501
scope note: 運営会社: 東日本旅客鉄道。路線名: 磐越東線。鉄道区分: 普通鉄道JR（11）。事業者種別: JR在来線（2）。

大野
type: Concept
alternative label: 大野（東日本旅客鉄道 常磐線）
broader: g001502
in scheme: scheme
notation: 001502
scope note: 運営会社: 東日本旅客鉄道。路線名: 常磐線。鉄道区分: 普通鉄道JR（11）。事業者種別: JR在来線（2）。

荒浜
type: Concept
alternative label: 荒浜（東日本旅客鉄道 越後線）
broader: g001503
in scheme: scheme
notation: 001503
scope note: 運営会社: 東日本旅客鉄道。路線名: 越後線。鉄道区分: 普通鉄道JR（11）。事業者種別: JR在来線（2）。

前川
type: Concept
alternative label: 前川（東日本旅客鉄道 信越線）
broader: g001504
in scheme: scheme
notation: 001504
scope note: 運営会社: 東日本旅客鉄道。路線名: 信越線。鉄道区分: 普通鉄道JR（11）。事業者種別: JR在来線（2）。

会津越川
type: Concept
alternative label: 会津越川（東日本旅客鉄道 只見線）
broader: g001505
in scheme: scheme
notation: 001505
scope note: 運営会社: 東日本旅客鉄道。路線名: 只見線。鉄道区分: 普通鉄道JR（11）。事業者種別: JR在来線（2）。

郡山
type: Concept
alternative label: 郡山（東日本旅客鉄道 東北新幹線）
broader: g001507
in scheme: scheme
notation: 001506
scope note: 運営会社: 東日本旅客鉄道。路線名: 東北新幹線。鉄道区分: 普通鉄道JR（11）。事業者種別: JRの新幹線（1）。

郡山
type: Concept
alternative label: 郡山（東日本旅客鉄道 東北線）
broader: g001507
in scheme: scheme
notation: 001507
scope note: 運営会社: 東日本旅客鉄道。路線名: 東北線。鉄道区分: 普通鉄道JR（11）。事業者種別: JR在来線（2）。

郡山
type: Concept
alternative label: 郡山（東日本旅客鉄道 磐越西線）
broader: g001507
in scheme: scheme
notation: 001508
scope note: 運営会社: 東日本旅客鉄道。路線名: 磐越西線。鉄道区分: 普通鉄道JR（11）。事業者種別: JR在来線（2）。

郡山
type: Concept
alternative label: 郡山（東日本旅客鉄道 磐越東線）
broader: g001507
in scheme: scheme
notation: 001509
scope note: 運営会社: 東日本旅客鉄道。路線名: 磐越東線。鉄道区分: 普通鉄道JR（11）。事業者種別: JR在来線（2）。

来迎寺
type: Concept
alternative label: 来迎寺（東日本旅客鉄道 信越線）
broader: g001510
in scheme: scheme
notation: 001510
scope note: 運営会社: 東日本旅客鉄道。路線名: 信越線。鉄道区分: 普通鉄道JR（11）。事業者種別: JR在来線（2）。

芦ノ牧温泉
type: Concept
alternative label: 芦ノ牧温泉（会津鉄道 会津線）
broader: g001511
in scheme: scheme
notation: 001511
scope note: 運営会社: 会津鉄道。路線名: 会津線。鉄道区分: 普通鉄道（12）。事業者種別: 第三セクター（5）。

会津塩沢
type: Concept
alternative label: 会津塩沢（東日本旅客鉄道 只見線）
broader: g001512
in scheme: scheme
notation: 001512
scope note: 運営会社: 東日本旅客鉄道。路線名: 只見線。鉄道区分: 普通鉄道JR（11）。事業者種別: JR在来線（2）。

会津大塩
type: Concept
alternative label: 会津大塩（東日本旅客鉄道 只見線）
broader: g001513
in scheme: scheme
notation: 001513
scope note: 運営会社: 東日本旅客鉄道。路線名: 只見線。鉄道区分: 普通鉄道JR（11）。事業者種別: JR在来線（2）。

西中通
type: Concept
alternative label: 西中通（東日本旅客鉄道 越後線）
broader: g001514
in scheme: scheme
notation: 001514
scope note: 運営会社: 東日本旅客鉄道。路線名: 越後線。鉄道区分: 普通鉄道JR（11）。事業者種別: JR在来線（2）。

会津横田
type: Concept
alternative label: 会津横田（東日本旅客鉄道 只見線）
broader: g001515
in scheme: scheme
notation: 001515
scope note: 運営会社: 東日本旅客鉄道。路線名: 只見線。鉄道区分: 普通鉄道JR（11）。事業者種別: JR在来線（2）。

大越
type: Concept
alternative label: 大越（東日本旅客鉄道 磐越東線）
broader: g001516
in scheme: scheme
notation: 001516
scope note: 運営会社: 東日本旅客鉄道。路線名: 磐越東線。鉄道区分: 普通鉄道JR（11）。事業者種別: JR在来線（2）。

越後岩塚
type: Concept
alternative label: 越後岩塚（東日本旅客鉄道 信越線）
broader: g001517
in scheme: scheme
notation: 001517
scope note: 運営会社: 東日本旅客鉄道。路線名: 信越線。鉄道区分: 普通鉄道JR（11）。事業者種別: JR在来線（2）。

会津蒲生
type: Concept
alternative label: 会津蒲生（東日本旅客鉄道 只見線）
broader: g001518
in scheme: scheme
notation: 001518
scope note: 運営会社: 東日本旅客鉄道。路線名: 只見線。鉄道区分: 普通鉄道JR（11）。事業者種別: JR在来線（2）。

東柏崎
type: Concept
alternative label: 東柏崎（東日本旅客鉄道 越後線）
broader: g001519
in scheme: scheme
notation: 001519
scope note: 運営会社: 東日本旅客鉄道。路線名: 越後線。鉄道区分: 普通鉄道JR（11）。事業者種別: JR在来線（2）。

越後滝谷
type: Concept
alternative label: 越後滝谷（東日本旅客鉄道 上越線）
broader: g001520
in scheme: scheme
notation: 001520
scope note: 運営会社: 東日本旅客鉄道。路線名: 上越線。鉄道区分: 普通鉄道JR（11）。事業者種別: JR在来線（2）。

長鳥
type: Concept
alternative label: 長鳥（東日本旅客鉄道 信越線）
broader: g001521
in scheme: scheme
notation: 001521
scope note: 運営会社: 東日本旅客鉄道。路線名: 信越線。鉄道区分: 普通鉄道JR（11）。事業者種別: JR在来線（2）。

夜ノ森
type: Concept
alternative label: 夜ノ森（東日本旅客鉄道 常磐線）
broader: g001522
in scheme: scheme
notation: 001522
scope note: 運営会社: 東日本旅客鉄道。路線名: 常磐線。鉄道区分: 普通鉄道JR（11）。事業者種別: JR在来線（2）。

柏崎
type: Concept
alternative label: 柏崎（東日本旅客鉄道 越後線）
broader: g001523
in scheme: scheme
notation: 001523
scope note: 運営会社: 東日本旅客鉄道。路線名: 越後線。鉄道区分: 普通鉄道JR（11）。事業者種別: JR在来線（2）。

柏崎
type: Concept
alternative label: 柏崎（東日本旅客鉄道 信越線）
broader: g001523
in scheme: scheme
notation: 001524
scope note: 運営会社: 東日本旅客鉄道。路線名: 信越線。鉄道区分: 普通鉄道JR（11）。事業者種別: JR在来線（2）。

入広瀬
type: Concept
alternative label: 入広瀬（東日本旅客鉄道 只見線）
broader: g001525
in scheme: scheme
notation: 001525
scope note: 運営会社: 東日本旅客鉄道。路線名: 只見線。鉄道区分: 普通鉄道JR（11）。事業者種別: JR在来線（2）。

越後広田
type: Concept
alternative label: 越後広田（東日本旅客鉄道 信越線）
broader: g001526
in scheme: scheme
notation: 001526
scope note: 運営会社: 東日本旅客鉄道。路線名: 信越線。鉄道区分: 普通鉄道JR（11）。事業者種別: JR在来線（2）。

茨目
type: Concept
alternative label: 茨目（東日本旅客鉄道 信越線）
broader: g001527
in scheme: scheme
notation: 001527
scope note: 運営会社: 東日本旅客鉄道。路線名: 信越線。鉄道区分: 普通鉄道JR（11）。事業者種別: JR在来線（2）。

安積永盛
type: Concept
alternative label: 安積永盛（東日本旅客鉄道 水郡線）
broader: g001528
in scheme: scheme
notation: 001528
scope note: 運営会社: 東日本旅客鉄道。路線名: 水郡線。鉄道区分: 普通鉄道JR（11）。事業者種別: JR在来線（2）。

安積永盛
type: Concept
alternative label: 安積永盛（東日本旅客鉄道 東北線）
broader: g001528
in scheme: scheme
notation: 001529
scope note: 運営会社: 東日本旅客鉄道。路線名: 東北線。鉄道区分: 普通鉄道JR（11）。事業者種別: JR在来線（2）。

鯨波
type: Concept
alternative label: 鯨波（東日本旅客鉄道 信越線）
broader: g001530
in scheme: scheme
notation: 001530
scope note: 運営会社: 東日本旅客鉄道。路線名: 信越線。鉄道区分: 普通鉄道JR（11）。事業者種別: JR在来線（2）。

塚山
type: Concept
alternative label: 塚山（東日本旅客鉄道 信越線）
broader: g001531
in scheme: scheme
notation: 001531
scope note: 運営会社: 東日本旅客鉄道。路線名: 信越線。鉄道区分: 普通鉄道JR（11）。事業者種別: JR在来線（2）。

菅谷
type: Concept
alternative label: 菅谷（東日本旅客鉄道 磐越東線）
broader: g001532
in scheme: scheme
notation: 001532
scope note: 運営会社: 東日本旅客鉄道。路線名: 磐越東線。鉄道区分: 普通鉄道JR（11）。事業者種別: JR在来線（2）。

只見
type: Concept
alternative label: 只見（東日本旅客鉄道 只見線）
broader: g001533
in scheme: scheme
notation: 001533
scope note: 運営会社: 東日本旅客鉄道。路線名: 只見線。鉄道区分: 普通鉄道JR（11）。事業者種別: JR在来線（2）。

大川ダム公園
type: Concept
alternative label: 大川ダム公園（会津鉄道 会津線）
broader: g001534
in scheme: scheme
notation: 001534
scope note: 運営会社: 会津鉄道。路線名: 会津線。鉄道区分: 普通鉄道（12）。事業者種別: 第三セクター（5）。

上条
type: Concept
alternative label: 上条（東日本旅客鉄道 只見線）
broader: g001535
in scheme: scheme
notation: 001535
scope note: 運営会社: 東日本旅客鉄道。路線名: 只見線。鉄道区分: 普通鉄道JR（11）。事業者種別: JR在来線（2）。

青海川
type: Concept
alternative label: 青海川（東日本旅客鉄道 信越線）
broader: g001536
in scheme: scheme
notation: 001536
scope note: 運営会社: 東日本旅客鉄道。路線名: 信越線。鉄道区分: 普通鉄道JR（11）。事業者種別: JR在来線（2）。

大白川
type: Concept
alternative label: 大白川（東日本旅客鉄道 只見線）
broader: g001537
in scheme: scheme
notation: 001537
scope note: 運営会社: 東日本旅客鉄道。路線名: 只見線。鉄道区分: 普通鉄道JR（11）。事業者種別: JR在来線（2）。

安田
type: Concept
alternative label: 安田（東日本旅客鉄道 信越線）
broader: g001538
in scheme: scheme
notation: 001538
scope note: 運営会社: 東日本旅客鉄道。路線名: 信越線。鉄道区分: 普通鉄道JR（11）。事業者種別: JR在来線（2）。

北条
type: Concept
alternative label: 北条（東日本旅客鉄道 信越線）
broader: g001539
in scheme: scheme
notation: 001539
scope note: 運営会社: 東日本旅客鉄道。路線名: 信越線。鉄道区分: 普通鉄道JR（11）。事業者種別: JR在来線（2）。

笠島
type: Concept
alternative label: 笠島（東日本旅客鉄道 信越線）
broader: g001540
in scheme: scheme
notation: 001540
scope note: 運営会社: 東日本旅客鉄道。路線名: 信越線。鉄道区分: 普通鉄道JR（11）。事業者種別: JR在来線（2）。

芦ノ牧温泉南
type: Concept
alternative label: 芦ノ牧温泉南（会津鉄道 会津線）
broader: g001541
in scheme: scheme
notation: 001541
scope note: 運営会社: 会津鉄道。路線名: 会津線。鉄道区分: 普通鉄道（12）。事業者種別: 第三セクター（5）。

富岡
type: Concept
alternative label: 富岡（東日本旅客鉄道 常磐線）
broader: g001542
in scheme: scheme
notation: 001542
scope note: 運営会社: 東日本旅客鉄道。路線名: 常磐線。鉄道区分: 普通鉄道JR（11）。事業者種別: JR在来線（2）。

磐城守山
type: Concept
alternative label: 磐城守山（東日本旅客鉄道 水郡線）
broader: g001543
in scheme: scheme
notation: 001543
scope note: 運営会社: 東日本旅客鉄道。路線名: 水郡線。鉄道区分: 普通鉄道JR（11）。事業者種別: JR在来線（2）。

神俣
type: Concept
alternative label: 神俣（東日本旅客鉄道 磐越東線）
broader: g001544
in scheme: scheme
notation: 001544
scope note: 運営会社: 東日本旅客鉄道。路線名: 磐越東線。鉄道区分: 普通鉄道JR（11）。事業者種別: JR在来線（2）。

越後須原
type: Concept
alternative label: 越後須原（東日本旅客鉄道 只見線）
broader: g001545
in scheme: scheme
notation: 001545
scope note: 運営会社: 東日本旅客鉄道。路線名: 只見線。鉄道区分: 普通鉄道JR（11）。事業者種別: JR在来線（2）。

米山
type: Concept
alternative label: 米山（東日本旅客鉄道 信越線）
broader: g001546
in scheme: scheme
notation: 001546
scope note: 運営会社: 東日本旅客鉄道。路線名: 信越線。鉄道区分: 普通鉄道JR（11）。事業者種別: JR在来線（2）。

谷田川
type: Concept
alternative label: 谷田川（東日本旅客鉄道 水郡線）
broader: g001547
in scheme: scheme
notation: 001547
scope note: 運営会社: 東日本旅客鉄道。路線名: 水郡線。鉄道区分: 普通鉄道JR（11）。事業者種別: JR在来線（2）。

小千谷
type: Concept
alternative label: 小千谷（東日本旅客鉄道 上越線）
broader: g001548
in scheme: scheme
notation: 001548
scope note: 運営会社: 東日本旅客鉄道。路線名: 上越線。鉄道区分: 普通鉄道JR（11）。事業者種別: JR在来線（2）。

湯野上温泉
type: Concept
alternative label: 湯野上温泉（会津鉄道 会津線）
broader: g001549
in scheme: scheme
notation: 001549
scope note: 運営会社: 会津鉄道。路線名: 会津線。鉄道区分: 普通鉄道（12）。事業者種別: 第三セクター（5）。

須賀川
type: Concept
alternative label: 須賀川（東日本旅客鉄道 東北線）
broader: g001550
in scheme: scheme
notation: 001550
scope note: 運営会社: 東日本旅客鉄道。路線名: 東北線。鉄道区分: 普通鉄道JR（11）。事業者種別: JR在来線（2）。

小塩江
type: Concept
alternative label: 小塩江（東日本旅客鉄道 水郡線）
broader: g001551
in scheme: scheme
notation: 001551
scope note: 運営会社: 東日本旅客鉄道。路線名: 水郡線。鉄道区分: 普通鉄道JR（11）。事業者種別: JR在来線（2）。

魚沼田中
type: Concept
alternative label: 魚沼田中（東日本旅客鉄道 只見線）
broader: g001552
in scheme: scheme
notation: 001552
scope note: 運営会社: 東日本旅客鉄道。路線名: 只見線。鉄道区分: 普通鉄道JR（11）。事業者種別: JR在来線（2）。

竜田
type: Concept
alternative label: 竜田（東日本旅客鉄道 常磐線）
broader: g001553
in scheme: scheme
notation: 001553
scope note: 運営会社: 東日本旅客鉄道。路線名: 常磐線。鉄道区分: 普通鉄道JR（11）。事業者種別: JR在来線（2）。

柿崎
type: Concept
alternative label: 柿崎（東日本旅客鉄道 信越線）
broader: g001554
in scheme: scheme
notation: 001554
scope note: 運営会社: 東日本旅客鉄道。路線名: 信越線。鉄道区分: 普通鉄道JR（11）。事業者種別: JR在来線（2）。

小野新町
type: Concept
alternative label: 小野新町（東日本旅客鉄道 磐越東線）
broader: g001555
in scheme: scheme
notation: 001555
scope note: 運営会社: 東日本旅客鉄道。路線名: 磐越東線。鉄道区分: 普通鉄道JR（11）。事業者種別: JR在来線（2）。

塔のへつり
type: Concept
alternative label: 塔のへつり（会津鉄道 会津線）
broader: g001556
in scheme: scheme
notation: 001556
scope note: 運営会社: 会津鉄道。路線名: 会津線。鉄道区分: 普通鉄道（12）。事業者種別: 第三セクター（5）。

越後広瀬
type: Concept
alternative label: 越後広瀬（東日本旅客鉄道 只見線）
broader: g001557
in scheme: scheme
notation: 001557
scope note: 運営会社: 東日本旅客鉄道。路線名: 只見線。鉄道区分: 普通鉄道JR（11）。事業者種別: JR在来線（2）。

越後川口
type: Concept
alternative label: 越後川口（東日本旅客鉄道 上越線）
broader: g001558
in scheme: scheme
notation: 001558
scope note: 運営会社: 東日本旅客鉄道。路線名: 上越線。鉄道区分: 普通鉄道JR（11）。事業者種別: JR在来線（2）。

越後川口
type: Concept
alternative label: 越後川口（東日本旅客鉄道 飯山線）
broader: g001558
in scheme: scheme
notation: 001559
scope note: 運営会社: 東日本旅客鉄道。路線名: 飯山線。鉄道区分: 普通鉄道JR（11）。事業者種別: JR在来線（2）。

川東
type: Concept
alternative label: 川東（東日本旅客鉄道 水郡線）
broader: g001560
in scheme: scheme
notation: 001560
scope note: 運営会社: 東日本旅客鉄道。路線名: 水郡線。鉄道区分: 普通鉄道JR（11）。事業者種別: JR在来線（2）。

弥五島
type: Concept
alternative label: 弥五島（会津鉄道 会津線）
broader: g001561
in scheme: scheme
notation: 001561
scope note: 運営会社: 会津鉄道。路線名: 会津線。鉄道区分: 普通鉄道（12）。事業者種別: 第三セクター（5）。

木戸
type: Concept
alternative label: 木戸（東日本旅客鉄道 常磐線）
broader: g001562
in scheme: scheme
notation: 001562
scope note: 運営会社: 東日本旅客鉄道。路線名: 常磐線。鉄道区分: 普通鉄道JR（11）。事業者種別: JR在来線（2）。

藪神
type: Concept
alternative label: 藪神（東日本旅客鉄道 只見線）
broader: g001563
in scheme: scheme
notation: 001563
scope note: 運営会社: 東日本旅客鉄道。路線名: 只見線。鉄道区分: 普通鉄道JR（11）。事業者種別: JR在来線（2）。

北堀之内
type: Concept
alternative label: 北堀之内（東日本旅客鉄道 上越線）
broader: g001564
in scheme: scheme
notation: 001564
scope note: 運営会社: 東日本旅客鉄道。路線名: 上越線。鉄道区分: 普通鉄道JR（11）。事業者種別: JR在来線（2）。

会津下郷
type: Concept
alternative label: 会津下郷（会津鉄道 会津線）
broader: g001565
in scheme: scheme
notation: 001565
scope note: 運営会社: 会津鉄道。路線名: 会津線。鉄道区分: 普通鉄道（12）。事業者種別: 第三セクター（5）。

夏井
type: Concept
alternative label: 夏井（東日本旅客鉄道 磐越東線）
broader: g001566
in scheme: scheme
notation: 001566
scope note: 運営会社: 東日本旅客鉄道。路線名: 磐越東線。鉄道区分: 普通鉄道JR（11）。事業者種別: JR在来線（2）。

上下浜
type: Concept
alternative label: 上下浜（東日本旅客鉄道 信越線）
broader: g001567
in scheme: scheme
notation: 001567
scope note: 運営会社: 東日本旅客鉄道。路線名: 信越線。鉄道区分: 普通鉄道JR（11）。事業者種別: JR在来線（2）。

鏡石
type: Concept
alternative label: 鏡石（東日本旅客鉄道 東北線）
broader: g001568
in scheme: scheme
notation: 001568
scope note: 運営会社: 東日本旅客鉄道。路線名: 東北線。鉄道区分: 普通鉄道JR（11）。事業者種別: JR在来線（2）。

内ヶ巻
type: Concept
alternative label: 内ヶ巻（東日本旅客鉄道 飯山線）
broader: g001569
in scheme: scheme
notation: 001569
scope note: 運営会社: 東日本旅客鉄道。路線名: 飯山線。鉄道区分: 普通鉄道JR（11）。事業者種別: JR在来線（2）。

ふるさと公園
type: Concept
alternative label: ふるさと公園（会津鉄道 会津線）
broader: g001570
in scheme: scheme
notation: 001570
scope note: 運営会社: 会津鉄道。路線名: 会津線。鉄道区分: 普通鉄道（12）。事業者種別: 第三セクター（5）。

Jヴィレッジ
type: Concept
alternative label: Jヴィレッジ（東日本旅客鉄道 常磐線）
broader: g001571
in scheme: scheme
notation: 001571
scope note: 運営会社: 東日本旅客鉄道。路線名: 常磐線。鉄道区分: 普通鉄道JR（11）。事業者種別: JR在来線（2）。

越後岩沢
type: Concept
alternative label: 越後岩沢（東日本旅客鉄道 飯山線）
broader: g001572
in scheme: scheme
notation: 001572
scope note: 運営会社: 東日本旅客鉄道。路線名: 飯山線。鉄道区分: 普通鉄道JR（11）。事業者種別: JR在来線（2）。

越後堀之内
type: Concept
alternative label: 越後堀之内（東日本旅客鉄道 上越線）
broader: g001573
in scheme: scheme
notation: 001573
scope note: 運営会社: 東日本旅客鉄道。路線名: 上越線。鉄道区分: 普通鉄道JR（11）。事業者種別: JR在来線（2）。

潟町
type: Concept
alternative label: 潟町（東日本旅客鉄道 信越線）
broader: g001574
in scheme: scheme
notation: 001574
scope note: 運営会社: 東日本旅客鉄道。路線名: 信越線。鉄道区分: 普通鉄道JR（11）。事業者種別: JR在来線（2）。

小出
type: Concept
alternative label: 小出（東日本旅客鉄道 上越線）
broader: g001575
in scheme: scheme
notation: 001575
scope note: 運営会社: 東日本旅客鉄道。路線名: 上越線。鉄道区分: 普通鉄道JR（11）。事業者種別: JR在来線（2）。

小出
type: Concept
alternative label: 小出（東日本旅客鉄道 只見線）
broader: g001575
in scheme: scheme
notation: 001576
scope note: 運営会社: 東日本旅客鉄道。路線名: 只見線。鉄道区分: 普通鉄道JR（11）。事業者種別: JR在来線（2）。

穴水
type: Concept
alternative label: 穴水（のと鉄道 七尾線）
broader: g001577
in scheme: scheme
notation: 001577
scope note: 運営会社: のと鉄道。路線名: 七尾線。鉄道区分: 普通鉄道（12）。事業者種別: 第三セクター（5）。

養鱒公園
type: Concept
alternative label: 養鱒公園（会津鉄道 会津線）
broader: g001578
in scheme: scheme
notation: 001578
scope note: 運営会社: 会津鉄道。路線名: 会津線。鉄道区分: 普通鉄道（12）。事業者種別: 第三セクター（5）。

土底浜
type: Concept
alternative label: 土底浜（東日本旅客鉄道 信越線）
broader: g001579
in scheme: scheme
notation: 001579
scope note: 運営会社: 東日本旅客鉄道。路線名: 信越線。鉄道区分: 普通鉄道JR（11）。事業者種別: JR在来線（2）。

会津長野
type: Concept
alternative label: 会津長野（会津鉄道 会津線）
broader: g001580
in scheme: scheme
notation: 001580
scope note: 運営会社: 会津鉄道。路線名: 会津線。鉄道区分: 普通鉄道（12）。事業者種別: 第三セクター（5）。

泉郷
type: Concept
alternative label: 泉郷（東日本旅客鉄道 水郡線）
broader: g001581
in scheme: scheme
notation: 001581
scope note: 運営会社: 東日本旅客鉄道。路線名: 水郡線。鉄道区分: 普通鉄道JR（11）。事業者種別: JR在来線（2）。

広野
type: Concept
alternative label: 広野（東日本旅客鉄道 常磐線）
broader: g001582
in scheme: scheme
notation: 001582
scope note: 運営会社: 東日本旅客鉄道。路線名: 常磐線。鉄道区分: 普通鉄道JR（11）。事業者種別: JR在来線（2）。

犀潟
type: Concept
alternative label: 犀潟（東日本旅客鉄道 信越線）
broader: g001583
in scheme: scheme
notation: 001583
scope note: 運営会社: 東日本旅客鉄道。路線名: 信越線。鉄道区分: 普通鉄道JR（11）。事業者種別: JR在来線（2）。

犀潟
type: Concept
alternative label: 犀潟（北越急行 ほくほく線）
broader: g001583
in scheme: scheme
notation: 001584
scope note: 運営会社: 北越急行。路線名: ほくほく線。鉄道区分: 普通鉄道（12）。事業者種別: 第三セクター（5）。

田島高校前
type: Concept
alternative label: 田島高校前（会津鉄道 会津線）
broader: g001585
in scheme: scheme
notation: 001585
scope note: 運営会社: 会津鉄道。路線名: 会津線。鉄道区分: 普通鉄道（12）。事業者種別: 第三セクター（5）。

矢吹
type: Concept
alternative label: 矢吹（東日本旅客鉄道 東北線）
broader: g001586
in scheme: scheme
notation: 001586
scope note: 運営会社: 東日本旅客鉄道。路線名: 東北線。鉄道区分: 普通鉄道JR（11）。事業者種別: JR在来線（2）。

川前
type: Concept
alternative label: 川前（東日本旅客鉄道 磐越東線）
broader: g001587
in scheme: scheme
notation: 001587
scope note: 運営会社: 東日本旅客鉄道。路線名: 磐越東線。鉄道区分: 普通鉄道JR（11）。事業者種別: JR在来線（2）。

会津田島
type: Concept
alternative label: 会津田島（会津鉄道 会津線）
broader: g001588
in scheme: scheme
notation: 001588
scope note: 運営会社: 会津鉄道。路線名: 会津線。鉄道区分: 普通鉄道（12）。事業者種別: 第三セクター（5）。

下条
type: Concept
alternative label: 下条（東日本旅客鉄道 飯山線）
broader: g001589
in scheme: scheme
notation: 001589
scope note: 運営会社: 東日本旅客鉄道。路線名: 飯山線。鉄道区分: 普通鉄道JR（11）。事業者種別: JR在来線（2）。

くびき
type: Concept
alternative label: くびき（北越急行 ほくほく線）
broader: g001590
in scheme: scheme
notation: 001590
scope note: 運営会社: 北越急行。路線名: ほくほく線。鉄道区分: 普通鉄道（12）。事業者種別: 第三セクター（5）。

川辺沖
type: Concept
alternative label: 川辺沖（東日本旅客鉄道 水郡線）
broader: g001591
in scheme: scheme
notation: 001591
scope note: 運営会社: 東日本旅客鉄道。路線名: 水郡線。鉄道区分: 普通鉄道JR（11）。事業者種別: JR在来線（2）。

八色
type: Concept
alternative label: 八色（東日本旅客鉄道 上越線）
broader: g001592
in scheme: scheme
notation: 001592
scope note: 運営会社: 東日本旅客鉄道。路線名: 上越線。鉄道区分: 普通鉄道JR（11）。事業者種別: JR在来線（2）。

大池いこいの森
type: Concept
alternative label: 大池いこいの森（北越急行 ほくほく線）
broader: g001593
in scheme: scheme
notation: 001593
scope note: 運営会社: 北越急行。路線名: ほくほく線。鉄道区分: 普通鉄道（12）。事業者種別: 第三セクター（5）。

黒井
type: Concept
alternative label: 黒井（東日本旅客鉄道 信越線）
broader: g001594
in scheme: scheme
notation: 001594
scope note: 運営会社: 東日本旅客鉄道。路線名: 信越線。鉄道区分: 普通鉄道JR（11）。事業者種別: JR在来線（2）。

中荒井
type: Concept
alternative label: 中荒井（会津鉄道 会津線）
broader: g001595
in scheme: scheme
notation: 001595
scope note: 運営会社: 会津鉄道。路線名: 会津線。鉄道区分: 普通鉄道（12）。事業者種別: 第三セクター（5）。

能登鹿島
type: Concept
alternative label: 能登鹿島（のと鉄道 七尾線）
broader: g001596
in scheme: scheme
notation: 001596
scope note: 運営会社: のと鉄道。路線名: 七尾線。鉄道区分: 普通鉄道（12）。事業者種別: 第三セクター（5）。

江田
type: Concept
alternative label: 江田（東日本旅客鉄道 磐越東線）
broader: g001597
in scheme: scheme
notation: 001597
scope note: 運営会社: 東日本旅客鉄道。路線名: 磐越東線。鉄道区分: 普通鉄道JR（11）。事業者種別: JR在来線（2）。

野木沢
type: Concept
alternative label: 野木沢（東日本旅客鉄道 水郡線）
broader: g001598
in scheme: scheme
notation: 001598
scope note: 運営会社: 東日本旅客鉄道。路線名: 水郡線。鉄道区分: 普通鉄道JR（11）。事業者種別: JR在来線（2）。

末続
type: Concept
alternative label: 末続（東日本旅客鉄道 常磐線）
broader: g001599
in scheme: scheme
notation: 001599
scope note: 運営会社: 東日本旅客鉄道。路線名: 常磐線。鉄道区分: 普通鉄道JR（11）。事業者種別: JR在来線（2）。

直江津
type: Concept
alternative label: 直江津（東日本旅客鉄道 信越線）
broader: g001600
in scheme: scheme
notation: 001600
scope note: 運営会社: 東日本旅客鉄道。路線名: 信越線。鉄道区分: 普通鉄道JR（11）。事業者種別: JR在来線（2）。

直江津
type: Concept
alternative label: 直江津（えちごトキめき鉄道 日本海ひすいライン）
broader: g001600
in scheme: scheme
notation: 001601
scope note: 運営会社: えちごトキめき鉄道。路線名: 日本海ひすいライン。鉄道区分: 普通鉄道（12）。事業者種別: 第三セクター（5）。

直江津
type: Concept
alternative label: 直江津（えちごトキめき鉄道 妙高はねうまライン）
broader: g001600
in scheme: scheme
notation: 001602
scope note: 運営会社: えちごトキめき鉄道。路線名: 妙高はねうまライン。鉄道区分: 普通鉄道（12）。事業者種別: 第三セクター（5）。

浦佐
type: Concept
alternative label: 浦佐（東日本旅客鉄道 上越新幹線）
broader: g001603
in scheme: scheme
notation: 001603
scope note: 運営会社: 東日本旅客鉄道。路線名: 上越新幹線。鉄道区分: 普通鉄道JR（11）。事業者種別: JRの新幹線（1）。

浦佐
type: Concept
alternative label: 浦佐（東日本旅客鉄道 上越線）
broader: g001603
in scheme: scheme
notation: 001604
scope note: 運営会社: 東日本旅客鉄道。路線名: 上越線。鉄道区分: 普通鉄道JR（11）。事業者種別: JR在来線（2）。

有間川
type: Concept
alternative label: 有間川（えちごトキめき鉄道 日本海ひすいライン）
broader: g001605
in scheme: scheme
notation: 001605
scope note: 運営会社: えちごトキめき鉄道。路線名: 日本海ひすいライン。鉄道区分: 普通鉄道（12）。事業者種別: 第三セクター（5）。

谷浜
type: Concept
alternative label: 谷浜（えちごトキめき鉄道 日本海ひすいライン）
broader: g001606
in scheme: scheme
notation: 001606
scope note: 運営会社: えちごトキめき鉄道。路線名: 日本海ひすいライン。鉄道区分: 普通鉄道（12）。事業者種別: 第三セクター（5）。

魚沼中条
type: Concept
alternative label: 魚沼中条（東日本旅客鉄道 飯山線）
broader: g001607
in scheme: scheme
notation: 001607
scope note: 運営会社: 東日本旅客鉄道。路線名: 飯山線。鉄道区分: 普通鉄道JR（11）。事業者種別: JR在来線（2）。

うらがわら
type: Concept
alternative label: うらがわら（北越急行 ほくほく線）
broader: g001608
in scheme: scheme
notation: 001608
scope note: 運営会社: 北越急行。路線名: ほくほく線。鉄道区分: 普通鉄道（12）。事業者種別: 第三セクター（5）。

泉崎
type: Concept
alternative label: 泉崎（東日本旅客鉄道 東北線）
broader: g001609
in scheme: scheme
notation: 001609
scope note: 運営会社: 東日本旅客鉄道。路線名: 東北線。鉄道区分: 普通鉄道JR（11）。事業者種別: JR在来線（2）。

名立
type: Concept
alternative label: 名立（えちごトキめき鉄道 日本海ひすいライン）
broader: g001610
in scheme: scheme
notation: 001610
scope note: 運営会社: えちごトキめき鉄道。路線名: 日本海ひすいライン。鉄道区分: 普通鉄道（12）。事業者種別: 第三セクター（5）。

虫川大杉
type: Concept
alternative label: 虫川大杉（北越急行 ほくほく線）
broader: g001611
in scheme: scheme
notation: 001611
scope note: 運営会社: 北越急行。路線名: ほくほく線。鉄道区分: 普通鉄道（12）。事業者種別: 第三セクター（5）。

会津荒海
type: Concept
alternative label: 会津荒海（会津鉄道 会津線）
broader: g001612
in scheme: scheme
notation: 001612
scope note: 運営会社: 会津鉄道。路線名: 会津線。鉄道区分: 普通鉄道（12）。事業者種別: 第三セクター（5）。

春日山
type: Concept
alternative label: 春日山（えちごトキめき鉄道 妙高はねうまライン）
broader: g001613
in scheme: scheme
notation: 001613
scope note: 運営会社: えちごトキめき鉄道。路線名: 妙高はねうまライン。鉄道区分: 普通鉄道（12）。事業者種別: 第三セクター（5）。

西岸
type: Concept
alternative label: 西岸（のと鉄道 七尾線）
broader: g001614
in scheme: scheme
notation: 001614
scope note: 運営会社: のと鉄道。路線名: 七尾線。鉄道区分: 普通鉄道（12）。事業者種別: 第三セクター（5）。

ほくほく大島
type: Concept
alternative label: ほくほく大島（北越急行 ほくほく線）
broader: g001615
in scheme: scheme
notation: 001615
scope note: 運営会社: 北越急行。路線名: ほくほく線。鉄道区分: 普通鉄道（12）。事業者種別: 第三セクター（5）。

会津山村道場
type: Concept
alternative label: 会津山村道場（会津鉄道 会津線）
broader: g001616
in scheme: scheme
notation: 001616
scope note: 運営会社: 会津鉄道。路線名: 会津線。鉄道区分: 普通鉄道（12）。事業者種別: 第三セクター（5）。

久ノ浜
type: Concept
alternative label: 久ノ浜（東日本旅客鉄道 常磐線）
broader: g001617
in scheme: scheme
notation: 001617
scope note: 運営会社: 東日本旅客鉄道。路線名: 常磐線。鉄道区分: 普通鉄道JR（11）。事業者種別: JR在来線（2）。

磐城石川
type: Concept
alternative label: 磐城石川（東日本旅客鉄道 水郡線）
broader: g001618
in scheme: scheme
notation: 001618
scope note: 運営会社: 東日本旅客鉄道。路線名: 水郡線。鉄道区分: 普通鉄道JR（11）。事業者種別: JR在来線（2）。

しんざ
type: Concept
alternative label: しんざ（北越急行 ほくほく線）
broader: g001619
in scheme: scheme
notation: 001619
scope note: 運営会社: 北越急行。路線名: ほくほく線。鉄道区分: 普通鉄道（12）。事業者種別: 第三セクター（5）。

久田野
type: Concept
alternative label: 久田野（東日本旅客鉄道 東北線）
broader: g001620
in scheme: scheme
notation: 001620
scope note: 運営会社: 東日本旅客鉄道。路線名: 東北線。鉄道区分: 普通鉄道JR（11）。事業者種別: JR在来線（2）。

十日町
type: Concept
alternative label: 十日町（東日本旅客鉄道 飯山線）
broader: g001621
in scheme: scheme
notation: 001621
scope note: 運営会社: 東日本旅客鉄道。路線名: 飯山線。鉄道区分: 普通鉄道JR（11）。事業者種別: JR在来線（2）。

十日町
type: Concept
alternative label: 十日町（北越急行 ほくほく線）
broader: g001621
in scheme: scheme
notation: 001622
scope note: 運営会社: 北越急行。路線名: ほくほく線。鉄道区分: 普通鉄道（12）。事業者種別: 第三セクター（5）。

まつだい
type: Concept
alternative label: まつだい（北越急行 ほくほく線）
broader: g001623
in scheme: scheme
notation: 001623
scope note: 運営会社: 北越急行。路線名: ほくほく線。鉄道区分: 普通鉄道（12）。事業者種別: 第三セクター（5）。

美佐島
type: Concept
alternative label: 美佐島（北越急行 ほくほく線）
broader: g001624
in scheme: scheme
notation: 001624
scope note: 運営会社: 北越急行。路線名: ほくほく線。鉄道区分: 普通鉄道（12）。事業者種別: 第三セクター（5）。

白河
type: Concept
alternative label: 白河（東日本旅客鉄道 東北線）
broader: g001625
in scheme: scheme
notation: 001625
scope note: 運営会社: 東日本旅客鉄道。路線名: 東北線。鉄道区分: 普通鉄道JR（11）。事業者種別: JR在来線（2）。

筒石
type: Concept
alternative label: 筒石（えちごトキめき鉄道 日本海ひすいライン）
broader: g001626
in scheme: scheme
notation: 001626
scope note: 運営会社: えちごトキめき鉄道。路線名: 日本海ひすいライン。鉄道区分: 普通鉄道（12）。事業者種別: 第三セクター（5）。

小川郷
type: Concept
alternative label: 小川郷（東日本旅客鉄道 磐越東線）
broader: g001627
in scheme: scheme
notation: 001627
scope note: 運営会社: 東日本旅客鉄道。路線名: 磐越東線。鉄道区分: 普通鉄道JR（11）。事業者種別: JR在来線（2）。

七ヶ岳登山口
type: Concept
alternative label: 七ヶ岳登山口（会津鉄道 会津線）
broader: g001628
in scheme: scheme
notation: 001628
scope note: 運営会社: 会津鉄道。路線名: 会津線。鉄道区分: 普通鉄道（12）。事業者種別: 第三セクター（5）。

新白河
type: Concept
alternative label: 新白河（東日本旅客鉄道 東北新幹線）
broader: g001629
in scheme: scheme
notation: 001629
scope note: 運営会社: 東日本旅客鉄道。路線名: 東北新幹線。鉄道区分: 普通鉄道JR（11）。事業者種別: JRの新幹線（1）。

新白河
type: Concept
alternative label: 新白河（東日本旅客鉄道 東北線）
broader: g001629
in scheme: scheme
notation: 001630
scope note: 運営会社: 東日本旅客鉄道。路線名: 東北線。鉄道区分: 普通鉄道JR（11）。事業者種別: JR在来線（2）。

五日町
type: Concept
alternative label: 五日町（東日本旅客鉄道 上越線）
broader: g001631
in scheme: scheme
notation: 001631
scope note: 運営会社: 東日本旅客鉄道。路線名: 上越線。鉄道区分: 普通鉄道JR（11）。事業者種別: JR在来線（2）。

高田
type: Concept
alternative label: 高田（えちごトキめき鉄道 妙高はねうまライン）
broader: g001632
in scheme: scheme
notation: 001632
scope note: 運営会社: えちごトキめき鉄道。路線名: 妙高はねうまライン。鉄道区分: 普通鉄道（12）。事業者種別: 第三セクター（5）。

能登中島
type: Concept
alternative label: 能登中島（のと鉄道 七尾線）
broader: g001633
in scheme: scheme
notation: 001633
scope note: 運営会社: のと鉄道。路線名: 七尾線。鉄道区分: 普通鉄道（12）。事業者種別: 第三セクター（5）。

里白石
type: Concept
alternative label: 里白石（東日本旅客鉄道 水郡線）
broader: g001634
in scheme: scheme
notation: 001634
scope note: 運営会社: 東日本旅客鉄道。路線名: 水郡線。鉄道区分: 普通鉄道JR（11）。事業者種別: JR在来線（2）。

四ツ倉
type: Concept
alternative label: 四ツ倉（東日本旅客鉄道 常磐線）
broader: g001635
in scheme: scheme
notation: 001635
scope note: 運営会社: 東日本旅客鉄道。路線名: 常磐線。鉄道区分: 普通鉄道JR（11）。事業者種別: JR在来線（2）。

土市
type: Concept
alternative label: 土市（東日本旅客鉄道 飯山線）
broader: g001636
in scheme: scheme
notation: 001636
scope note: 運営会社: 東日本旅客鉄道。路線名: 飯山線。鉄道区分: 普通鉄道JR（11）。事業者種別: JR在来線（2）。

南高田
type: Concept
alternative label: 南高田（えちごトキめき鉄道 妙高はねうまライン）
broader: g001637
in scheme: scheme
notation: 001637
scope note: 運営会社: えちごトキめき鉄道。路線名: 妙高はねうまライン。鉄道区分: 普通鉄道（12）。事業者種別: 第三セクター（5）。

魚沼丘陵
type: Concept
alternative label: 魚沼丘陵（北越急行 ほくほく線）
broader: g001638
in scheme: scheme
notation: 001638
scope note: 運営会社: 北越急行。路線名: ほくほく線。鉄道区分: 普通鉄道（12）。事業者種別: 第三セクター（5）。

能生
type: Concept
alternative label: 能生（えちごトキめき鉄道 日本海ひすいライン）
broader: g001639
in scheme: scheme
notation: 001639
scope note: 運営会社: えちごトキめき鉄道。路線名: 日本海ひすいライン。鉄道区分: 普通鉄道（12）。事業者種別: 第三セクター（5）。

白坂
type: Concept
alternative label: 白坂（東日本旅客鉄道 東北線）
broader: g001640
in scheme: scheme
notation: 001640
scope note: 運営会社: 東日本旅客鉄道。路線名: 東北線。鉄道区分: 普通鉄道JR（11）。事業者種別: JR在来線（2）。

会津高原尾瀬口
type: Concept
alternative label: 会津高原尾瀬口（野岩鉄道 会津鬼怒川線）
broader: g001641
in scheme: scheme
notation: 001641
scope note: 運営会社: 野岩鉄道。路線名: 会津鬼怒川線。鉄道区分: 普通鉄道（12）。事業者種別: 第三セクター（5）。

会津高原尾瀬口
type: Concept
alternative label: 会津高原尾瀬口（会津鉄道 会津線）
broader: g001641
in scheme: scheme
notation: 001642
scope note: 運営会社: 会津鉄道。路線名: 会津線。鉄道区分: 普通鉄道（12）。事業者種別: 第三セクター（5）。

上越妙高
type: Concept
alternative label: 上越妙高（西日本旅客鉄道 北陸新幹線）
broader: g001643
in scheme: scheme
notation: 001643
scope note: 運営会社: 西日本旅客鉄道。路線名: 北陸新幹線。鉄道区分: 普通鉄道JR（11）。事業者種別: JRの新幹線（1）。

上越妙高
type: Concept
alternative label: 上越妙高（東日本旅客鉄道 北陸新幹線）
broader: g001643
in scheme: scheme
notation: 001644
scope note: 運営会社: 東日本旅客鉄道。路線名: 北陸新幹線。鉄道区分: 普通鉄道JR（11）。事業者種別: JRの新幹線（1）。

上越妙高
type: Concept
alternative label: 上越妙高（えちごトキめき鉄道 妙高はねうまライン）
broader: g001643
in scheme: scheme
notation: 001645
scope note: 運営会社: えちごトキめき鉄道。路線名: 妙高はねうまライン。鉄道区分: 普通鉄道（12）。事業者種別: 第三セクター（5）。

赤井
type: Concept
alternative label: 赤井（東日本旅客鉄道 磐越東線）
broader: g001646
in scheme: scheme
notation: 001646
scope note: 運営会社: 東日本旅客鉄道。路線名: 磐越東線。鉄道区分: 普通鉄道JR（11）。事業者種別: JR在来線（2）。

磐城浅川
type: Concept
alternative label: 磐城浅川（東日本旅客鉄道 水郡線）
broader: g001647
in scheme: scheme
notation: 001647
scope note: 運営会社: 東日本旅客鉄道。路線名: 水郡線。鉄道区分: 普通鉄道JR（11）。事業者種別: JR在来線（2）。

笠師保
type: Concept
alternative label: 笠師保（のと鉄道 七尾線）
broader: g001648
in scheme: scheme
notation: 001648
scope note: 運営会社: のと鉄道。路線名: 七尾線。鉄道区分: 普通鉄道（12）。事業者種別: 第三セクター（5）。

和倉温泉
type: Concept
alternative label: 和倉温泉（西日本旅客鉄道 七尾線）
broader: g001649
in scheme: scheme
notation: 001649
scope note: 運営会社: 西日本旅客鉄道。路線名: 七尾線。鉄道区分: 普通鉄道JR（11）。事業者種別: JR在来線（2）。

和倉温泉
type: Concept
alternative label: 和倉温泉（のと鉄道 七尾線）
broader: g001649
in scheme: scheme
notation: 001650
scope note: 運営会社: のと鉄道。路線名: 七尾線。鉄道区分: 普通鉄道（12）。事業者種別: 第三セクター（5）。

越後水沢
type: Concept
alternative label: 越後水沢（東日本旅客鉄道 飯山線）
broader: g001651
in scheme: scheme
notation: 001651
scope note: 運営会社: 東日本旅客鉄道。路線名: 飯山線。鉄道区分: 普通鉄道JR（11）。事業者種別: JR在来線（2）。

浦本
type: Concept
alternative label: 浦本（えちごトキめき鉄道 日本海ひすいライン）
broader: g001652
in scheme: scheme
notation: 001652
scope note: 運営会社: えちごトキめき鉄道。路線名: 日本海ひすいライン。鉄道区分: 普通鉄道（12）。事業者種別: 第三セクター（5）。

草野
type: Concept
alternative label: 草野（東日本旅客鉄道 常磐線）
broader: g001653
in scheme: scheme
notation: 001653
scope note: 運営会社: 東日本旅客鉄道。路線名: 常磐線。鉄道区分: 普通鉄道JR（11）。事業者種別: JR在来線（2）。

六日町
type: Concept
alternative label: 六日町（北越急行 ほくほく線）
broader: g001654
in scheme: scheme
notation: 001654
scope note: 運営会社: 北越急行。路線名: ほくほく線。鉄道区分: 普通鉄道（12）。事業者種別: 第三セクター（5）。

六日町
type: Concept
alternative label: 六日町（東日本旅客鉄道 上越線）
broader: g001654
in scheme: scheme
notation: 001655
scope note: 運営会社: 東日本旅客鉄道。路線名: 上越線。鉄道区分: 普通鉄道JR（11）。事業者種別: JR在来線（2）。

田鶴浜
type: Concept
alternative label: 田鶴浜（のと鉄道 七尾線）
broader: g001656
in scheme: scheme
notation: 001656
scope note: 運営会社: のと鉄道。路線名: 七尾線。鉄道区分: 普通鉄道（12）。事業者種別: 第三セクター（5）。

いわき
type: Concept
alternative label: いわき（東日本旅客鉄道 常磐線）
broader: g001657
in scheme: scheme
notation: 001657
scope note: 運営会社: 東日本旅客鉄道。路線名: 常磐線。鉄道区分: 普通鉄道JR（11）。事業者種別: JR在来線（2）。

いわき
type: Concept
alternative label: いわき（東日本旅客鉄道 磐越東線）
broader: g001657
in scheme: scheme
notation: 001658
scope note: 運営会社: 東日本旅客鉄道。路線名: 磐越東線。鉄道区分: 普通鉄道JR（11）。事業者種別: JR在来線（2）。

梶屋敷
type: Concept
alternative label: 梶屋敷（えちごトキめき鉄道 日本海ひすいライン）
broader: g001659
in scheme: scheme
notation: 001659
scope note: 運営会社: えちごトキめき鉄道。路線名: 日本海ひすいライン。鉄道区分: 普通鉄道（12）。事業者種別: 第三セクター（5）。

越後田沢
type: Concept
alternative label: 越後田沢（東日本旅客鉄道 飯山線）
broader: g001660
in scheme: scheme
notation: 001660
scope note: 運営会社: 東日本旅客鉄道。路線名: 飯山線。鉄道区分: 普通鉄道JR（11）。事業者種別: JR在来線（2）。

豊原
type: Concept
alternative label: 豊原（東日本旅客鉄道 東北線）
broader: g001661
in scheme: scheme
notation: 001661
scope note: 運営会社: 東日本旅客鉄道。路線名: 東北線。鉄道区分: 普通鉄道JR（11）。事業者種別: JR在来線（2）。

北新井
type: Concept
alternative label: 北新井（えちごトキめき鉄道 妙高はねうまライン）
broader: g001662
in scheme: scheme
notation: 001662
scope note: 運営会社: えちごトキめき鉄道。路線名: 妙高はねうまライン。鉄道区分: 普通鉄道（12）。事業者種別: 第三セクター（5）。

えちご押上ひすい海岸
type: Concept
alternative label: えちご押上ひすい海岸（えちごトキめき鉄道 日本海ひすいライン）
broader: g001663
in scheme: scheme
notation: 001663
scope note: 運営会社: えちごトキめき鉄道。路線名: 日本海ひすいライン。鉄道区分: 普通鉄道（12）。事業者種別: 第三セクター（5）。

越後鹿渡
type: Concept
alternative label: 越後鹿渡（東日本旅客鉄道 飯山線）
broader: g001664
in scheme: scheme
notation: 001664
scope note: 運営会社: 東日本旅客鉄道。路線名: 飯山線。鉄道区分: 普通鉄道JR（11）。事業者種別: JR在来線（2）。

男鹿高原
type: Concept
alternative label: 男鹿高原（野岩鉄道 会津鬼怒川線）
broader: g001665
in scheme: scheme
notation: 001665
scope note: 運営会社: 野岩鉄道。路線名: 会津鬼怒川線。鉄道区分: 普通鉄道（12）。事業者種別: 第三セクター（5）。

糸魚川
type: Concept
alternative label: 糸魚川（西日本旅客鉄道 大糸線）
broader: g001666
in scheme: scheme
notation: 001666
scope note: 運営会社: 西日本旅客鉄道。路線名: 大糸線。鉄道区分: 普通鉄道JR（11）。事業者種別: JR在来線（2）。

糸魚川
type: Concept
alternative label: 糸魚川（えちごトキめき鉄道 日本海ひすいライン）
broader: g001666
in scheme: scheme
notation: 001667
scope note: 運営会社: えちごトキめき鉄道。路線名: 日本海ひすいライン。鉄道区分: 普通鉄道（12）。事業者種別: 第三セクター（5）。

糸魚川
type: Concept
alternative label: 糸魚川（西日本旅客鉄道 北陸新幹線）
broader: g001666
in scheme: scheme
notation: 001668
scope note: 運営会社: 西日本旅客鉄道。路線名: 北陸新幹線。鉄道区分: 普通鉄道JR（11）。事業者種別: JRの新幹線（1）。

七尾
type: Concept
alternative label: 七尾（西日本旅客鉄道 七尾線）
broader: g001669
in scheme: scheme
notation: 001669
scope note: 運営会社: 西日本旅客鉄道。路線名: 七尾線。鉄道区分: 普通鉄道JR（11）。事業者種別: JR在来線（2）。

七尾
type: Concept
alternative label: 七尾（のと鉄道 七尾線）
broader: g001669
in scheme: scheme
notation: 001670
scope note: 運営会社: のと鉄道。路線名: 七尾線。鉄道区分: 普通鉄道（12）。事業者種別: 第三セクター（5）。

塩沢
type: Concept
alternative label: 塩沢（東日本旅客鉄道 上越線）
broader: g001671
in scheme: scheme
notation: 001671
scope note: 運営会社: 東日本旅客鉄道。路線名: 上越線。鉄道区分: 普通鉄道JR（11）。事業者種別: JR在来線（2）。

内郷
type: Concept
alternative label: 内郷（東日本旅客鉄道 常磐線）
broader: g001672
in scheme: scheme
notation: 001672
scope note: 運営会社: 東日本旅客鉄道。路線名: 常磐線。鉄道区分: 普通鉄道JR（11）。事業者種別: JR在来線（2）。

磐城棚倉
type: Concept
alternative label: 磐城棚倉（東日本旅客鉄道 水郡線）
broader: g001673
in scheme: scheme
notation: 001673
scope note: 運営会社: 東日本旅客鉄道。路線名: 水郡線。鉄道区分: 普通鉄道JR（11）。事業者種別: JR在来線（2）。

上越国際スキー場前
type: Concept
alternative label: 上越国際スキー場前（東日本旅客鉄道 上越線）
broader: g001674
in scheme: scheme
notation: 001674
scope note: 運営会社: 東日本旅客鉄道。路線名: 上越線。鉄道区分: 普通鉄道JR（11）。事業者種別: JR在来線（2）。

新井
type: Concept
alternative label: 新井（えちごトキめき鉄道 妙高はねうまライン）
broader: g001675
in scheme: scheme
notation: 001675
scope note: 運営会社: えちごトキめき鉄道。路線名: 妙高はねうまライン。鉄道区分: 普通鉄道（12）。事業者種別: 第三セクター（5）。

黒田原
type: Concept
alternative label: 黒田原（東日本旅客鉄道 東北線）
broader: g001676
in scheme: scheme
notation: 001676
scope note: 運営会社: 東日本旅客鉄道。路線名: 東北線。鉄道区分: 普通鉄道JR（11）。事業者種別: JR在来線（2）。

津南
type: Concept
alternative label: 津南（東日本旅客鉄道 飯山線）
broader: g001677
in scheme: scheme
notation: 001677
scope note: 運営会社: 東日本旅客鉄道。路線名: 飯山線。鉄道区分: 普通鉄道JR（11）。事業者種別: JR在来線（2）。

青海
type: Concept
alternative label: 青海（えちごトキめき鉄道 日本海ひすいライン）
broader: g001678
in scheme: scheme
notation: 001678
scope note: 運営会社: えちごトキめき鉄道。路線名: 日本海ひすいライン。鉄道区分: 普通鉄道（12）。事業者種別: 第三セクター（5）。

中豊
type: Concept
alternative label: 中豊（東日本旅客鉄道 水郡線）
broader: g001679
in scheme: scheme
notation: 001679
scope note: 運営会社: 東日本旅客鉄道。路線名: 水郡線。鉄道区分: 普通鉄道JR（11）。事業者種別: JR在来線（2）。

大沢
type: Concept
alternative label: 大沢（東日本旅客鉄道 上越線）
broader: g001680
in scheme: scheme
notation: 001680
scope note: 運営会社: 東日本旅客鉄道。路線名: 上越線。鉄道区分: 普通鉄道JR（11）。事業者種別: JR在来線（2）。

姫川
type: Concept
alternative label: 姫川（西日本旅客鉄道 大糸線）
broader: g001681
in scheme: scheme
notation: 001681
scope note: 運営会社: 西日本旅客鉄道。路線名: 大糸線。鉄道区分: 普通鉄道JR（11）。事業者種別: JR在来線（2）。

上三依塩原温泉口
type: Concept
alternative label: 上三依塩原温泉口（野岩鉄道 会津鬼怒川線）
broader: g001682
in scheme: scheme
notation: 001682
scope note: 運営会社: 野岩鉄道。路線名: 会津鬼怒川線。鉄道区分: 普通鉄道（12）。事業者種別: 第三セクター（5）。

徳田
type: Concept
alternative label: 徳田（西日本旅客鉄道 七尾線）
broader: g001683
in scheme: scheme
notation: 001683
scope note: 運営会社: 西日本旅客鉄道。路線名: 七尾線。鉄道区分: 普通鉄道JR（11）。事業者種別: JR在来線（2）。

湯本
type: Concept
alternative label: 湯本（東日本旅客鉄道 常磐線）
broader: g001684
in scheme: scheme
notation: 001684
scope note: 運営会社: 東日本旅客鉄道。路線名: 常磐線。鉄道区分: 普通鉄道JR（11）。事業者種別: JR在来線（2）。

親不知
type: Concept
alternative label: 親不知（えちごトキめき鉄道 日本海ひすいライン）
broader: g001685
in scheme: scheme
notation: 001685
scope note: 運営会社: えちごトキめき鉄道。路線名: 日本海ひすいライン。鉄道区分: 普通鉄道（12）。事業者種別: 第三セクター（5）。

頸城大野
type: Concept
alternative label: 頸城大野（西日本旅客鉄道 大糸線）
broader: g001686
in scheme: scheme
notation: 001686
scope note: 運営会社: 西日本旅客鉄道。路線名: 大糸線。鉄道区分: 普通鉄道JR（11）。事業者種別: JR在来線（2）。

越後田中
type: Concept
alternative label: 越後田中（東日本旅客鉄道 飯山線）
broader: g001687
in scheme: scheme
notation: 001687
scope note: 運営会社: 東日本旅客鉄道。路線名: 飯山線。鉄道区分: 普通鉄道JR（11）。事業者種別: JR在来線（2）。

近津
type: Concept
alternative label: 近津（東日本旅客鉄道 水郡線）
broader: g001688
in scheme: scheme
notation: 001688
scope note: 運営会社: 東日本旅客鉄道。路線名: 水郡線。鉄道区分: 普通鉄道JR（11）。事業者種別: JR在来線（2）。

足滝
type: Concept
alternative label: 足滝（東日本旅客鉄道 飯山線）
broader: g001689
in scheme: scheme
notation: 001689
scope note: 運営会社: 東日本旅客鉄道。路線名: 飯山線。鉄道区分: 普通鉄道JR（11）。事業者種別: JR在来線（2）。

高久
type: Concept
alternative label: 高久（東日本旅客鉄道 東北線）
broader: g001690
in scheme: scheme
notation: 001690
scope note: 運営会社: 東日本旅客鉄道。路線名: 東北線。鉄道区分: 普通鉄道JR（11）。事業者種別: JR在来線（2）。

二本木
type: Concept
alternative label: 二本木（えちごトキめき鉄道 妙高はねうまライン）
broader: g001691
in scheme: scheme
notation: 001691
scope note: 運営会社: えちごトキめき鉄道。路線名: 妙高はねうまライン。鉄道区分: 普通鉄道（12）。事業者種別: 第三セクター（5）。

森宮野原
type: Concept
alternative label: 森宮野原（東日本旅客鉄道 飯山線）
broader: g001692
in scheme: scheme
notation: 001692
scope note: 運営会社: 東日本旅客鉄道。路線名: 飯山線。鉄道区分: 普通鉄道JR（11）。事業者種別: JR在来線（2）。

石打
type: Concept
alternative label: 石打（東日本旅客鉄道 上越線）
broader: g001693
in scheme: scheme
notation: 001693
scope note: 運営会社: 東日本旅客鉄道。路線名: 上越線。鉄道区分: 普通鉄道JR（11）。事業者種別: JR在来線（2）。

平滝
type: Concept
alternative label: 平滝（東日本旅客鉄道 飯山線）
broader: g001694
in scheme: scheme
notation: 001694
scope note: 運営会社: 東日本旅客鉄道。路線名: 飯山線。鉄道区分: 普通鉄道JR（11）。事業者種別: JR在来線（2）。

中三依温泉
type: Concept
alternative label: 中三依温泉（野岩鉄道 会津鬼怒川線）
broader: g001695
in scheme: scheme
notation: 001695
scope note: 運営会社: 野岩鉄道。路線名: 会津鬼怒川線。鉄道区分: 普通鉄道（12）。事業者種別: 第三セクター（5）。

能登二宮
type: Concept
alternative label: 能登二宮（西日本旅客鉄道 七尾線）
broader: g001696
in scheme: scheme
notation: 001696
scope note: 運営会社: 西日本旅客鉄道。路線名: 七尾線。鉄道区分: 普通鉄道JR（11）。事業者種別: JR在来線（2）。

信濃白鳥
type: Concept
alternative label: 信濃白鳥（東日本旅客鉄道 飯山線）
broader: g001697
in scheme: scheme
notation: 001697
scope note: 運営会社: 東日本旅客鉄道。路線名: 飯山線。鉄道区分: 普通鉄道JR（11）。事業者種別: JR在来線（2）。

市振
type: Concept
alternative label: 市振（あいの風とやま鉄道 あいの風とやま鉄道線）
broader: g001698
in scheme: scheme
notation: 001698
scope note: 運営会社: あいの風とやま鉄道。路線名: あいの風とやま鉄道線。鉄道区分: 普通鉄道（12）。事業者種別: 第三セクター（5）。

市振
type: Concept
alternative label: 市振（えちごトキめき鉄道 日本海ひすいライン）
broader: g001698
in scheme: scheme
notation: 001699
scope note: 運営会社: えちごトキめき鉄道。路線名: 日本海ひすいライン。鉄道区分: 普通鉄道（12）。事業者種別: 第三セクター（5）。

横倉
type: Concept
alternative label: 横倉（東日本旅客鉄道 飯山線）
broader: g001700
in scheme: scheme
notation: 001700
scope note: 運営会社: 東日本旅客鉄道。路線名: 飯山線。鉄道区分: 普通鉄道JR（11）。事業者種別: JR在来線（2）。

西大滝
type: Concept
alternative label: 西大滝（東日本旅客鉄道 飯山線）
broader: g001701
in scheme: scheme
notation: 001701
scope note: 運営会社: 東日本旅客鉄道。路線名: 飯山線。鉄道区分: 普通鉄道JR（11）。事業者種別: JR在来線（2）。

良川
type: Concept
alternative label: 良川（西日本旅客鉄道 七尾線）
broader: g001702
in scheme: scheme
notation: 001702
scope note: 運営会社: 西日本旅客鉄道。路線名: 七尾線。鉄道区分: 普通鉄道JR（11）。事業者種別: JR在来線（2）。

桑名川
type: Concept
alternative label: 桑名川（東日本旅客鉄道 飯山線）
broader: g001703
in scheme: scheme
notation: 001703
scope note: 運営会社: 東日本旅客鉄道。路線名: 飯山線。鉄道区分: 普通鉄道JR（11）。事業者種別: JR在来線（2）。

越中宮崎
type: Concept
alternative label: 越中宮崎（あいの風とやま鉄道 あいの風とやま鉄道線）
broader: g001704
in scheme: scheme
notation: 001704
scope note: 運営会社: あいの風とやま鉄道。路線名: あいの風とやま鉄道線。鉄道区分: 普通鉄道（12）。事業者種別: 第三セクター（5）。

黒磯
type: Concept
alternative label: 黒磯（東日本旅客鉄道 東北線）
broader: g001705
in scheme: scheme
notation: 001705
scope note: 運営会社: 東日本旅客鉄道。路線名: 東北線。鉄道区分: 普通鉄道JR（11）。事業者種別: JR在来線（2）。

根知
type: Concept
alternative label: 根知（西日本旅客鉄道 大糸線）
broader: g001706
in scheme: scheme
notation: 001706
scope note: 運営会社: 西日本旅客鉄道。路線名: 大糸線。鉄道区分: 普通鉄道JR（11）。事業者種別: JR在来線（2）。

上桑名川
type: Concept
alternative label: 上桑名川（東日本旅客鉄道 飯山線）
broader: g001707
in scheme: scheme
notation: 001707
scope note: 運営会社: 東日本旅客鉄道。路線名: 飯山線。鉄道区分: 普通鉄道JR（11）。事業者種別: JR在来線（2）。

能登部
type: Concept
alternative label: 能登部（西日本旅客鉄道 七尾線）
broader: g001708
in scheme: scheme
notation: 001708
scope note: 運営会社: 西日本旅客鉄道。路線名: 七尾線。鉄道区分: 普通鉄道JR（11）。事業者種別: JR在来線（2）。

磐城塙
type: Concept
alternative label: 磐城塙（東日本旅客鉄道 水郡線）
broader: g001709
in scheme: scheme
notation: 001709
scope note: 運営会社: 東日本旅客鉄道。路線名: 水郡線。鉄道区分: 普通鉄道JR（11）。事業者種別: JR在来線（2）。

泉
type: Concept
alternative label: 泉（東日本旅客鉄道 常磐線）
broader: g001710
in scheme: scheme
notation: 001710
scope note: 運営会社: 東日本旅客鉄道。路線名: 常磐線。鉄道区分: 普通鉄道JR（11）。事業者種別: JR在来線（2）。

泊
type: Concept
alternative label: 泊（あいの風とやま鉄道 あいの風とやま鉄道線）
broader: g001711
in scheme: scheme
notation: 001711
scope note: 運営会社: あいの風とやま鉄道。路線名: あいの風とやま鉄道線。鉄道区分: 普通鉄道（12）。事業者種別: 第三セクター（5）。

ガーラ湯沢
type: Concept
alternative label: ガーラ湯沢（東日本旅客鉄道 上越線）
broader: g001712
in scheme: scheme
notation: 001712
scope note: 運営会社: 東日本旅客鉄道。路線名: 上越線。鉄道区分: 普通鉄道JR（11）。事業者種別: JR在来線（2）。

金丸
type: Concept
alternative label: 金丸（西日本旅客鉄道 七尾線）
broader: g001713
in scheme: scheme
notation: 001713
scope note: 運営会社: 西日本旅客鉄道。路線名: 七尾線。鉄道区分: 普通鉄道JR（11）。事業者種別: JR在来線（2）。

入善
type: Concept
alternative label: 入善（あいの風とやま鉄道 あいの風とやま鉄道線）
broader: g001714
in scheme: scheme
notation: 001714
scope note: 運営会社: あいの風とやま鉄道。路線名: あいの風とやま鉄道線。鉄道区分: 普通鉄道（12）。事業者種別: 第三セクター（5）。

小滝
type: Concept
alternative label: 小滝（西日本旅客鉄道 大糸線）
broader: g001715
in scheme: scheme
notation: 001715
scope note: 運営会社: 西日本旅客鉄道。路線名: 大糸線。鉄道区分: 普通鉄道JR（11）。事業者種別: JR在来線（2）。

上境
type: Concept
alternative label: 上境（東日本旅客鉄道 飯山線）
broader: g001716
in scheme: scheme
notation: 001716
scope note: 運営会社: 東日本旅客鉄道。路線名: 飯山線。鉄道区分: 普通鉄道JR（11）。事業者種別: JR在来線（2）。

越後湯沢
type: Concept
alternative label: 越後湯沢（東日本旅客鉄道 上越線）
broader: g001717
in scheme: scheme
notation: 001717
scope note: 運営会社: 東日本旅客鉄道。路線名: 上越線。鉄道区分: 普通鉄道JR（11）。事業者種別: JR在来線（2）。

越後湯沢
type: Concept
alternative label: 越後湯沢（東日本旅客鉄道 上越新幹線）
broader: g001717
in scheme: scheme
notation: 001718
scope note: 運営会社: 東日本旅客鉄道。路線名: 上越新幹線。鉄道区分: 普通鉄道JR（11）。事業者種別: JRの新幹線（1）。

関山
type: Concept
alternative label: 関山（えちごトキめき鉄道 妙高はねうまライン）
broader: g001719
in scheme: scheme
notation: 001719
scope note: 運営会社: えちごトキめき鉄道。路線名: 妙高はねうまライン。鉄道区分: 普通鉄道（12）。事業者種別: 第三セクター（5）。

那須塩原
type: Concept
alternative label: 那須塩原（東日本旅客鉄道 東北新幹線）
broader: g001720
in scheme: scheme
notation: 001720
scope note: 運営会社: 東日本旅客鉄道。路線名: 東北新幹線。鉄道区分: 普通鉄道JR（11）。事業者種別: JRの新幹線（1）。

那須塩原
type: Concept
alternative label: 那須塩原（東日本旅客鉄道 東北線）
broader: g001720
in scheme: scheme
notation: 001721
scope note: 運営会社: 東日本旅客鉄道。路線名: 東北線。鉄道区分: 普通鉄道JR（11）。事業者種別: JR在来線（2）。

西入善
type: Concept
alternative label: 西入善（あいの風とやま鉄道 あいの風とやま鉄道線）
broader: g001722
in scheme: scheme
notation: 001722
scope note: 運営会社: あいの風とやま鉄道。路線名: あいの風とやま鉄道線。鉄道区分: 普通鉄道（12）。事業者種別: 第三セクター（5）。

湯西川温泉
type: Concept
alternative label: 湯西川温泉（野岩鉄道 会津鬼怒川線）
broader: g001723
in scheme: scheme
notation: 001723
scope note: 運営会社: 野岩鉄道。路線名: 会津鬼怒川線。鉄道区分: 普通鉄道（12）。事業者種別: 第三セクター（5）。

千路
type: Concept
alternative label: 千路（西日本旅客鉄道 七尾線）
broader: g001724
in scheme: scheme
notation: 001724
scope note: 運営会社: 西日本旅客鉄道。路線名: 七尾線。鉄道区分: 普通鉄道JR（11）。事業者種別: JR在来線（2）。

岩原スキー場前
type: Concept
alternative label: 岩原スキー場前（東日本旅客鉄道 上越線）
broader: g001725
in scheme: scheme
notation: 001725
scope note: 運営会社: 東日本旅客鉄道。路線名: 上越線。鉄道区分: 普通鉄道JR（11）。事業者種別: JR在来線（2）。

植田
type: Concept
alternative label: 植田（東日本旅客鉄道 常磐線）
broader: g001726
in scheme: scheme
notation: 001726
scope note: 運営会社: 東日本旅客鉄道。路線名: 常磐線。鉄道区分: 普通鉄道JR（11）。事業者種別: JR在来線（2）。

戸狩野沢温泉
type: Concept
alternative label: 戸狩野沢温泉（東日本旅客鉄道 飯山線）
broader: g001727
in scheme: scheme
notation: 001727
scope note: 運営会社: 東日本旅客鉄道。路線名: 飯山線。鉄道区分: 普通鉄道JR（11）。事業者種別: JR在来線（2）。

越後中里
type: Concept
alternative label: 越後中里（東日本旅客鉄道 上越線）
broader: g001728
in scheme: scheme
notation: 001728
scope note: 運営会社: 東日本旅客鉄道。路線名: 上越線。鉄道区分: 普通鉄道JR（11）。事業者種別: JR在来線（2）。

生地
type: Concept
alternative label: 生地（あいの風とやま鉄道 あいの風とやま鉄道線）
broader: g001729
in scheme: scheme
notation: 001729
scope note: 運営会社: あいの風とやま鉄道。路線名: あいの風とやま鉄道線。鉄道区分: 普通鉄道（12）。事業者種別: 第三セクター（5）。

磐城石井
type: Concept
alternative label: 磐城石井（東日本旅客鉄道 水郡線）
broader: g001730
in scheme: scheme
notation: 001730
scope note: 運営会社: 東日本旅客鉄道。路線名: 水郡線。鉄道区分: 普通鉄道JR（11）。事業者種別: JR在来線（2）。

羽咋
type: Concept
alternative label: 羽咋（西日本旅客鉄道 七尾線）
broader: g001731
in scheme: scheme
notation: 001731
scope note: 運営会社: 西日本旅客鉄道。路線名: 七尾線。鉄道区分: 普通鉄道JR（11）。事業者種別: JR在来線（2）。

川治湯元
type: Concept
alternative label: 川治湯元（野岩鉄道 会津鬼怒川線）
broader: g001732
in scheme: scheme
notation: 001732
scope note: 運営会社: 野岩鉄道。路線名: 会津鬼怒川線。鉄道区分: 普通鉄道（12）。事業者種別: 第三セクター（5）。

南石井
type: Concept
alternative label: 南石井（東日本旅客鉄道 水郡線）
broader: g001733
in scheme: scheme
notation: 001733
scope note: 運営会社: 東日本旅客鉄道。路線名: 水郡線。鉄道区分: 普通鉄道JR（11）。事業者種別: JR在来線（2）。

平岩
type: Concept
alternative label: 平岩（西日本旅客鉄道 大糸線）
broader: g001734
in scheme: scheme
notation: 001734
scope note: 運営会社: 西日本旅客鉄道。路線名: 大糸線。鉄道区分: 普通鉄道JR（11）。事業者種別: JR在来線（2）。

信濃平
type: Concept
alternative label: 信濃平（東日本旅客鉄道 飯山線）
broader: g001735
in scheme: scheme
notation: 001735
scope note: 運営会社: 東日本旅客鉄道。路線名: 飯山線。鉄道区分: 普通鉄道JR（11）。事業者種別: JR在来線（2）。

川治温泉
type: Concept
alternative label: 川治温泉（野岩鉄道 会津鬼怒川線）
broader: g001736
in scheme: scheme
notation: 001736
scope note: 運営会社: 野岩鉄道。路線名: 会津鬼怒川線。鉄道区分: 普通鉄道（12）。事業者種別: 第三セクター（5）。

西那須野
type: Concept
alternative label: 西那須野（東日本旅客鉄道 東北線）
broader: g001737
in scheme: scheme
notation: 001737
scope note: 運営会社: 東日本旅客鉄道。路線名: 東北線。鉄道区分: 普通鉄道JR（11）。事業者種別: JR在来線（2）。

勿来
type: Concept
alternative label: 勿来（東日本旅客鉄道 常磐線）
broader: g001738
in scheme: scheme
notation: 001738
scope note: 運営会社: 東日本旅客鉄道。路線名: 常磐線。鉄道区分: 普通鉄道JR（11）。事業者種別: JR在来線（2）。

土樽
type: Concept
alternative label: 土樽（東日本旅客鉄道 上越線）
broader: g001739
in scheme: scheme
notation: 001739
scope note: 運営会社: 東日本旅客鉄道。路線名: 上越線。鉄道区分: 普通鉄道JR（11）。事業者種別: JR在来線（2）。

荻生
type: Concept
alternative label: 荻生（富山地方鉄道 本線）
broader: g001740
in scheme: scheme
notation: 001740
scope note: 運営会社: 富山地方鉄道。路線名: 本線。鉄道区分: 普通鉄道（12）。事業者種別: 民営鉄道（4）。

東三日市
type: Concept
alternative label: 東三日市（富山地方鉄道 本線）
broader: g001741
in scheme: scheme
notation: 001741
scope note: 運営会社: 富山地方鉄道。路線名: 本線。鉄道区分: 普通鉄道（12）。事業者種別: 民営鉄道（4）。

黒部宇奈月温泉
type: Concept
alternative label: 黒部宇奈月温泉（西日本旅客鉄道 北陸新幹線）
broader: g001742
in scheme: scheme
notation: 001742
scope note: 運営会社: 西日本旅客鉄道。路線名: 北陸新幹線。鉄道区分: 普通鉄道JR（11）。事業者種別: JRの新幹線（1）。

電鉄黒部
type: Concept
alternative label: 電鉄黒部（富山地方鉄道 本線）
broader: g001743
in scheme: scheme
notation: 001743
scope note: 運営会社: 富山地方鉄道。路線名: 本線。鉄道区分: 普通鉄道（12）。事業者種別: 民営鉄道（4）。

長屋
type: Concept
alternative label: 長屋（富山地方鉄道 本線）
broader: g001744
in scheme: scheme
notation: 001744
scope note: 運営会社: 富山地方鉄道。路線名: 本線。鉄道区分: 普通鉄道（12）。事業者種別: 民営鉄道（4）。

新黒部
type: Concept
alternative label: 新黒部（富山地方鉄道 本線）
broader: g001745
in scheme: scheme
notation: 001745
scope note: 運営会社: 富山地方鉄道。路線名: 本線。鉄道区分: 普通鉄道（12）。事業者種別: 民営鉄道（4）。

妙高高原
type: Concept
alternative label: 妙高高原（しなの鉄道 北しなの線）
broader: g001746
in scheme: scheme
notation: 001746
scope note: 運営会社: しなの鉄道。路線名: 北しなの線。鉄道区分: 普通鉄道（12）。事業者種別: 第三セクター（5）。

妙高高原
type: Concept
alternative label: 妙高高原（えちごトキめき鉄道 妙高はねうまライン）
broader: g001746
in scheme: scheme
notation: 001747
scope note: 運営会社: えちごトキめき鉄道。路線名: 妙高はねうまライン。鉄道区分: 普通鉄道（12）。事業者種別: 第三セクター（5）。

舌山
type: Concept
alternative label: 舌山（富山地方鉄道 本線）
broader: g001748
in scheme: scheme
notation: 001748
scope note: 運営会社: 富山地方鉄道。路線名: 本線。鉄道区分: 普通鉄道（12）。事業者種別: 民営鉄道（4）。

若栗
type: Concept
alternative label: 若栗（富山地方鉄道 本線）
broader: g001749
in scheme: scheme
notation: 001749
scope note: 運営会社: 富山地方鉄道。路線名: 本線。鉄道区分: 普通鉄道（12）。事業者種別: 民営鉄道（4）。

南羽咋
type: Concept
alternative label: 南羽咋（西日本旅客鉄道 七尾線）
broader: g001750
in scheme: scheme
notation: 001750
scope note: 運営会社: 西日本旅客鉄道。路線名: 七尾線。鉄道区分: 普通鉄道JR（11）。事業者種別: JR在来線（2）。

東館
type: Concept
alternative label: 東館（東日本旅客鉄道 水郡線）
broader: g001751
in scheme: scheme
notation: 001751
scope note: 運営会社: 東日本旅客鉄道。路線名: 水郡線。鉄道区分: 普通鉄道JR（11）。事業者種別: JR在来線（2）。

栃屋
type: Concept
alternative label: 栃屋（富山地方鉄道 本線）
broader: g001752
in scheme: scheme
notation: 001752
scope note: 運営会社: 富山地方鉄道。路線名: 本線。鉄道区分: 普通鉄道（12）。事業者種別: 民営鉄道（4）。

黒部
type: Concept
alternative label: 黒部（あいの風とやま鉄道 あいの風とやま鉄道線）
broader: g001753
in scheme: scheme
notation: 001753
scope note: 運営会社: あいの風とやま鉄道。路線名: あいの風とやま鉄道線。鉄道区分: 普通鉄道（12）。事業者種別: 第三セクター（5）。

電鉄石田
type: Concept
alternative label: 電鉄石田（富山地方鉄道 本線）
broader: g001754
in scheme: scheme
notation: 001754
scope note: 運営会社: 富山地方鉄道。路線名: 本線。鉄道区分: 普通鉄道（12）。事業者種別: 民営鉄道（4）。

浦山
type: Concept
alternative label: 浦山（富山地方鉄道 本線）
broader: g001755
in scheme: scheme
notation: 001755
scope note: 運営会社: 富山地方鉄道。路線名: 本線。鉄道区分: 普通鉄道（12）。事業者種別: 民営鉄道（4）。

龍王峡
type: Concept
alternative label: 龍王峡（野岩鉄道 会津鬼怒川線）
broader: g001756
in scheme: scheme
notation: 001756
scope note: 運営会社: 野岩鉄道。路線名: 会津鬼怒川線。鉄道区分: 普通鉄道（12）。事業者種別: 第三セクター（5）。

下立口
type: Concept
alternative label: 下立口（富山地方鉄道 本線）
broader: g001757
in scheme: scheme
notation: 001757
scope note: 運営会社: 富山地方鉄道。路線名: 本線。鉄道区分: 普通鉄道（12）。事業者種別: 民営鉄道（4）。

北飯山
type: Concept
alternative label: 北飯山（東日本旅客鉄道 飯山線）
broader: g001758
in scheme: scheme
notation: 001758
scope note: 運営会社: 東日本旅客鉄道。路線名: 飯山線。鉄道区分: 普通鉄道JR（11）。事業者種別: JR在来線（2）。

下立
type: Concept
alternative label: 下立（富山地方鉄道 本線）
broader: g001759
in scheme: scheme
notation: 001759
scope note: 運営会社: 富山地方鉄道。路線名: 本線。鉄道区分: 普通鉄道（12）。事業者種別: 民営鉄道（4）。

愛本
type: Concept
alternative label: 愛本（富山地方鉄道 本線）
broader: g001760
in scheme: scheme
notation: 001760
scope note: 運営会社: 富山地方鉄道。路線名: 本線。鉄道区分: 普通鉄道（12）。事業者種別: 民営鉄道（4）。

新藤原
type: Concept
alternative label: 新藤原（東武鉄道 鬼怒川線）
broader: g001761
in scheme: scheme
notation: 001761
scope note: 運営会社: 東武鉄道。路線名: 鬼怒川線。鉄道区分: 普通鉄道（12）。事業者種別: 民営鉄道（4）。

新藤原
type: Concept
alternative label: 新藤原（野岩鉄道 会津鬼怒川線）
broader: g001761
in scheme: scheme
notation: 001762
scope note: 運営会社: 野岩鉄道。路線名: 会津鬼怒川線。鉄道区分: 普通鉄道（12）。事業者種別: 第三セクター（5）。

矢祭山
type: Concept
alternative label: 矢祭山（東日本旅客鉄道 水郡線）
broader: g001763
in scheme: scheme
notation: 001763
scope note: 運営会社: 東日本旅客鉄道。路線名: 水郡線。鉄道区分: 普通鉄道JR（11）。事業者種別: JR在来線（2）。

氷見
type: Concept
alternative label: 氷見（西日本旅客鉄道 氷見線）
broader: g001764
in scheme: scheme
notation: 001764
scope note: 運営会社: 西日本旅客鉄道。路線名: 氷見線。鉄道区分: 普通鉄道JR（11）。事業者種別: JR在来線（2）。

経田
type: Concept
alternative label: 経田（富山地方鉄道 本線）
broader: g001765
in scheme: scheme
notation: 001765
scope note: 運営会社: 富山地方鉄道。路線名: 本線。鉄道区分: 普通鉄道（12）。事業者種別: 民営鉄道（4）。

敷浪
type: Concept
alternative label: 敷浪（西日本旅客鉄道 七尾線）
broader: g001766
in scheme: scheme
notation: 001766
scope note: 運営会社: 西日本旅客鉄道。路線名: 七尾線。鉄道区分: 普通鉄道JR（11）。事業者種別: JR在来線（2）。

内山
type: Concept
alternative label: 内山（富山地方鉄道 本線）
broader: g001767
in scheme: scheme
notation: 001767
scope note: 運営会社: 富山地方鉄道。路線名: 本線。鉄道区分: 普通鉄道（12）。事業者種別: 民営鉄道（4）。

大津港
type: Concept
alternative label: 大津港（東日本旅客鉄道 常磐線）
broader: g001768
in scheme: scheme
notation: 001768
scope note: 運営会社: 東日本旅客鉄道。路線名: 常磐線。鉄道区分: 普通鉄道JR（11）。事業者種別: JR在来線（2）。

飯山
type: Concept
alternative label: 飯山（東日本旅客鉄道 飯山線）
broader: g001769
in scheme: scheme
notation: 001769
scope note: 運営会社: 東日本旅客鉄道。路線名: 飯山線。鉄道区分: 普通鉄道JR（11）。事業者種別: JR在来線（2）。

飯山
type: Concept
alternative label: 飯山（東日本旅客鉄道 北陸新幹線）
broader: g001769
in scheme: scheme
notation: 001770
scope note: 運営会社: 東日本旅客鉄道。路線名: 北陸新幹線。鉄道区分: 普通鉄道JR（11）。事業者種別: JRの新幹線（1）。

野崎
type: Concept
alternative label: 野崎（東日本旅客鉄道 東北線）
broader: g001771
in scheme: scheme
notation: 001771
scope note: 運営会社: 東日本旅客鉄道。路線名: 東北線。鉄道区分: 普通鉄道JR（11）。事業者種別: JR在来線（2）。

北小谷
type: Concept
alternative label: 北小谷（西日本旅客鉄道 大糸線）
broader: g001772
in scheme: scheme
notation: 001772
scope note: 運営会社: 西日本旅客鉄道。路線名: 大糸線。鉄道区分: 普通鉄道JR（11）。事業者種別: JR在来線（2）。

鬼怒川公園
type: Concept
alternative label: 鬼怒川公園（東武鉄道 鬼怒川線）
broader: g001773
in scheme: scheme
notation: 001773
scope note: 運営会社: 東武鉄道。路線名: 鬼怒川線。鉄道区分: 普通鉄道（12）。事業者種別: 民営鉄道（4）。

音沢
type: Concept
alternative label: 音沢（富山地方鉄道 本線）
broader: g001774
in scheme: scheme
notation: 001774
scope note: 運営会社: 富山地方鉄道。路線名: 本線。鉄道区分: 普通鉄道（12）。事業者種別: 民営鉄道（4）。

土合
type: Concept
alternative label: 土合（東日本旅客鉄道 上越線）
broader: g001775
in scheme: scheme
notation: 001775
scope note: 運営会社: 東日本旅客鉄道。路線名: 上越線。鉄道区分: 普通鉄道JR（11）。事業者種別: JR在来線（2）。

島尾
type: Concept
alternative label: 島尾（西日本旅客鉄道 氷見線）
broader: g001776
in scheme: scheme
notation: 001776
scope note: 運営会社: 西日本旅客鉄道。路線名: 氷見線。鉄道区分: 普通鉄道JR（11）。事業者種別: JR在来線（2）。

新魚津
type: Concept
alternative label: 新魚津（富山地方鉄道 本線）
broader: g001777
in scheme: scheme
notation: 001777
scope note: 運営会社: 富山地方鉄道。路線名: 本線。鉄道区分: 普通鉄道（12）。事業者種別: 民営鉄道（4）。

魚津
type: Concept
alternative label: 魚津（あいの風とやま鉄道 あいの風とやま鉄道線）
broader: g001778
in scheme: scheme
notation: 001778
scope note: 運営会社: あいの風とやま鉄道。路線名: あいの風とやま鉄道線。鉄道区分: 普通鉄道（12）。事業者種別: 第三セクター（5）。

鬼怒川温泉
type: Concept
alternative label: 鬼怒川温泉（東武鉄道 鬼怒川線）
broader: g001779
in scheme: scheme
notation: 001779
scope note: 運営会社: 東武鉄道。路線名: 鬼怒川線。鉄道区分: 普通鉄道（12）。事業者種別: 民営鉄道（4）。

宝達
type: Concept
alternative label: 宝達（西日本旅客鉄道 七尾線）
broader: g001780
in scheme: scheme
notation: 001780
scope note: 運営会社: 西日本旅客鉄道。路線名: 七尾線。鉄道区分: 普通鉄道JR（11）。事業者種別: JR在来線（2）。

雨晴
type: Concept
alternative label: 雨晴（西日本旅客鉄道 氷見線）
broader: g001781
in scheme: scheme
notation: 001781
scope note: 運営会社: 西日本旅客鉄道。路線名: 氷見線。鉄道区分: 普通鉄道JR（11）。事業者種別: JR在来線（2）。

宇奈月温泉
type: Concept
alternative label: 宇奈月温泉（富山地方鉄道 本線）
broader: g001782
in scheme: scheme
notation: 001782
scope note: 運営会社: 富山地方鉄道。路線名: 本線。鉄道区分: 普通鉄道（12）。事業者種別: 民営鉄道（4）。

下野宮
type: Concept
alternative label: 下野宮（東日本旅客鉄道 水郡線）
broader: g001783
in scheme: scheme
notation: 001783
scope note: 運営会社: 東日本旅客鉄道。路線名: 水郡線。鉄道区分: 普通鉄道JR（11）。事業者種別: JR在来線（2）。

電鉄魚津
type: Concept
alternative label: 電鉄魚津（富山地方鉄道 本線）
broader: g001784
in scheme: scheme
notation: 001784
scope note: 運営会社: 富山地方鉄道。路線名: 本線。鉄道区分: 普通鉄道（12）。事業者種別: 民営鉄道（4）。

宇奈月
type: Concept
alternative label: 宇奈月（黒部峡谷鉄道 本線）
broader: g001785
in scheme: scheme
notation: 001785
scope note: 運営会社: 黒部峡谷鉄道。路線名: 本線。鉄道区分: 普通鉄道（12）。事業者種別: 民営鉄道（4）。

蓮
type: Concept
alternative label: 蓮（東日本旅客鉄道 飯山線）
broader: g001786
in scheme: scheme
notation: 001786
scope note: 運営会社: 東日本旅客鉄道。路線名: 飯山線。鉄道区分: 普通鉄道JR（11）。事業者種別: JR在来線（2）。

東武ワールドスクウェア
type: Concept
alternative label: 東武ワールドスクウェア（東武鉄道 鬼怒川線）
broader: g001787
in scheme: scheme
notation: 001787
scope note: 運営会社: 東武鉄道。路線名: 鬼怒川線。鉄道区分: 普通鉄道（12）。事業者種別: 民営鉄道（4）。

黒姫
type: Concept
alternative label: 黒姫（しなの鉄道 北しなの線）
broader: g001788
in scheme: scheme
notation: 001788
scope note: 運営会社: しなの鉄道。路線名: 北しなの線。鉄道区分: 普通鉄道（12）。事業者種別: 第三セクター（5）。

矢板
type: Concept
alternative label: 矢板（東日本旅客鉄道 東北線）
broader: g001789
in scheme: scheme
notation: 001789
scope note: 運営会社: 東日本旅客鉄道。路線名: 東北線。鉄道区分: 普通鉄道JR（11）。事業者種別: JR在来線（2）。

中土
type: Concept
alternative label: 中土（西日本旅客鉄道 大糸線）
broader: g001790
in scheme: scheme
notation: 001790
scope note: 運営会社: 西日本旅客鉄道。路線名: 大糸線。鉄道区分: 普通鉄道JR（11）。事業者種別: JR在来線（2）。

越中国分
type: Concept
alternative label: 越中国分（西日本旅客鉄道 氷見線）
broader: g001791
in scheme: scheme
notation: 001791
scope note: 運営会社: 西日本旅客鉄道。路線名: 氷見線。鉄道区分: 普通鉄道JR（11）。事業者種別: JR在来線（2）。

西魚津
type: Concept
alternative label: 西魚津（富山地方鉄道 本線）
broader: g001792
in scheme: scheme
notation: 001792
scope note: 運営会社: 富山地方鉄道。路線名: 本線。鉄道区分: 普通鉄道（12）。事業者種別: 民営鉄道（4）。

柳橋
type: Concept
alternative label: 柳橋（黒部峡谷鉄道 本線）
broader: g001793
in scheme: scheme
notation: 001793
scope note: 運営会社: 黒部峡谷鉄道。路線名: 本線。鉄道区分: 普通鉄道（12）。事業者種別: 民営鉄道（4）。

湯檜曽
type: Concept
alternative label: 湯檜曽（東日本旅客鉄道 上越線）
broader: g001794
in scheme: scheme
notation: 001794
scope note: 運営会社: 東日本旅客鉄道。路線名: 上越線。鉄道区分: 普通鉄道JR（11）。事業者種別: JR在来線（2）。

小佐越
type: Concept
alternative label: 小佐越（東武鉄道 鬼怒川線）
broader: g001795
in scheme: scheme
notation: 001795
scope note: 運営会社: 東武鉄道。路線名: 鬼怒川線。鉄道区分: 普通鉄道（12）。事業者種別: 民営鉄道（4）。

免田
type: Concept
alternative label: 免田（西日本旅客鉄道 七尾線）
broader: g001796
in scheme: scheme
notation: 001796
scope note: 運営会社: 西日本旅客鉄道。路線名: 七尾線。鉄道区分: 普通鉄道JR（11）。事業者種別: JR在来線（2）。

古間
type: Concept
alternative label: 古間（しなの鉄道 北しなの線）
broader: g001797
in scheme: scheme
notation: 001797
scope note: 運営会社: しなの鉄道。路線名: 北しなの線。鉄道区分: 普通鉄道（12）。事業者種別: 第三セクター（5）。

伏木
type: Concept
alternative label: 伏木（西日本旅客鉄道 氷見線）
broader: g001798
in scheme: scheme
notation: 001798
scope note: 運営会社: 西日本旅客鉄道。路線名: 氷見線。鉄道区分: 普通鉄道JR（11）。事業者種別: JR在来線（2）。

森石
type: Concept
alternative label: 森石（黒部峡谷鉄道 本線）
broader: g001799
in scheme: scheme
notation: 001799
scope note: 運営会社: 黒部峡谷鉄道。路線名: 本線。鉄道区分: 普通鉄道（12）。事業者種別: 民営鉄道（4）。

磯原
type: Concept
alternative label: 磯原（東日本旅客鉄道 常磐線）
broader: g001800
in scheme: scheme
notation: 001800
scope note: 運営会社: 東日本旅客鉄道。路線名: 常磐線。鉄道区分: 普通鉄道JR（11）。事業者種別: JR在来線（2）。

越中中村
type: Concept
alternative label: 越中中村（富山地方鉄道 本線）
broader: g001801
in scheme: scheme
notation: 001801
scope note: 運営会社: 富山地方鉄道。路線名: 本線。鉄道区分: 普通鉄道（12）。事業者種別: 民営鉄道（4）。

六渡寺
type: Concept
alternative label: 六渡寺（万葉線 新湊港線）
broader: g001802
in scheme: scheme
notation: 001802
scope note: 運営会社: 万葉線。路線名: 新湊港線。鉄道区分: 普通鉄道（12）。事業者種別: 第三セクター（5）。

六渡寺
type: Concept
alternative label: 六渡寺（万葉線 高岡軌道線）
broader: g001802
in scheme: scheme
notation: 001803
scope note: 運営会社: 万葉線。路線名: 高岡軌道線。鉄道区分: 軌道（21）。事業者種別: 第三セクター（5）。

東滑川
type: Concept
alternative label: 東滑川（あいの風とやま鉄道 あいの風とやま鉄道線）
broader: g001804
in scheme: scheme
notation: 001804
scope note: 運営会社: あいの風とやま鉄道。路線名: あいの風とやま鉄道線。鉄道区分: 普通鉄道（12）。事業者種別: 第三セクター（5）。

中伏木
type: Concept
alternative label: 中伏木（万葉線 高岡軌道線）
broader: g001805
in scheme: scheme
notation: 001805
scope note: 運営会社: 万葉線。路線名: 高岡軌道線。鉄道区分: 軌道（21）。事業者種別: 第三セクター（5）。

黒薙
type: Concept
alternative label: 黒薙（黒部峡谷鉄道 本線）
broader: g001806
in scheme: scheme
notation: 001806
scope note: 運営会社: 黒部峡谷鉄道。路線名: 本線。鉄道区分: 普通鉄道（12）。事業者種別: 民営鉄道（4）。

庄川口
type: Concept
alternative label: 庄川口（万葉線 新湊港線）
broader: g001807
in scheme: scheme
notation: 001807
scope note: 運営会社: 万葉線。路線名: 新湊港線。鉄道区分: 普通鉄道（12）。事業者種別: 第三セクター（5）。

早月加積
type: Concept
alternative label: 早月加積（富山地方鉄道 本線）
broader: g001808
in scheme: scheme
notation: 001808
scope note: 運営会社: 富山地方鉄道。路線名: 本線。鉄道区分: 普通鉄道（12）。事業者種別: 民営鉄道（4）。

笹平
type: Concept
alternative label: 笹平（黒部峡谷鉄道 本線）
broader: g001809
in scheme: scheme
notation: 001809
scope note: 運営会社: 黒部峡谷鉄道。路線名: 本線。鉄道区分: 普通鉄道（12）。事業者種別: 民営鉄道（4）。

吉久
type: Concept
alternative label: 吉久（万葉線 高岡軌道線）
broader: g001810
in scheme: scheme
notation: 001810
scope note: 運営会社: 万葉線。路線名: 高岡軌道線。鉄道区分: 軌道（21）。事業者種別: 第三セクター（5）。

第一イン新湊クロスベイ前
type: Concept
alternative label: 第一イン新湊クロスベイ前（万葉線 新湊港線）
broader: g001811
in scheme: scheme
notation: 001811
scope note: 運営会社: 万葉線。路線名: 新湊港線。鉄道区分: 普通鉄道（12）。事業者種別: 第三セクター（5）。

新高徳
type: Concept
alternative label: 新高徳（東武鉄道 鬼怒川線）
broader: g001812
in scheme: scheme
notation: 001812
scope note: 運営会社: 東武鉄道。路線名: 鬼怒川線。鉄道区分: 普通鉄道（12）。事業者種別: 民営鉄道（4）。

水上
type: Concept
alternative label: 水上（東日本旅客鉄道 上越線）
broader: g001813
in scheme: scheme
notation: 001813
scope note: 運営会社: 東日本旅客鉄道。路線名: 上越線。鉄道区分: 普通鉄道JR（11）。事業者種別: JR在来線（2）。

新町口
type: Concept
alternative label: 新町口（万葉線 新湊港線）
broader: g001814
in scheme: scheme
notation: 001814
scope note: 運営会社: 万葉線。路線名: 新湊港線。鉄道区分: 普通鉄道（12）。事業者種別: 第三セクター（5）。

東新湊
type: Concept
alternative label: 東新湊（万葉線 新湊港線）
broader: g001815
in scheme: scheme
notation: 001815
scope note: 運営会社: 万葉線。路線名: 新湊港線。鉄道区分: 普通鉄道（12）。事業者種別: 第三セクター（5）。

浜加積
type: Concept
alternative label: 浜加積（富山地方鉄道 本線）
broader: g001816
in scheme: scheme
notation: 001816
scope note: 運営会社: 富山地方鉄道。路線名: 本線。鉄道区分: 普通鉄道（12）。事業者種別: 民営鉄道（4）。

海王丸
type: Concept
alternative label: 海王丸（万葉線 新湊港線）
broader: g001817
in scheme: scheme
notation: 001817
scope note: 運営会社: 万葉線。路線名: 新湊港線。鉄道区分: 普通鉄道（12）。事業者種別: 第三セクター（5）。

新吉久
type: Concept
alternative label: 新吉久（万葉線 高岡軌道線）
broader: g001818
in scheme: scheme
notation: 001818
scope note: 運営会社: 万葉線。路線名: 高岡軌道線。鉄道区分: 軌道（21）。事業者種別: 第三セクター（5）。

中新湊
type: Concept
alternative label: 中新湊（万葉線 新湊港線）
broader: g001819
in scheme: scheme
notation: 001819
scope note: 運営会社: 万葉線。路線名: 新湊港線。鉄道区分: 普通鉄道（12）。事業者種別: 第三セクター（5）。

越ノ潟
type: Concept
alternative label: 越ノ潟（万葉線 新湊港線）
broader: g001820
in scheme: scheme
notation: 001820
scope note: 運営会社: 万葉線。路線名: 新湊港線。鉄道区分: 普通鉄道（12）。事業者種別: 第三セクター（5）。

南小谷
type: Concept
alternative label: 南小谷（西日本旅客鉄道 大糸線）
broader: g001821
in scheme: scheme
notation: 001821
scope note: 運営会社: 西日本旅客鉄道。路線名: 大糸線。鉄道区分: 普通鉄道JR（11）。事業者種別: JR在来線（2）。

南小谷
type: Concept
alternative label: 南小谷（東日本旅客鉄道 大糸線）
broader: g001821
in scheme: scheme
notation: 001822
scope note: 運営会社: 東日本旅客鉄道。路線名: 大糸線。鉄道区分: 普通鉄道JR（11）。事業者種別: JR在来線（2）。

能町口
type: Concept
alternative label: 能町口（万葉線 高岡軌道線）
broader: g001823
in scheme: scheme
notation: 001823
scope note: 運営会社: 万葉線。路線名: 高岡軌道線。鉄道区分: 軌道（21）。事業者種別: 第三セクター（5）。

米島口
type: Concept
alternative label: 米島口（万葉線 高岡軌道線）
broader: g001824
in scheme: scheme
notation: 001824
scope note: 運営会社: 万葉線。路線名: 高岡軌道線。鉄道区分: 軌道（21）。事業者種別: 第三セクター（5）。

常陸大子
type: Concept
alternative label: 常陸大子（東日本旅客鉄道 水郡線）
broader: g001825
in scheme: scheme
notation: 001825
scope note: 運営会社: 東日本旅客鉄道。路線名: 水郡線。鉄道区分: 普通鉄道JR（11）。事業者種別: JR在来線（2）。

新能町
type: Concept
alternative label: 新能町（万葉線 高岡軌道線）
broader: g001826
in scheme: scheme
notation: 001826
scope note: 運営会社: 万葉線。路線名: 高岡軌道線。鉄道区分: 軌道（21）。事業者種別: 第三セクター（5）。

滑川
type: Concept
alternative label: 滑川（あいの風とやま鉄道 あいの風とやま鉄道線）
broader: g001827
in scheme: scheme
notation: 001827
scope note: 運営会社: あいの風とやま鉄道。路線名: あいの風とやま鉄道線。鉄道区分: 普通鉄道（12）。事業者種別: 第三セクター（5）。

替佐
type: Concept
alternative label: 替佐（東日本旅客鉄道 飯山線）
broader: g001828
in scheme: scheme
notation: 001828
scope note: 運営会社: 東日本旅客鉄道。路線名: 飯山線。鉄道区分: 普通鉄道JR（11）。事業者種別: JR在来線（2）。

滑川
type: Concept
alternative label: 滑川（富山地方鉄道 本線）
broader: g001827
in scheme: scheme
notation: 001829
scope note: 運営会社: 富山地方鉄道。路線名: 本線。鉄道区分: 普通鉄道（12）。事業者種別: 民営鉄道（4）。

高松
type: Concept
alternative label: 高松（西日本旅客鉄道 七尾線）
broader: g001830
in scheme: scheme
notation: 001830
scope note: 運営会社: 西日本旅客鉄道。路線名: 七尾線。鉄道区分: 普通鉄道JR（11）。事業者種別: JR在来線（2）。

能町
type: Concept
alternative label: 能町（西日本旅客鉄道 氷見線）
broader: g001831
in scheme: scheme
notation: 001831
scope note: 運営会社: 西日本旅客鉄道。路線名: 氷見線。鉄道区分: 普通鉄道JR（11）。事業者種別: JR在来線（2）。

出平
type: Concept
alternative label: 出平（黒部峡谷鉄道 本線）
broader: g001832
in scheme: scheme
notation: 001832
scope note: 運営会社: 黒部峡谷鉄道。路線名: 本線。鉄道区分: 普通鉄道（12）。事業者種別: 民営鉄道（4）。

荻布
type: Concept
alternative label: 荻布（万葉線 高岡軌道線）
broader: g001833
in scheme: scheme
notation: 001833
scope note: 運営会社: 万葉線。路線名: 高岡軌道線。鉄道区分: 軌道（21）。事業者種別: 第三セクター（5）。

旭ヶ丘
type: Concept
alternative label: 旭ヶ丘（万葉線 高岡軌道線）
broader: g001834
in scheme: scheme
notation: 001834
scope note: 運営会社: 万葉線。路線名: 高岡軌道線。鉄道区分: 軌道（21）。事業者種別: 第三セクター（5）。

千国
type: Concept
alternative label: 千国（東日本旅客鉄道 大糸線）
broader: g001835
in scheme: scheme
notation: 001835
scope note: 運営会社: 東日本旅客鉄道。路線名: 大糸線。鉄道区分: 普通鉄道JR（11）。事業者種別: JR在来線（2）。

中滑川
type: Concept
alternative label: 中滑川（富山地方鉄道 本線）
broader: g001836
in scheme: scheme
notation: 001836
scope note: 運営会社: 富山地方鉄道。路線名: 本線。鉄道区分: 普通鉄道（12）。事業者種別: 民営鉄道（4）。

江尻
type: Concept
alternative label: 江尻（万葉線 高岡軌道線）
broader: g001837
in scheme: scheme
notation: 001837
scope note: 運営会社: 万葉線。路線名: 高岡軌道線。鉄道区分: 軌道（21）。事業者種別: 第三セクター（5）。

岩瀬浜
type: Concept
alternative label: 岩瀬浜（富山地方鉄道 富山港線）
broader: g001838
in scheme: scheme
notation: 001838
scope note: 運営会社: 富山地方鉄道。路線名: 富山港線。鉄道区分: 普通鉄道（12）。事業者種別: 民営鉄道（4）。

信濃竹原
type: Concept
alternative label: 信濃竹原（長野電鉄 長野線）
broader: g001839
in scheme: scheme
notation: 001839
scope note: 運営会社: 長野電鉄。路線名: 長野線。鉄道区分: 普通鉄道（12）。事業者種別: 民営鉄道（4）。

大桑
type: Concept
alternative label: 大桑（東武鉄道 鬼怒川線）
broader: g001840
in scheme: scheme
notation: 001840
scope note: 運営会社: 東武鉄道。路線名: 鬼怒川線。鉄道区分: 普通鉄道（12）。事業者種別: 民営鉄道（4）。

夜間瀬
type: Concept
alternative label: 夜間瀬（長野電鉄 長野線）
broader: g001841
in scheme: scheme
notation: 001841
scope note: 運営会社: 長野電鉄。路線名: 長野線。鉄道区分: 普通鉄道（12）。事業者種別: 民営鉄道（4）。

市民病院前
type: Concept
alternative label: 市民病院前（万葉線 高岡軌道線）
broader: g001842
in scheme: scheme
notation: 001842
scope note: 運営会社: 万葉線。路線名: 高岡軌道線。鉄道区分: 軌道（21）。事業者種別: 第三セクター（5）。

競輪場前
type: Concept
alternative label: 競輪場前（富山地方鉄道 富山港線）
broader: g001843
in scheme: scheme
notation: 001843
scope note: 運営会社: 富山地方鉄道。路線名: 富山港線。鉄道区分: 普通鉄道（12）。事業者種別: 民営鉄道（4）。

西滑川
type: Concept
alternative label: 西滑川（富山地方鉄道 本線）
broader: g001844
in scheme: scheme
notation: 001844
scope note: 運営会社: 富山地方鉄道。路線名: 本線。鉄道区分: 普通鉄道（12）。事業者種別: 民営鉄道（4）。

志貴野中学校前
type: Concept
alternative label: 志貴野中学校前（万葉線 高岡軌道線）
broader: g001845
in scheme: scheme
notation: 001845
scope note: 運営会社: 万葉線。路線名: 高岡軌道線。鉄道区分: 軌道（21）。事業者種別: 第三セクター（5）。

袋田
type: Concept
alternative label: 袋田（東日本旅客鉄道 水郡線）
broader: g001846
in scheme: scheme
notation: 001846
scope note: 運営会社: 東日本旅客鉄道。路線名: 水郡線。鉄道区分: 普通鉄道JR（11）。事業者種別: JR在来線（2）。

片岡
type: Concept
alternative label: 片岡（東日本旅客鉄道 東北線）
broader: g001847
in scheme: scheme
notation: 001847
scope note: 運営会社: 東日本旅客鉄道。路線名: 東北線。鉄道区分: 普通鉄道JR（11）。事業者種別: JR在来線（2）。

上今井
type: Concept
alternative label: 上今井（東日本旅客鉄道 飯山線）
broader: g001848
in scheme: scheme
notation: 001848
scope note: 運営会社: 東日本旅客鉄道。路線名: 飯山線。鉄道区分: 普通鉄道JR（11）。事業者種別: JR在来線（2）。

南中郷
type: Concept
alternative label: 南中郷（東日本旅客鉄道 常磐線）
broader: g001849
in scheme: scheme
notation: 001849
scope note: 運営会社: 東日本旅客鉄道。路線名: 常磐線。鉄道区分: 普通鉄道JR（11）。事業者種別: JR在来線（2）。

牟礼
type: Concept
alternative label: 牟礼（しなの鉄道 北しなの線）
broader: g001850
in scheme: scheme
notation: 001850
scope note: 運営会社: しなの鉄道。路線名: 北しなの線。鉄道区分: 普通鉄道（12）。事業者種別: 第三セクター（5）。

広小路
type: Concept
alternative label: 広小路（万葉線 高岡軌道線）
broader: g001851
in scheme: scheme
notation: 001851
scope note: 運営会社: 万葉線。路線名: 高岡軌道線。鉄道区分: 軌道（21）。事業者種別: 第三セクター（5）。

東岩瀬
type: Concept
alternative label: 東岩瀬（富山地方鉄道 富山港線）
broader: g001852
in scheme: scheme
notation: 001852
scope note: 運営会社: 富山地方鉄道。路線名: 富山港線。鉄道区分: 普通鉄道（12）。事業者種別: 民営鉄道（4）。

中野松川
type: Concept
alternative label: 中野松川（長野電鉄 長野線）
broader: g001853
in scheme: scheme
notation: 001853
scope note: 運営会社: 長野電鉄。路線名: 長野線。鉄道区分: 普通鉄道（12）。事業者種別: 民営鉄道（4）。

急患医療センター前
type: Concept
alternative label: 急患医療センター前（万葉線 高岡軌道線）
broader: g001854
in scheme: scheme
notation: 001854
scope note: 運営会社: 万葉線。路線名: 高岡軌道線。鉄道区分: 軌道（21）。事業者種別: 第三セクター（5）。

越中中川
type: Concept
alternative label: 越中中川（西日本旅客鉄道 氷見線）
broader: g001855
in scheme: scheme
notation: 001855
scope note: 運営会社: 西日本旅客鉄道。路線名: 氷見線。鉄道区分: 普通鉄道JR（11）。事業者種別: JR在来線（2）。

上条
type: Concept
alternative label: 上条（長野電鉄 長野線）
broader: g001856
in scheme: scheme
notation: 001856
scope note: 運営会社: 長野電鉄。路線名: 長野線。鉄道区分: 普通鉄道（12）。事業者種別: 民営鉄道（4）。

猫又
type: Concept
alternative label: 猫又（黒部峡谷鉄道 本線）
broader: g001857
in scheme: scheme
notation: 001857
scope note: 運営会社: 黒部峡谷鉄道。路線名: 本線。鉄道区分: 普通鉄道（12）。事業者種別: 民営鉄道（4）。

萩浦小学校前
type: Concept
alternative label: 萩浦小学校前（富山地方鉄道 富山港線）
broader: g001858
in scheme: scheme
notation: 001858
scope note: 運営会社: 富山地方鉄道。路線名: 富山港線。鉄道区分: 普通鉄道（12）。事業者種別: 民営鉄道（4）。

東武日光
type: Concept
alternative label: 東武日光（東武鉄道 日光線）
broader: g001859
in scheme: scheme
notation: 001859
scope note: 運営会社: 東武鉄道。路線名: 日光線。鉄道区分: 普通鉄道（12）。事業者種別: 民営鉄道（4）。

横山
type: Concept
alternative label: 横山（西日本旅客鉄道 七尾線）
broader: g001860
in scheme: scheme
notation: 001860
scope note: 運営会社: 西日本旅客鉄道。路線名: 七尾線。鉄道区分: 普通鉄道JR（11）。事業者種別: JR在来線（2）。

坂下町
type: Concept
alternative label: 坂下町（万葉線 高岡軌道線）
broader: g001861
in scheme: scheme
notation: 001861
scope note: 運営会社: 万葉線。路線名: 高岡軌道線。鉄道区分: 軌道（21）。事業者種別: 第三セクター（5）。

日光
type: Concept
alternative label: 日光（東日本旅客鉄道 日光線）
broader: g001862
in scheme: scheme
notation: 001862
scope note: 運営会社: 東日本旅客鉄道。路線名: 日光線。鉄道区分: 普通鉄道JR（11）。事業者種別: JR在来線（2）。

西加積
type: Concept
alternative label: 西加積（富山地方鉄道 本線）
broader: g001863
in scheme: scheme
notation: 001863
scope note: 運営会社: 富山地方鉄道。路線名: 本線。鉄道区分: 普通鉄道（12）。事業者種別: 民営鉄道（4）。

片原町
type: Concept
alternative label: 片原町（万葉線 高岡軌道線）
broader: g001864
in scheme: scheme
notation: 001864
scope note: 運営会社: 万葉線。路線名: 高岡軌道線。鉄道区分: 軌道（21）。事業者種別: 第三セクター（5）。

信州中野
type: Concept
alternative label: 信州中野（長野電鉄 長野線）
broader: g001865
in scheme: scheme
notation: 001865
scope note: 運営会社: 長野電鉄。路線名: 長野線。鉄道区分: 普通鉄道（12）。事業者種別: 民営鉄道（4）。

末広町
type: Concept
alternative label: 末広町（万葉線 高岡軌道線）
broader: g001866
in scheme: scheme
notation: 001866
scope note: 運営会社: 万葉線。路線名: 高岡軌道線。鉄道区分: 軌道（21）。事業者種別: 第三セクター（5）。

水橋
type: Concept
alternative label: 水橋（あいの風とやま鉄道 あいの風とやま鉄道線）
broader: g001867
in scheme: scheme
notation: 001867
scope note: 運営会社: あいの風とやま鉄道。路線名: あいの風とやま鉄道線。鉄道区分: 普通鉄道（12）。事業者種別: 第三セクター（5）。

蓮町（馬場記念公園前）
type: Concept
alternative label: 蓮町（馬場記念公園前）（富山地方鉄道 富山港線）
broader: g001868
in scheme: scheme
notation: 001868
scope note: 運営会社: 富山地方鉄道。路線名: 富山港線。鉄道区分: 普通鉄道（12）。事業者種別: 民営鉄道（4）。

湯田中
type: Concept
alternative label: 湯田中（長野電鉄 長野線）
broader: g001869
in scheme: scheme
notation: 001869
scope note: 運営会社: 長野電鉄。路線名: 長野線。鉄道区分: 普通鉄道（12）。事業者種別: 民営鉄道（4）。

高岡駅
type: Concept
alternative label: 高岡駅（万葉線 高岡軌道線）
broader: g001870
in scheme: scheme
notation: 001870
scope note: 運営会社: 万葉線。路線名: 高岡軌道線。鉄道区分: 軌道（21）。事業者種別: 第三セクター（5）。

高岡
type: Concept
alternative label: 高岡（あいの風とやま鉄道 あいの風とやま鉄道線）
broader: g001873
in scheme: scheme
notation: 001871
scope note: 運営会社: あいの風とやま鉄道。路線名: あいの風とやま鉄道線。鉄道区分: 普通鉄道（12）。事業者種別: 第三セクター（5）。

東富山
type: Concept
alternative label: 東富山（あいの風とやま鉄道 あいの風とやま鉄道線）
broader: g001872
in scheme: scheme
notation: 001872
scope note: 運営会社: あいの風とやま鉄道。路線名: あいの風とやま鉄道線。鉄道区分: 普通鉄道（12）。事業者種別: 第三セクター（5）。

高岡
type: Concept
alternative label: 高岡（西日本旅客鉄道 城端線）
broader: g001873
in scheme: scheme
notation: 001873
scope note: 運営会社: 西日本旅客鉄道。路線名: 城端線。鉄道区分: 普通鉄道JR（11）。事業者種別: JR在来線（2）。

高岡
type: Concept
alternative label: 高岡（西日本旅客鉄道 氷見線）
broader: g001873
in scheme: scheme
notation: 001874
scope note: 運営会社: 西日本旅客鉄道。路線名: 氷見線。鉄道区分: 普通鉄道JR（11）。事業者種別: JR在来線（2）。

白馬大池
type: Concept
alternative label: 白馬大池（東日本旅客鉄道 大糸線）
broader: g001875
in scheme: scheme
notation: 001875
scope note: 運営会社: 東日本旅客鉄道。路線名: 大糸線。鉄道区分: 普通鉄道JR（11）。事業者種別: JR在来線（2）。

高岡やぶなみ
type: Concept
alternative label: 高岡やぶなみ（あいの風とやま鉄道 あいの風とやま鉄道線）
broader: g001876
in scheme: scheme
notation: 001876
scope note: 運営会社: あいの風とやま鉄道。路線名: あいの風とやま鉄道線。鉄道区分: 普通鉄道（12）。事業者種別: 第三セクター（5）。

上牧
type: Concept
alternative label: 上牧（東日本旅客鉄道 上越線）
broader: g001877
in scheme: scheme
notation: 001877
scope note: 運営会社: 東日本旅客鉄道。路線名: 上越線。鉄道区分: 普通鉄道JR（11）。事業者種別: JR在来線（2）。

中加積
type: Concept
alternative label: 中加積（富山地方鉄道 本線）
broader: g001878
in scheme: scheme
notation: 001878
scope note: 運営会社: 富山地方鉄道。路線名: 本線。鉄道区分: 普通鉄道（12）。事業者種別: 民営鉄道（4）。

犬島新町
type: Concept
alternative label: 犬島新町（富山地方鉄道 富山港線）
broader: g001879
in scheme: scheme
notation: 001879
scope note: 運営会社: 富山地方鉄道。路線名: 富山港線。鉄道区分: 普通鉄道（12）。事業者種別: 民営鉄道（4）。

鐘釣
type: Concept
alternative label: 鐘釣（黒部峡谷鉄道 本線）
broader: g001880
in scheme: scheme
notation: 001880
scope note: 運営会社: 黒部峡谷鉄道。路線名: 本線。鉄道区分: 普通鉄道（12）。事業者種別: 民営鉄道（4）。

越中大門
type: Concept
alternative label: 越中大門（あいの風とやま鉄道 あいの風とやま鉄道線）
broader: g001881
in scheme: scheme
notation: 001881
scope note: 運営会社: あいの風とやま鉄道。路線名: あいの風とやま鉄道線。鉄道区分: 普通鉄道（12）。事業者種別: 第三セクター（5）。

大谷向
type: Concept
alternative label: 大谷向（東武鉄道 鬼怒川線）
broader: g001882
in scheme: scheme
notation: 001882
scope note: 運営会社: 東武鉄道。路線名: 鬼怒川線。鉄道区分: 普通鉄道（12）。事業者種別: 民営鉄道（4）。

立ヶ花
type: Concept
alternative label: 立ヶ花（東日本旅客鉄道 飯山線）
broader: g001883
in scheme: scheme
notation: 001883
scope note: 運営会社: 東日本旅客鉄道。路線名: 飯山線。鉄道区分: 普通鉄道JR（11）。事業者種別: JR在来線（2）。

城川原
type: Concept
alternative label: 城川原（富山地方鉄道 富山港線）
broader: g001884
in scheme: scheme
notation: 001884
scope note: 運営会社: 富山地方鉄道。路線名: 富山港線。鉄道区分: 普通鉄道（12）。事業者種別: 民営鉄道（4）。

上今市
type: Concept
alternative label: 上今市（東武鉄道 日光線）
broader: g001885
in scheme: scheme
notation: 001885
scope note: 運営会社: 東武鉄道。路線名: 日光線。鉄道区分: 普通鉄道（12）。事業者種別: 民営鉄道（4）。

新高岡
type: Concept
alternative label: 新高岡（西日本旅客鉄道 北陸新幹線）
broader: g001886
in scheme: scheme
notation: 001886
scope note: 運営会社: 西日本旅客鉄道。路線名: 北陸新幹線。鉄道区分: 普通鉄道JR（11）。事業者種別: JRの新幹線（1）。

延徳
type: Concept
alternative label: 延徳（長野電鉄 長野線）
broader: g001887
in scheme: scheme
notation: 001887
scope note: 運営会社: 長野電鉄。路線名: 長野線。鉄道区分: 普通鉄道（12）。事業者種別: 民営鉄道（4）。

新高岡
type: Concept
alternative label: 新高岡（西日本旅客鉄道 城端線）
broader: g001886
in scheme: scheme
notation: 001888
scope note: 運営会社: 西日本旅客鉄道。路線名: 城端線。鉄道区分: 普通鉄道JR（11）。事業者種別: JR在来線（2）。

下今市
type: Concept
alternative label: 下今市（東武鉄道 鬼怒川線）
broader: g001889
in scheme: scheme
notation: 001889
scope note: 運営会社: 東武鉄道。路線名: 鬼怒川線。鉄道区分: 普通鉄道（12）。事業者種別: 民営鉄道（4）。

下今市
type: Concept
alternative label: 下今市（東武鉄道 日光線）
broader: g001889
in scheme: scheme
notation: 001890
scope note: 運営会社: 東武鉄道。路線名: 日光線。鉄道区分: 普通鉄道（12）。事業者種別: 民営鉄道（4）。

西高岡
type: Concept
alternative label: 西高岡（あいの風とやま鉄道 あいの風とやま鉄道線）
broader: g001891
in scheme: scheme
notation: 001891
scope note: 運営会社: あいの風とやま鉄道。路線名: あいの風とやま鉄道線。鉄道区分: 普通鉄道（12）。事業者種別: 第三セクター（5）。

宇野気
type: Concept
alternative label: 宇野気（西日本旅客鉄道 七尾線）
broader: g001892
in scheme: scheme
notation: 001892
scope note: 運営会社: 西日本旅客鉄道。路線名: 七尾線。鉄道区分: 普通鉄道JR（11）。事業者種別: JR在来線（2）。

越中中島
type: Concept
alternative label: 越中中島（富山地方鉄道 富山港線）
broader: g001893
in scheme: scheme
notation: 001893
scope note: 運営会社: 富山地方鉄道。路線名: 富山港線。鉄道区分: 普通鉄道（12）。事業者種別: 民営鉄道（4）。

信濃浅野
type: Concept
alternative label: 信濃浅野（東日本旅客鉄道 飯山線）
broader: g001894
in scheme: scheme
notation: 001894
scope note: 運営会社: 東日本旅客鉄道。路線名: 飯山線。鉄道区分: 普通鉄道JR（11）。事業者種別: JR在来線（2）。

蒲須坂
type: Concept
alternative label: 蒲須坂（東日本旅客鉄道 東北線）
broader: g001895
in scheme: scheme
notation: 001895
scope note: 運営会社: 東日本旅客鉄道。路線名: 東北線。鉄道区分: 普通鉄道JR（11）。事業者種別: JR在来線（2）。

小杉
type: Concept
alternative label: 小杉（あいの風とやま鉄道 あいの風とやま鉄道線）
broader: g001896
in scheme: scheme
notation: 001896
scope note: 運営会社: あいの風とやま鉄道。路線名: あいの風とやま鉄道線。鉄道区分: 普通鉄道（12）。事業者種別: 第三セクター（5）。

今市
type: Concept
alternative label: 今市（東日本旅客鉄道 日光線）
broader: g001897
in scheme: scheme
notation: 001897
scope note: 運営会社: 東日本旅客鉄道。路線名: 日光線。鉄道区分: 普通鉄道JR（11）。事業者種別: JR在来線（2）。

新富山口
type: Concept
alternative label: 新富山口（あいの風とやま鉄道 あいの風とやま鉄道線）
broader: g001898
in scheme: scheme
notation: 001898
scope note: 運営会社: あいの風とやま鉄道。路線名: あいの風とやま鉄道線。鉄道区分: 普通鉄道（12）。事業者種別: 第三セクター（5）。

上小川
type: Concept
alternative label: 上小川（東日本旅客鉄道 水郡線）
broader: g001899
in scheme: scheme
notation: 001899
scope note: 運営会社: 東日本旅客鉄道。路線名: 水郡線。鉄道区分: 普通鉄道JR（11）。事業者種別: JR在来線（2）。

粟島（大阪屋ショップ前）
type: Concept
alternative label: 粟島（大阪屋ショップ前）（富山地方鉄道 富山港線）
broader: g001900
in scheme: scheme
notation: 001900
scope note: 運営会社: 富山地方鉄道。路線名: 富山港線。鉄道区分: 普通鉄道（12）。事業者種別: 民営鉄道（4）。

呉羽
type: Concept
alternative label: 呉羽（あいの風とやま鉄道 あいの風とやま鉄道線）
broader: g001901
in scheme: scheme
notation: 001901
scope note: 運営会社: あいの風とやま鉄道。路線名: あいの風とやま鉄道線。鉄道区分: 普通鉄道（12）。事業者種別: 第三セクター（5）。

新宮川
type: Concept
alternative label: 新宮川（富山地方鉄道 本線）
broader: g001902
in scheme: scheme
notation: 001902
scope note: 運営会社: 富山地方鉄道。路線名: 本線。鉄道区分: 普通鉄道（12）。事業者種別: 民営鉄道（4）。

高萩
type: Concept
alternative label: 高萩（東日本旅客鉄道 常磐線）
broader: g001903
in scheme: scheme
notation: 001903
scope note: 運営会社: 東日本旅客鉄道。路線名: 常磐線。鉄道区分: 普通鉄道JR（11）。事業者種別: JR在来線（2）。

二塚
type: Concept
alternative label: 二塚（西日本旅客鉄道 城端線）
broader: g001904
in scheme: scheme
notation: 001904
scope note: 運営会社: 西日本旅客鉄道。路線名: 城端線。鉄道区分: 普通鉄道JR（11）。事業者種別: JR在来線（2）。

桜沢
type: Concept
alternative label: 桜沢（長野電鉄 長野線）
broader: g001905
in scheme: scheme
notation: 001905
scope note: 運営会社: 長野電鉄。路線名: 長野線。鉄道区分: 普通鉄道（12）。事業者種別: 民営鉄道（4）。

下奥井
type: Concept
alternative label: 下奥井（富山地方鉄道 富山港線）
broader: g001906
in scheme: scheme
notation: 001906
scope note: 運営会社: 富山地方鉄道。路線名: 富山港線。鉄道区分: 普通鉄道（12）。事業者種別: 民営鉄道（4）。

豊野
type: Concept
alternative label: 豊野（東日本旅客鉄道 飯山線）
broader: g001907
in scheme: scheme
notation: 001907
scope note: 運営会社: 東日本旅客鉄道。路線名: 飯山線。鉄道区分: 普通鉄道JR（11）。事業者種別: JR在来線（2）。

豊野
type: Concept
alternative label: 豊野（しなの鉄道 北しなの線）
broader: g001907
in scheme: scheme
notation: 001908
scope note: 運営会社: しなの鉄道。路線名: 北しなの線。鉄道区分: 普通鉄道（12）。事業者種別: 第三セクター（5）。

小屋平
type: Concept
alternative label: 小屋平（黒部峡谷鉄道 本線）
broader: g001909
in scheme: scheme
notation: 001909
scope note: 運営会社: 黒部峡谷鉄道。路線名: 本線。鉄道区分: 普通鉄道（12）。事業者種別: 民営鉄道（4）。

信濃森上
type: Concept
alternative label: 信濃森上（東日本旅客鉄道 大糸線）
broader: g001910
in scheme: scheme
notation: 001910
scope note: 運営会社: 東日本旅客鉄道。路線名: 大糸線。鉄道区分: 普通鉄道JR（11）。事業者種別: JR在来線（2）。

福岡
type: Concept
alternative label: 福岡（あいの風とやま鉄道 あいの風とやま鉄道線）
broader: g001911
in scheme: scheme
notation: 001911
scope note: 運営会社: あいの風とやま鉄道。路線名: あいの風とやま鉄道線。鉄道区分: 普通鉄道（12）。事業者種別: 第三セクター（5）。

越中舟橋
type: Concept
alternative label: 越中舟橋（富山地方鉄道 本線）
broader: g001912
in scheme: scheme
notation: 001912
scope note: 運営会社: 富山地方鉄道。路線名: 本線。鉄道区分: 普通鉄道（12）。事業者種別: 民営鉄道（4）。

林
type: Concept
alternative label: 林（西日本旅客鉄道 城端線）
broader: g001913
in scheme: scheme
notation: 001913
scope note: 運営会社: 西日本旅客鉄道。路線名: 城端線。鉄道区分: 普通鉄道JR（11）。事業者種別: JR在来線（2）。

上市
type: Concept
alternative label: 上市（富山地方鉄道 本線）
broader: g001914
in scheme: scheme
notation: 001914
scope note: 運営会社: 富山地方鉄道。路線名: 本線。鉄道区分: 普通鉄道（12）。事業者種別: 民営鉄道（4）。

都住
type: Concept
alternative label: 都住（長野電鉄 長野線）
broader: g001915
in scheme: scheme
notation: 001915
scope note: 運営会社: 長野電鉄。路線名: 長野線。鉄道区分: 普通鉄道（12）。事業者種別: 民営鉄道（4）。

オークスカナルパークホテル富山前
type: Concept
alternative label: オークスカナルパークホテル富山前（富山地方鉄道 富山港線）
broader: g001916
in scheme: scheme
notation: 001916
scope note: 運営会社: 富山地方鉄道。路線名: 富山港線。鉄道区分: 軌道（21）。事業者種別: 民営鉄道（4）。

インテック本社前
type: Concept
alternative label: インテック本社前（富山地方鉄道 富山港線）
broader: g001917
in scheme: scheme
notation: 001917
scope note: 運営会社: 富山地方鉄道。路線名: 富山港線。鉄道区分: 軌道（21）。事業者種別: 民営鉄道（4）。

奥田中学校前
type: Concept
alternative label: 奥田中学校前（富山地方鉄道 富山港線）
broader: g001918
in scheme: scheme
notation: 001918
scope note: 運営会社: 富山地方鉄道。路線名: 富山港線。鉄道区分: 普通鉄道（12）。事業者種別: 民営鉄道（4）。

越中三郷
type: Concept
alternative label: 越中三郷（富山地方鉄道 本線）
broader: g001919
in scheme: scheme
notation: 001919
scope note: 運営会社: 富山地方鉄道。路線名: 本線。鉄道区分: 普通鉄道（12）。事業者種別: 民営鉄道（4）。

新相ノ木
type: Concept
alternative label: 新相ノ木（富山地方鉄道 本線）
broader: g001920
in scheme: scheme
notation: 001920
scope note: 運営会社: 富山地方鉄道。路線名: 本線。鉄道区分: 普通鉄道（12）。事業者種別: 民営鉄道（4）。

龍谷富山高校前（永楽町）
type: Concept
alternative label: 龍谷富山高校前（永楽町）（富山地方鉄道 富山港線）
broader: g001921
in scheme: scheme
notation: 001921
scope note: 運営会社: 富山地方鉄道。路線名: 富山港線。鉄道区分: 軌道（21）。事業者種別: 民営鉄道（4）。

相ノ木
type: Concept
alternative label: 相ノ木（富山地方鉄道 本線）
broader: g001922
in scheme: scheme
notation: 001922
scope note: 運営会社: 富山地方鉄道。路線名: 本線。鉄道区分: 普通鉄道（12）。事業者種別: 民営鉄道（4）。

富山駅
type: Concept
alternative label: 富山駅（富山地方鉄道 富山駅南北接続線）
broader: g001923
in scheme: scheme
notation: 001923
scope note: 運営会社: 富山地方鉄道。路線名: 富山駅南北接続線。鉄道区分: 軌道（21）。事業者種別: 民営鉄道（4）。

富山駅
type: Concept
alternative label: 富山駅（富山地方鉄道 富山港線）
broader: g001923
in scheme: scheme
notation: 001924
scope note: 運営会社: 富山地方鉄道。路線名: 富山港線。鉄道区分: 軌道（21）。事業者種別: 民営鉄道（4）。

富山
type: Concept
alternative label: 富山（西日本旅客鉄道 高山線）
broader: g001925
in scheme: scheme
notation: 001925
scope note: 運営会社: 西日本旅客鉄道。路線名: 高山線。鉄道区分: 普通鉄道JR（11）。事業者種別: JR在来線（2）。

富山
type: Concept
alternative label: 富山（あいの風とやま鉄道 あいの風とやま鉄道線）
broader: g001925
in scheme: scheme
notation: 001926
scope note: 運営会社: あいの風とやま鉄道。路線名: あいの風とやま鉄道線。鉄道区分: 普通鉄道（12）。事業者種別: 第三セクター（5）。

富山
type: Concept
alternative label: 富山（西日本旅客鉄道 北陸新幹線）
broader: g001925
in scheme: scheme
notation: 001927
scope note: 運営会社: 西日本旅客鉄道。路線名: 北陸新幹線。鉄道区分: 普通鉄道JR（11）。事業者種別: JRの新幹線（1）。

電鉄富山
type: Concept
alternative label: 電鉄富山（富山地方鉄道 本線）
broader: g001928
in scheme: scheme
notation: 001928
scope note: 運営会社: 富山地方鉄道。路線名: 本線。鉄道区分: 普通鉄道（12）。事業者種別: 民営鉄道（4）。

電鉄富山駅・エスタ前
type: Concept
alternative label: 電鉄富山駅・エスタ前（富山地方鉄道 支線）
broader: g001929
in scheme: scheme
notation: 001929
scope note: 運営会社: 富山地方鉄道。路線名: 支線。鉄道区分: 軌道（21）。事業者種別: 民営鉄道（4）。

電鉄富山駅・エスタ前
type: Concept
alternative label: 電鉄富山駅・エスタ前（富山地方鉄道 本線）
broader: g001929
in scheme: scheme
notation: 001930
scope note: 運営会社: 富山地方鉄道。路線名: 本線。鉄道区分: 軌道（21）。事業者種別: 民営鉄道（4）。

越中泉
type: Concept
alternative label: 越中泉（富山地方鉄道 本線）
broader: g001931
in scheme: scheme
notation: 001931
scope note: 運営会社: 富山地方鉄道。路線名: 本線。鉄道区分: 普通鉄道（12）。事業者種別: 民営鉄道（4）。

西富山
type: Concept
alternative label: 西富山（西日本旅客鉄道 高山線）
broader: g001932
in scheme: scheme
notation: 001932
scope note: 運営会社: 西日本旅客鉄道。路線名: 高山線。鉄道区分: 普通鉄道JR（11）。事業者種別: JR在来線（2）。

小布施
type: Concept
alternative label: 小布施（長野電鉄 長野線）
broader: g001933
in scheme: scheme
notation: 001933
scope note: 運営会社: 長野電鉄。路線名: 長野線。鉄道区分: 普通鉄道（12）。事業者種別: 民営鉄道（4）。

越中荏原
type: Concept
alternative label: 越中荏原（富山地方鉄道 本線）
broader: g001934
in scheme: scheme
notation: 001934
scope note: 運営会社: 富山地方鉄道。路線名: 本線。鉄道区分: 普通鉄道（12）。事業者種別: 民営鉄道（4）。

富山大学前
type: Concept
alternative label: 富山大学前（富山地方鉄道 呉羽線）
broader: g001935
in scheme: scheme
notation: 001935
scope note: 運営会社: 富山地方鉄道。路線名: 呉羽線。鉄道区分: 軌道（21）。事業者種別: 民営鉄道（4）。

新富町
type: Concept
alternative label: 新富町（富山地方鉄道 支線）
broader: g001936
in scheme: scheme
notation: 001936
scope note: 運営会社: 富山地方鉄道。路線名: 支線。鉄道区分: 軌道（21）。事業者種別: 民営鉄道（4）。

寺田
type: Concept
alternative label: 寺田（富山地方鉄道 本線）
broader: g001937
in scheme: scheme
notation: 001937
scope note: 運営会社: 富山地方鉄道。路線名: 本線。鉄道区分: 普通鉄道（12）。事業者種別: 民営鉄道（4）。

東新庄
type: Concept
alternative label: 東新庄（富山地方鉄道 本線）
broader: g001938
in scheme: scheme
notation: 001938
scope note: 運営会社: 富山地方鉄道。路線名: 本線。鉄道区分: 普通鉄道（12）。事業者種別: 民営鉄道（4）。

地鉄ビル前
type: Concept
alternative label: 地鉄ビル前（富山地方鉄道 本線）
broader: g001939
in scheme: scheme
notation: 001939
scope note: 運営会社: 富山地方鉄道。路線名: 本線。鉄道区分: 軌道（21）。事業者種別: 民営鉄道（4）。

寺田
type: Concept
alternative label: 寺田（富山地方鉄道 立山線）
broader: g001937
in scheme: scheme
notation: 001940
scope note: 運営会社: 富山地方鉄道。路線名: 立山線。鉄道区分: 普通鉄道（12）。事業者種別: 民営鉄道（4）。

新庄田中
type: Concept
alternative label: 新庄田中（富山地方鉄道 本線）
broader: g001941
in scheme: scheme
notation: 001941
scope note: 運営会社: 富山地方鉄道。路線名: 本線。鉄道区分: 普通鉄道（12）。事業者種別: 民営鉄道（4）。

電気ビル前
type: Concept
alternative label: 電気ビル前（富山地方鉄道 本線）
broader: g001942
in scheme: scheme
notation: 001942
scope note: 運営会社: 富山地方鉄道。路線名: 本線。鉄道区分: 軌道（21）。事業者種別: 民営鉄道（4）。

稲荷町
type: Concept
alternative label: 稲荷町（富山地方鉄道 本線）
broader: g001943
in scheme: scheme
notation: 001943
scope note: 運営会社: 富山地方鉄道。路線名: 本線。鉄道区分: 普通鉄道（12）。事業者種別: 民営鉄道（4）。

欅平
type: Concept
alternative label: 欅平（黒部峡谷鉄道 本線）
broader: g001944
in scheme: scheme
notation: 001944
scope note: 運営会社: 黒部峡谷鉄道。路線名: 本線。鉄道区分: 普通鉄道（12）。事業者種別: 民営鉄道（4）。

稲荷町
type: Concept
alternative label: 稲荷町（富山地方鉄道 不二越線）
broader: g001943
in scheme: scheme
notation: 001945
scope note: 運営会社: 富山地方鉄道。路線名: 不二越線。鉄道区分: 普通鉄道（12）。事業者種別: 民営鉄道（4）。

白馬
type: Concept
alternative label: 白馬（東日本旅客鉄道 大糸線）
broader: g001946
in scheme: scheme
notation: 001946
scope note: 運営会社: 東日本旅客鉄道。路線名: 大糸線。鉄道区分: 普通鉄道JR（11）。事業者種別: JR在来線（2）。

トヨタモビリティ富山Gスクエア五福前（五福末広町）
type: Concept
alternative label: トヨタモビリティ富山Gスクエア五福前（五福末広町）（富山地方鉄道 呉羽線）
broader: g001947
in scheme: scheme
notation: 001947
scope note: 運営会社: 富山地方鉄道。路線名: 呉羽線。鉄道区分: 軌道（21）。事業者種別: 民営鉄道（4）。

県庁前
type: Concept
alternative label: 県庁前（富山地方鉄道 支線）
broader: g001948
in scheme: scheme
notation: 001948
scope note: 運営会社: 富山地方鉄道。路線名: 支線。鉄道区分: 軌道（21）。事業者種別: 民営鉄道（4）。

西金
type: Concept
alternative label: 西金（東日本旅客鉄道 水郡線）
broader: g001949
in scheme: scheme
notation: 001949
scope note: 運営会社: 東日本旅客鉄道。路線名: 水郡線。鉄道区分: 普通鉄道JR（11）。事業者種別: JR在来線（2）。

桜橋
type: Concept
alternative label: 桜橋（富山地方鉄道 本線）
broader: g001950
in scheme: scheme
notation: 001950
scope note: 運営会社: 富山地方鉄道。路線名: 本線。鉄道区分: 軌道（21）。事業者種別: 民営鉄道（4）。

能瀬
type: Concept
alternative label: 能瀬（西日本旅客鉄道 七尾線）
broader: g001951
in scheme: scheme
notation: 001951
scope note: 運営会社: 西日本旅客鉄道。路線名: 七尾線。鉄道区分: 普通鉄道JR（11）。事業者種別: JR在来線（2）。

上毛高原
type: Concept
alternative label: 上毛高原（東日本旅客鉄道 上越新幹線）
broader: g001952
in scheme: scheme
notation: 001952
scope note: 運営会社: 東日本旅客鉄道。路線名: 上越新幹線。鉄道区分: 普通鉄道JR（11）。事業者種別: JRの新幹線（1）。

丸の内
type: Concept
alternative label: 丸の内（富山地方鉄道 安野屋線）
broader: g001953
in scheme: scheme
notation: 001953
scope note: 運営会社: 富山地方鉄道。路線名: 安野屋線。鉄道区分: 軌道（21）。事業者種別: 民営鉄道（4）。

丸の内
type: Concept
alternative label: 丸の内（富山地方鉄道 支線）
broader: g001953
in scheme: scheme
notation: 001954
scope note: 運営会社: 富山地方鉄道。路線名: 支線。鉄道区分: 軌道（21）。事業者種別: 民営鉄道（4）。

丸の内
type: Concept
alternative label: 丸の内（富山地方鉄道 富山都心線）
broader: g001953
in scheme: scheme
notation: 001955
scope note: 運営会社: 富山地方鉄道。路線名: 富山都心線。鉄道区分: 軌道（21）。事業者種別: 民営鉄道（4）。

安野屋
type: Concept
alternative label: 安野屋（富山地方鉄道 安野屋線）
broader: g001956
in scheme: scheme
notation: 001956
scope note: 運営会社: 富山地方鉄道。路線名: 安野屋線。鉄道区分: 軌道（21）。事業者種別: 民営鉄道（4）。

安野屋
type: Concept
alternative label: 安野屋（富山地方鉄道 呉羽線）
broader: g001956
in scheme: scheme
notation: 001957
scope note: 運営会社: 富山地方鉄道。路線名: 呉羽線。鉄道区分: 軌道（21）。事業者種別: 民営鉄道（4）。

諏訪川原
type: Concept
alternative label: 諏訪川原（富山地方鉄道 安野屋線）
broader: g001958
in scheme: scheme
notation: 001958
scope note: 運営会社: 富山地方鉄道。路線名: 安野屋線。鉄道区分: 軌道（21）。事業者種別: 民営鉄道（4）。

国際会議場前
type: Concept
alternative label: 国際会議場前（富山地方鉄道 富山都心線）
broader: g001959
in scheme: scheme
notation: 001959
scope note: 運営会社: 富山地方鉄道。路線名: 富山都心線。鉄道区分: 軌道（21）。事業者種別: 民営鉄道（4）。

荒町
type: Concept
alternative label: 荒町（富山地方鉄道 本線）
broader: g001960
in scheme: scheme
notation: 001960
scope note: 運営会社: 富山地方鉄道。路線名: 本線。鉄道区分: 軌道（21）。事業者種別: 民営鉄道（4）。

栄町
type: Concept
alternative label: 栄町（富山地方鉄道 不二越線）
broader: g001961
in scheme: scheme
notation: 001961
scope note: 運営会社: 富山地方鉄道。路線名: 不二越線。鉄道区分: 普通鉄道（12）。事業者種別: 民営鉄道（4）。

中町（西町北）
type: Concept
alternative label: 中町（西町北）（富山地方鉄道 本線）
broader: g001962
in scheme: scheme
notation: 001962
scope note: 運営会社: 富山地方鉄道。路線名: 本線。鉄道区分: 軌道（21）。事業者種別: 民営鉄道（4）。

大手モール
type: Concept
alternative label: 大手モール（富山地方鉄道 富山都心線）
broader: g001963
in scheme: scheme
notation: 001963
scope note: 運営会社: 富山地方鉄道。路線名: 富山都心線。鉄道区分: 軌道（21）。事業者種別: 民営鉄道（4）。

西町
type: Concept
alternative label: 西町（富山地方鉄道 富山都心線）
broader: g001964
in scheme: scheme
notation: 001964
scope note: 運営会社: 富山地方鉄道。路線名: 富山都心線。鉄道区分: 軌道（21）。事業者種別: 民営鉄道（4）。

西町
type: Concept
alternative label: 西町（富山地方鉄道 本線）
broader: g001964
in scheme: scheme
notation: 001965
scope note: 運営会社: 富山地方鉄道。路線名: 本線。鉄道区分: 軌道（21）。事業者種別: 民営鉄道（4）。

グランドプラザ前
type: Concept
alternative label: グランドプラザ前（富山地方鉄道 富山都心線）
broader: g001966
in scheme: scheme
notation: 001966
scope note: 運営会社: 富山地方鉄道。路線名: 富山都心線。鉄道区分: 軌道（21）。事業者種別: 民営鉄道（4）。

不二越
type: Concept
alternative label: 不二越（富山地方鉄道 不二越線）
broader: g001967
in scheme: scheme
notation: 001967
scope note: 運営会社: 富山地方鉄道。路線名: 不二越線。鉄道区分: 普通鉄道（12）。事業者種別: 民営鉄道（4）。

三才
type: Concept
alternative label: 三才（しなの鉄道 北しなの線）
broader: g001968
in scheme: scheme
notation: 001968
scope note: 運営会社: しなの鉄道。路線名: 北しなの線。鉄道区分: 普通鉄道（12）。事業者種別: 第三セクター（5）。

稚子塚
type: Concept
alternative label: 稚子塚（富山地方鉄道 立山線）
broader: g001969
in scheme: scheme
notation: 001969
scope note: 運営会社: 富山地方鉄道。路線名: 立山線。鉄道区分: 普通鉄道（12）。事業者種別: 民営鉄道（4）。

下野大沢
type: Concept
alternative label: 下野大沢（東日本旅客鉄道 日光線）
broader: g001970
in scheme: scheme
notation: 001970
scope note: 運営会社: 東日本旅客鉄道。路線名: 日光線。鉄道区分: 普通鉄道JR（11）。事業者種別: JR在来線（2）。

上本町
type: Concept
alternative label: 上本町（富山地方鉄道 本線）
broader: g001971
in scheme: scheme
notation: 001971
scope note: 運営会社: 富山地方鉄道。路線名: 本線。鉄道区分: 軌道（21）。事業者種別: 民営鉄道（4）。

戸出
type: Concept
alternative label: 戸出（西日本旅客鉄道 城端線）
broader: g001972
in scheme: scheme
notation: 001972
scope note: 運営会社: 西日本旅客鉄道。路線名: 城端線。鉄道区分: 普通鉄道JR（11）。事業者種別: JR在来線（2）。

広貫堂前
type: Concept
alternative label: 広貫堂前（富山地方鉄道 本線）
broader: g001973
in scheme: scheme
notation: 001973
scope note: 運営会社: 富山地方鉄道。路線名: 本線。鉄道区分: 軌道（21）。事業者種別: 民営鉄道（4）。

氏家
type: Concept
alternative label: 氏家（東日本旅客鉄道 東北線）
broader: g001974
in scheme: scheme
notation: 001974
scope note: 運営会社: 東日本旅客鉄道。路線名: 東北線。鉄道区分: 普通鉄道JR（11）。事業者種別: JR在来線（2）。

西中野
type: Concept
alternative label: 西中野（富山地方鉄道 本線）
broader: g001975
in scheme: scheme
notation: 001975
scope note: 運営会社: 富山地方鉄道。路線名: 本線。鉄道区分: 軌道（21）。事業者種別: 民営鉄道（4）。

田添
type: Concept
alternative label: 田添（富山地方鉄道 立山線）
broader: g001976
in scheme: scheme
notation: 001976
scope note: 運営会社: 富山地方鉄道。路線名: 立山線。鉄道区分: 普通鉄道（12）。事業者種別: 民営鉄道（4）。

後閑
type: Concept
alternative label: 後閑（東日本旅客鉄道 上越線）
broader: g001977
in scheme: scheme
notation: 001977
scope note: 運営会社: 東日本旅客鉄道。路線名: 上越線。鉄道区分: 普通鉄道JR（11）。事業者種別: JR在来線（2）。

小泉町
type: Concept
alternative label: 小泉町（富山地方鉄道 本線）
broader: g001978
in scheme: scheme
notation: 001978
scope note: 運営会社: 富山地方鉄道。路線名: 本線。鉄道区分: 軌道（21）。事業者種別: 民営鉄道（4）。

北須坂
type: Concept
alternative label: 北須坂（長野電鉄 長野線）
broader: g001979
in scheme: scheme
notation: 001979
scope note: 運営会社: 長野電鉄。路線名: 長野線。鉄道区分: 普通鉄道（12）。事業者種別: 民営鉄道（4）。

大泉
type: Concept
alternative label: 大泉（富山地方鉄道 不二越線）
broader: g001980
in scheme: scheme
notation: 001980
scope note: 運営会社: 富山地方鉄道。路線名: 不二越線。鉄道区分: 普通鉄道（12）。事業者種別: 民営鉄道（4）。

婦中鵜坂
type: Concept
alternative label: 婦中鵜坂（西日本旅客鉄道 高山線）
broader: g001981
in scheme: scheme
notation: 001981
scope note: 運営会社: 西日本旅客鉄道。路線名: 高山線。鉄道区分: 普通鉄道JR（11）。事業者種別: JR在来線（2）。

本津幡
type: Concept
alternative label: 本津幡（西日本旅客鉄道 七尾線）
broader: g001982
in scheme: scheme
notation: 001982
scope note: 運営会社: 西日本旅客鉄道。路線名: 七尾線。鉄道区分: 普通鉄道JR（11）。事業者種別: JR在来線（2）。

明神
type: Concept
alternative label: 明神（東武鉄道 日光線）
broader: g001983
in scheme: scheme
notation: 001983
scope note: 運営会社: 東武鉄道。路線名: 日光線。鉄道区分: 普通鉄道（12）。事業者種別: 民営鉄道（4）。

堀川小泉
type: Concept
alternative label: 堀川小泉（富山地方鉄道 本線）
broader: g001984
in scheme: scheme
notation: 001984
scope note: 運営会社: 富山地方鉄道。路線名: 本線。鉄道区分: 軌道（21）。事業者種別: 民営鉄道（4）。

大町
type: Concept
alternative label: 大町（富山地方鉄道 本線）
broader: g001985
in scheme: scheme
notation: 001985
scope note: 運営会社: 富山地方鉄道。路線名: 本線。鉄道区分: 軌道（21）。事業者種別: 民営鉄道（4）。

倶利伽羅
type: Concept
alternative label: 倶利伽羅（IRいしかわ鉄道 IRいしかわ鉄道線）
broader: g001986
in scheme: scheme
notation: 001986
scope note: 運営会社: IRいしかわ鉄道。路線名: IRいしかわ鉄道線。鉄道区分: 普通鉄道（12）。事業者種別: 第三セクター（5）。

倶利伽羅
type: Concept
alternative label: 倶利伽羅（あいの風とやま鉄道 あいの風とやま鉄道線）
broader: g001986
in scheme: scheme
notation: 001987
scope note: 運営会社: あいの風とやま鉄道。路線名: あいの風とやま鉄道線。鉄道区分: 普通鉄道（12）。事業者種別: 第三セクター（5）。

石動
type: Concept
alternative label: 石動（あいの風とやま鉄道 あいの風とやま鉄道線）
broader: g001988
in scheme: scheme
notation: 001988
scope note: 運営会社: あいの風とやま鉄道。路線名: あいの風とやま鉄道線。鉄道区分: 普通鉄道（12）。事業者種別: 第三セクター（5）。

中津幡
type: Concept
alternative label: 中津幡（西日本旅客鉄道 七尾線）
broader: g001989
in scheme: scheme
notation: 001989
scope note: 運営会社: 西日本旅客鉄道。路線名: 七尾線。鉄道区分: 普通鉄道JR（11）。事業者種別: JR在来線（2）。

十王
type: Concept
alternative label: 十王（東日本旅客鉄道 常磐線）
broader: g001990
in scheme: scheme
notation: 001990
scope note: 運営会社: 東日本旅客鉄道。路線名: 常磐線。鉄道区分: 普通鉄道JR（11）。事業者種別: JR在来線（2）。

南富山駅前
type: Concept
alternative label: 南富山駅前（富山地方鉄道 本線）
broader: g001991
in scheme: scheme
notation: 001991
scope note: 運営会社: 富山地方鉄道。路線名: 本線。鉄道区分: 軌道（21）。事業者種別: 民営鉄道（4）。

飯森
type: Concept
alternative label: 飯森（東日本旅客鉄道 大糸線）
broader: g001992
in scheme: scheme
notation: 001992
scope note: 運営会社: 東日本旅客鉄道。路線名: 大糸線。鉄道区分: 普通鉄道JR（11）。事業者種別: JR在来線（2）。

南富山
type: Concept
alternative label: 南富山（富山地方鉄道 上滝線）
broader: g001993
in scheme: scheme
notation: 001993
scope note: 運営会社: 富山地方鉄道。路線名: 上滝線。鉄道区分: 普通鉄道（12）。事業者種別: 民営鉄道（4）。

南富山
type: Concept
alternative label: 南富山（富山地方鉄道 不二越線）
broader: g001993
in scheme: scheme
notation: 001994
scope note: 運営会社: 富山地方鉄道。路線名: 不二越線。鉄道区分: 普通鉄道（12）。事業者種別: 民営鉄道（4）。

下小川
type: Concept
alternative label: 下小川（東日本旅客鉄道 水郡線）
broader: g001995
in scheme: scheme
notation: 001995
scope note: 運営会社: 東日本旅客鉄道。路線名: 水郡線。鉄道区分: 普通鉄道JR（11）。事業者種別: JR在来線（2）。

信濃吉田
type: Concept
alternative label: 信濃吉田（長野電鉄 長野線）
broader: g001996
in scheme: scheme
notation: 001996
scope note: 運営会社: 長野電鉄。路線名: 長野線。鉄道区分: 普通鉄道（12）。事業者種別: 民営鉄道（4）。

鴻野山
type: Concept
alternative label: 鴻野山（東日本旅客鉄道 烏山線）
broader: g001997
in scheme: scheme
notation: 001997
scope note: 運営会社: 東日本旅客鉄道。路線名: 烏山線。鉄道区分: 普通鉄道JR（11）。事業者種別: JR在来線（2）。

朝陽
type: Concept
alternative label: 朝陽（長野電鉄 長野線）
broader: g001998
in scheme: scheme
notation: 001998
scope note: 運営会社: 長野電鉄。路線名: 長野線。鉄道区分: 普通鉄道（12）。事業者種別: 民営鉄道（4）。

桐原
type: Concept
alternative label: 桐原（長野電鉄 長野線）
broader: g001999
in scheme: scheme
notation: 001999
scope note: 運営会社: 長野電鉄。路線名: 長野線。鉄道区分: 普通鉄道（12）。事業者種別: 民営鉄道（4）。

五百石
type: Concept
alternative label: 五百石（富山地方鉄道 立山線）
broader: g002000
in scheme: scheme
notation: 002000
scope note: 運営会社: 富山地方鉄道。路線名: 立山線。鉄道区分: 普通鉄道（12）。事業者種別: 民営鉄道（4）。

北長野
type: Concept
alternative label: 北長野（しなの鉄道 北しなの線）
broader: g002001
in scheme: scheme
notation: 002001
scope note: 運営会社: しなの鉄道。路線名: 北しなの線。鉄道区分: 普通鉄道（12）。事業者種別: 第三セクター（5）。

速星
type: Concept
alternative label: 速星（西日本旅客鉄道 高山線）
broader: g002002
in scheme: scheme
notation: 002002
scope note: 運営会社: 西日本旅客鉄道。路線名: 高山線。鉄道区分: 普通鉄道JR（11）。事業者種別: JR在来線（2）。

柳原
type: Concept
alternative label: 柳原（長野電鉄 長野線）
broader: g002003
in scheme: scheme
notation: 002003
scope note: 運営会社: 長野電鉄。路線名: 長野線。鉄道区分: 普通鉄道（12）。事業者種別: 民営鉄道（4）。

附属中学前
type: Concept
alternative label: 附属中学前（長野電鉄 長野線）
broader: g002004
in scheme: scheme
notation: 002004
scope note: 運営会社: 長野電鉄。路線名: 長野線。鉄道区分: 普通鉄道（12）。事業者種別: 民営鉄道（4）。

本郷
type: Concept
alternative label: 本郷（長野電鉄 長野線）
broader: g002005
in scheme: scheme
notation: 002005
scope note: 運営会社: 長野電鉄。路線名: 長野線。鉄道区分: 普通鉄道（12）。事業者種別: 民営鉄道（4）。

朝菜町
type: Concept
alternative label: 朝菜町（富山地方鉄道 上滝線）
broader: g002006
in scheme: scheme
notation: 002006
scope note: 運営会社: 富山地方鉄道。路線名: 上滝線。鉄道区分: 普通鉄道（12）。事業者種別: 民営鉄道（4）。

村山
type: Concept
alternative label: 村山（長野電鉄 長野線）
broader: g002007
in scheme: scheme
notation: 002007
scope note: 運営会社: 長野電鉄。路線名: 長野線。鉄道区分: 普通鉄道（12）。事業者種別: 民営鉄道（4）。

善光寺下
type: Concept
alternative label: 善光寺下（長野電鉄 長野線）
broader: g002008
in scheme: scheme
notation: 002008
scope note: 運営会社: 長野電鉄。路線名: 長野線。鉄道区分: 普通鉄道（12）。事業者種別: 民営鉄道（4）。

神城
type: Concept
alternative label: 神城（東日本旅客鉄道 大糸線）
broader: g002009
in scheme: scheme
notation: 002009
scope note: 運営会社: 東日本旅客鉄道。路線名: 大糸線。鉄道区分: 普通鉄道JR（11）。事業者種別: JR在来線（2）。

津幡
type: Concept
alternative label: 津幡（西日本旅客鉄道 七尾線）
broader: g002010
in scheme: scheme
notation: 002010
scope note: 運営会社: 西日本旅客鉄道。路線名: 七尾線。鉄道区分: 普通鉄道JR（11）。事業者種別: JR在来線（2）。

津幡
type: Concept
alternative label: 津幡（IRいしかわ鉄道 IRいしかわ鉄道線）
broader: g002010
in scheme: scheme
notation: 002011
scope note: 運営会社: IRいしかわ鉄道。路線名: IRいしかわ鉄道線。鉄道区分: 普通鉄道（12）。事業者種別: 第三セクター（5）。

榎町
type: Concept
alternative label: 榎町（富山地方鉄道 立山線）
broader: g002012
in scheme: scheme
notation: 002012
scope note: 運営会社: 富山地方鉄道。路線名: 立山線。鉄道区分: 普通鉄道（12）。事業者種別: 民営鉄道（4）。

仁井田
type: Concept
alternative label: 仁井田（東日本旅客鉄道 烏山線）
broader: g002013
in scheme: scheme
notation: 002013
scope note: 運営会社: 東日本旅客鉄道。路線名: 烏山線。鉄道区分: 普通鉄道JR（11）。事業者種別: JR在来線（2）。

須坂
type: Concept
alternative label: 須坂（長野電鉄 長野線）
broader: g002014
in scheme: scheme
notation: 002014
scope note: 運営会社: 長野電鉄。路線名: 長野線。鉄道区分: 普通鉄道（12）。事業者種別: 民営鉄道（4）。

大金
type: Concept
alternative label: 大金（東日本旅客鉄道 烏山線）
broader: g002015
in scheme: scheme
notation: 002015
scope note: 運営会社: 東日本旅客鉄道。路線名: 烏山線。鉄道区分: 普通鉄道JR（11）。事業者種別: JR在来線（2）。

日野
type: Concept
alternative label: 日野（長野電鉄 長野線）
broader: g002016
in scheme: scheme
notation: 002016
scope note: 運営会社: 長野電鉄。路線名: 長野線。鉄道区分: 普通鉄道（12）。事業者種別: 民営鉄道（4）。

油田
type: Concept
alternative label: 油田（西日本旅客鉄道 城端線）
broader: g002017
in scheme: scheme
notation: 002017
scope note: 運営会社: 西日本旅客鉄道。路線名: 城端線。鉄道区分: 普通鉄道JR（11）。事業者種別: JR在来線（2）。

間藤
type: Concept
alternative label: 間藤（わたらせ渓谷鐵道 わたらせ渓谷線）
broader: g002018
in scheme: scheme
notation: 002018
scope note: 運営会社: わたらせ渓谷鐵道。路線名: わたらせ渓谷線。鉄道区分: 普通鉄道（12）。事業者種別: 第三セクター（5）。

上堀
type: Concept
alternative label: 上堀（富山地方鉄道 上滝線）
broader: g002019
in scheme: scheme
notation: 002019
scope note: 運営会社: 富山地方鉄道。路線名: 上滝線。鉄道区分: 普通鉄道（12）。事業者種別: 民営鉄道（4）。

権堂
type: Concept
alternative label: 権堂（長野電鉄 長野線）
broader: g002020
in scheme: scheme
notation: 002020
scope note: 運営会社: 長野電鉄。路線名: 長野線。鉄道区分: 普通鉄道（12）。事業者種別: 民営鉄道（4）。

下小代
type: Concept
alternative label: 下小代（東武鉄道 日光線）
broader: g002021
in scheme: scheme
notation: 002021
scope note: 運営会社: 東武鉄道。路線名: 日光線。鉄道区分: 普通鉄道（12）。事業者種別: 民営鉄道（4）。

烏山
type: Concept
alternative label: 烏山（東日本旅客鉄道 烏山線）
broader: g002022
in scheme: scheme
notation: 002022
scope note: 運営会社: 東日本旅客鉄道。路線名: 烏山線。鉄道区分: 普通鉄道JR（11）。事業者種別: JR在来線（2）。

下野花岡
type: Concept
alternative label: 下野花岡（東日本旅客鉄道 烏山線）
broader: g002023
in scheme: scheme
notation: 002023
scope note: 運営会社: 東日本旅客鉄道。路線名: 烏山線。鉄道区分: 普通鉄道JR（11）。事業者種別: JR在来線（2）。

小杉
type: Concept
alternative label: 小杉（富山地方鉄道 上滝線）
broader: g002024
in scheme: scheme
notation: 002024
scope note: 運営会社: 富山地方鉄道。路線名: 上滝線。鉄道区分: 普通鉄道（12）。事業者種別: 民営鉄道（4）。

滝
type: Concept
alternative label: 滝（東日本旅客鉄道 烏山線）
broader: g002025
in scheme: scheme
notation: 002025
scope note: 運営会社: 東日本旅客鉄道。路線名: 烏山線。鉄道区分: 普通鉄道JR（11）。事業者種別: JR在来線（2）。

市役所前
type: Concept
alternative label: 市役所前（長野電鉄 長野線）
broader: g002026
in scheme: scheme
notation: 002026
scope note: 運営会社: 長野電鉄。路線名: 長野線。鉄道区分: 普通鉄道（12）。事業者種別: 民営鉄道（4）。

下段
type: Concept
alternative label: 下段（富山地方鉄道 立山線）
broader: g002027
in scheme: scheme
notation: 002027
scope note: 運営会社: 富山地方鉄道。路線名: 立山線。鉄道区分: 普通鉄道（12）。事業者種別: 民営鉄道（4）。

中舟生
type: Concept
alternative label: 中舟生（東日本旅客鉄道 水郡線）
broader: g002028
in scheme: scheme
notation: 002028
scope note: 運営会社: 東日本旅客鉄道。路線名: 水郡線。鉄道区分: 普通鉄道JR（11）。事業者種別: JR在来線（2）。

布市
type: Concept
alternative label: 布市（富山地方鉄道 上滝線）
broader: g002029
in scheme: scheme
notation: 002029
scope note: 運営会社: 富山地方鉄道。路線名: 上滝線。鉄道区分: 普通鉄道（12）。事業者種別: 民営鉄道（4）。

長野
type: Concept
alternative label: 長野（長野電鉄 長野線）
broader: g002031
in scheme: scheme
notation: 002030
scope note: 運営会社: 長野電鉄。路線名: 長野線。鉄道区分: 普通鉄道（12）。事業者種別: 民営鉄道（4）。

長野
type: Concept
alternative label: 長野（東日本旅客鉄道 信越線）
broader: g002031
in scheme: scheme
notation: 002031
scope note: 運営会社: 東日本旅客鉄道。路線名: 信越線。鉄道区分: 普通鉄道JR（11）。事業者種別: JR在来線（2）。

長野
type: Concept
alternative label: 長野（しなの鉄道 北しなの線）
broader: g002031
in scheme: scheme
notation: 002032
scope note: 運営会社: しなの鉄道。路線名: 北しなの線。鉄道区分: 普通鉄道（12）。事業者種別: 第三セクター（5）。

小塙
type: Concept
alternative label: 小塙（東日本旅客鉄道 烏山線）
broader: g002033
in scheme: scheme
notation: 002033
scope note: 運営会社: 東日本旅客鉄道。路線名: 烏山線。鉄道区分: 普通鉄道JR（11）。事業者種別: JR在来線（2）。

長野
type: Concept
alternative label: 長野（東日本旅客鉄道 北陸新幹線）
broader: g002031
in scheme: scheme
notation: 002034
scope note: 運営会社: 東日本旅客鉄道。路線名: 北陸新幹線。鉄道区分: 普通鉄道JR（11）。事業者種別: JRの新幹線（1）。

沼田
type: Concept
alternative label: 沼田（東日本旅客鉄道 上越線）
broader: g002035
in scheme: scheme
notation: 002035
scope note: 運営会社: 東日本旅客鉄道。路線名: 上越線。鉄道区分: 普通鉄道JR（11）。事業者種別: JR在来線（2）。

足尾
type: Concept
alternative label: 足尾（わたらせ渓谷鐵道 わたらせ渓谷線）
broader: g002036
in scheme: scheme
notation: 002036
scope note: 運営会社: わたらせ渓谷鐵道。路線名: わたらせ渓谷線。鉄道区分: 普通鉄道（12）。事業者種別: 第三セクター（5）。

文挟
type: Concept
alternative label: 文挟（東日本旅客鉄道 日光線）
broader: g002037
in scheme: scheme
notation: 002037
scope note: 運営会社: 東日本旅客鉄道。路線名: 日光線。鉄道区分: 普通鉄道JR（11）。事業者種別: JR在来線（2）。

南神城
type: Concept
alternative label: 南神城（東日本旅客鉄道 大糸線）
broader: g002038
in scheme: scheme
notation: 002038
scope note: 運営会社: 東日本旅客鉄道。路線名: 大糸線。鉄道区分: 普通鉄道JR（11）。事業者種別: JR在来線（2）。

通洞
type: Concept
alternative label: 通洞（わたらせ渓谷鐵道 わたらせ渓谷線）
broader: g002039
in scheme: scheme
notation: 002039
scope note: 運営会社: わたらせ渓谷鐵道。路線名: わたらせ渓谷線。鉄道区分: 普通鉄道（12）。事業者種別: 第三セクター（5）。

小木津
type: Concept
alternative label: 小木津（東日本旅客鉄道 常磐線）
broader: g002040
in scheme: scheme
notation: 002040
scope note: 運営会社: 東日本旅客鉄道。路線名: 常磐線。鉄道区分: 普通鉄道JR（11）。事業者種別: JR在来線（2）。

砺波
type: Concept
alternative label: 砺波（西日本旅客鉄道 城端線）
broader: g002041
in scheme: scheme
notation: 002041
scope note: 運営会社: 西日本旅客鉄道。路線名: 城端線。鉄道区分: 普通鉄道JR（11）。事業者種別: JR在来線（2）。

開発
type: Concept
alternative label: 開発（富山地方鉄道 上滝線）
broader: g002042
in scheme: scheme
notation: 002042
scope note: 運営会社: 富山地方鉄道。路線名: 上滝線。鉄道区分: 普通鉄道（12）。事業者種別: 民営鉄道（4）。

千里
type: Concept
alternative label: 千里（西日本旅客鉄道 高山線）
broader: g002043
in scheme: scheme
notation: 002043
scope note: 運営会社: 西日本旅客鉄道。路線名: 高山線。鉄道区分: 普通鉄道JR（11）。事業者種別: JR在来線（2）。

釜ヶ淵
type: Concept
alternative label: 釜ヶ淵（富山地方鉄道 立山線）
broader: g002044
in scheme: scheme
notation: 002044
scope note: 運営会社: 富山地方鉄道。路線名: 立山線。鉄道区分: 普通鉄道（12）。事業者種別: 民営鉄道（4）。

内灘
type: Concept
alternative label: 内灘（北陸鉄道 浅野川線）
broader: g002045
in scheme: scheme
notation: 002045
scope note: 運営会社: 北陸鉄道。路線名: 浅野川線。鉄道区分: 普通鉄道（12）。事業者種別: 民営鉄道（4）。

宝積寺
type: Concept
alternative label: 宝積寺（東日本旅客鉄道 烏山線）
broader: g002046
in scheme: scheme
notation: 002046
scope note: 運営会社: 東日本旅客鉄道。路線名: 烏山線。鉄道区分: 普通鉄道JR（11）。事業者種別: JR在来線（2）。

宝積寺
type: Concept
alternative label: 宝積寺（東日本旅客鉄道 東北線）
broader: g002046
in scheme: scheme
notation: 002047
scope note: 運営会社: 東日本旅客鉄道。路線名: 東北線。鉄道区分: 普通鉄道JR（11）。事業者種別: JR在来線（2）。

粟ヶ崎
type: Concept
alternative label: 粟ヶ崎（北陸鉄道 浅野川線）
broader: g002048
in scheme: scheme
notation: 002048
scope note: 運営会社: 北陸鉄道。路線名: 浅野川線。鉄道区分: 普通鉄道（12）。事業者種別: 民営鉄道（4）。

安茂里
type: Concept
alternative label: 安茂里（東日本旅客鉄道 信越線）
broader: g002049
in scheme: scheme
notation: 002049
scope note: 運営会社: 東日本旅客鉄道。路線名: 信越線。鉄道区分: 普通鉄道JR（11）。事業者種別: JR在来線（2）。

月岡
type: Concept
alternative label: 月岡（富山地方鉄道 上滝線）
broader: g002050
in scheme: scheme
notation: 002050
scope note: 運営会社: 富山地方鉄道。路線名: 上滝線。鉄道区分: 普通鉄道（12）。事業者種別: 民営鉄道（4）。

蚊爪
type: Concept
alternative label: 蚊爪（北陸鉄道 浅野川線）
broader: g002051
in scheme: scheme
notation: 002051
scope note: 運営会社: 北陸鉄道。路線名: 浅野川線。鉄道区分: 普通鉄道（12）。事業者種別: 民営鉄道（4）。

山方宿
type: Concept
alternative label: 山方宿（東日本旅客鉄道 水郡線）
broader: g002052
in scheme: scheme
notation: 002052
scope note: 運営会社: 東日本旅客鉄道。路線名: 水郡線。鉄道区分: 普通鉄道JR（11）。事業者種別: JR在来線（2）。

北間
type: Concept
alternative label: 北間（北陸鉄道 浅野川線）
broader: g002053
in scheme: scheme
notation: 002053
scope note: 運営会社: 北陸鉄道。路線名: 浅野川線。鉄道区分: 普通鉄道（12）。事業者種別: 民営鉄道（4）。

沢中山
type: Concept
alternative label: 沢中山（富山地方鉄道 立山線）
broader: g002054
in scheme: scheme
notation: 002054
scope note: 運営会社: 富山地方鉄道。路線名: 立山線。鉄道区分: 普通鉄道（12）。事業者種別: 民営鉄道（4）。

大庄
type: Concept
alternative label: 大庄（富山地方鉄道 上滝線）
broader: g002055
in scheme: scheme
notation: 002055
scope note: 運営会社: 富山地方鉄道。路線名: 上滝線。鉄道区分: 普通鉄道（12）。事業者種別: 民営鉄道（4）。

板荷
type: Concept
alternative label: 板荷（東武鉄道 日光線）
broader: g002056
in scheme: scheme
notation: 002056
scope note: 運営会社: 東武鉄道。路線名: 日光線。鉄道区分: 普通鉄道（12）。事業者種別: 民営鉄道（4）。

東野尻
type: Concept
alternative label: 東野尻（西日本旅客鉄道 城端線）
broader: g002057
in scheme: scheme
notation: 002057
scope note: 運営会社: 西日本旅客鉄道。路線名: 城端線。鉄道区分: 普通鉄道JR（11）。事業者種別: JR在来線（2）。

原向
type: Concept
alternative label: 原向（わたらせ渓谷鐵道 わたらせ渓谷線）
broader: g002058
in scheme: scheme
notation: 002058
scope note: 運営会社: わたらせ渓谷鐵道。路線名: わたらせ渓谷線。鉄道区分: 普通鉄道（12）。事業者種別: 第三セクター（5）。

大河端
type: Concept
alternative label: 大河端（北陸鉄道 浅野川線）
broader: g002059
in scheme: scheme
notation: 002059
scope note: 運営会社: 北陸鉄道。路線名: 浅野川線。鉄道区分: 普通鉄道（12）。事業者種別: 民営鉄道（4）。

川中島
type: Concept
alternative label: 川中島（東日本旅客鉄道 信越線）
broader: g002060
in scheme: scheme
notation: 002060
scope note: 運営会社: 東日本旅客鉄道。路線名: 信越線。鉄道区分: 普通鉄道JR（11）。事業者種別: JR在来線（2）。

森本
type: Concept
alternative label: 森本（IRいしかわ鉄道 IRいしかわ鉄道線）
broader: g002061
in scheme: scheme
notation: 002061
scope note: 運営会社: IRいしかわ鉄道。路線名: IRいしかわ鉄道線。鉄道区分: 普通鉄道（12）。事業者種別: 第三セクター（5）。

三ツ屋
type: Concept
alternative label: 三ツ屋（北陸鉄道 浅野川線）
broader: g002062
in scheme: scheme
notation: 002062
scope note: 運営会社: 北陸鉄道。路線名: 浅野川線。鉄道区分: 普通鉄道（12）。事業者種別: 民営鉄道（4）。

上滝
type: Concept
alternative label: 上滝（富山地方鉄道 上滝線）
broader: g002063
in scheme: scheme
notation: 002063
scope note: 運営会社: 富山地方鉄道。路線名: 上滝線。鉄道区分: 普通鉄道（12）。事業者種別: 民営鉄道（4）。

岩峅寺
type: Concept
alternative label: 岩峅寺（富山地方鉄道 立山線）
broader: g002064
in scheme: scheme
notation: 002064
scope note: 運営会社: 富山地方鉄道。路線名: 立山線。鉄道区分: 普通鉄道（12）。事業者種別: 民営鉄道（4）。

岩峅寺
type: Concept
alternative label: 岩峅寺（富山地方鉄道 上滝線）
broader: g002064
in scheme: scheme
notation: 002065
scope note: 運営会社: 富山地方鉄道。路線名: 上滝線。鉄道区分: 普通鉄道（12）。事業者種別: 民営鉄道（4）。

大川寺
type: Concept
alternative label: 大川寺（富山地方鉄道 上滝線）
broader: g002066
in scheme: scheme
notation: 002066
scope note: 運営会社: 富山地方鉄道。路線名: 上滝線。鉄道区分: 普通鉄道（12）。事業者種別: 民営鉄道（4）。

高儀
type: Concept
alternative label: 高儀（西日本旅客鉄道 城端線）
broader: g002067
in scheme: scheme
notation: 002067
scope note: 運営会社: 西日本旅客鉄道。路線名: 城端線。鉄道区分: 普通鉄道JR（11）。事業者種別: JR在来線（2）。

三口
type: Concept
alternative label: 三口（北陸鉄道 浅野川線）
broader: g002068
in scheme: scheme
notation: 002068
scope note: 運営会社: 北陸鉄道。路線名: 浅野川線。鉄道区分: 普通鉄道（12）。事業者種別: 民営鉄道（4）。

野上原
type: Concept
alternative label: 野上原（東日本旅客鉄道 水郡線）
broader: g002069
in scheme: scheme
notation: 002069
scope note: 運営会社: 東日本旅客鉄道。路線名: 水郡線。鉄道区分: 普通鉄道JR（11）。事業者種別: JR在来線（2）。

割出
type: Concept
alternative label: 割出（北陸鉄道 浅野川線）
broader: g002070
in scheme: scheme
notation: 002070
scope note: 運営会社: 北陸鉄道。路線名: 浅野川線。鉄道区分: 普通鉄道（12）。事業者種別: 民営鉄道（4）。

岩本
type: Concept
alternative label: 岩本（東日本旅客鉄道 上越線）
broader: g002071
in scheme: scheme
notation: 002071
scope note: 運営会社: 東日本旅客鉄道。路線名: 上越線。鉄道区分: 普通鉄道JR（11）。事業者種別: JR在来線（2）。

岡本
type: Concept
alternative label: 岡本（東日本旅客鉄道 東北線）
broader: g002072
in scheme: scheme
notation: 002072
scope note: 運営会社: 東日本旅客鉄道。路線名: 東北線。鉄道区分: 普通鉄道JR（11）。事業者種別: JR在来線（2）。

磯部
type: Concept
alternative label: 磯部（北陸鉄道 浅野川線）
broader: g002073
in scheme: scheme
notation: 002073
scope note: 運営会社: 北陸鉄道。路線名: 浅野川線。鉄道区分: 普通鉄道（12）。事業者種別: 民営鉄道（4）。

今井
type: Concept
alternative label: 今井（東日本旅客鉄道 信越線）
broader: g002074
in scheme: scheme
notation: 002074
scope note: 運営会社: 東日本旅客鉄道。路線名: 信越線。鉄道区分: 普通鉄道JR（11）。事業者種別: JR在来線（2）。

簗場
type: Concept
alternative label: 簗場（東日本旅客鉄道 大糸線）
broader: g002075
in scheme: scheme
notation: 002075
scope note: 運営会社: 東日本旅客鉄道。路線名: 大糸線。鉄道区分: 普通鉄道JR（11）。事業者種別: JR在来線（2）。

東金沢
type: Concept
alternative label: 東金沢（IRいしかわ鉄道 IRいしかわ鉄道線）
broader: g002076
in scheme: scheme
notation: 002076
scope note: 運営会社: IRいしかわ鉄道。路線名: IRいしかわ鉄道線。鉄道区分: 普通鉄道（12）。事業者種別: 第三セクター（5）。

越中八尾
type: Concept
alternative label: 越中八尾（西日本旅客鉄道 高山線）
broader: g002077
in scheme: scheme
notation: 002077
scope note: 運営会社: 西日本旅客鉄道。路線名: 高山線。鉄道区分: 普通鉄道JR（11）。事業者種別: JR在来線（2）。

上諸江
type: Concept
alternative label: 上諸江（北陸鉄道 浅野川線）
broader: g002078
in scheme: scheme
notation: 002078
scope note: 運営会社: 北陸鉄道。路線名: 浅野川線。鉄道区分: 普通鉄道（12）。事業者種別: 民営鉄道（4）。

日立
type: Concept
alternative label: 日立（東日本旅客鉄道 常磐線）
broader: g002079
in scheme: scheme
notation: 002079
scope note: 運営会社: 東日本旅客鉄道。路線名: 常磐線。鉄道区分: 普通鉄道JR（11）。事業者種別: JR在来線（2）。

東八尾
type: Concept
alternative label: 東八尾（西日本旅客鉄道 高山線）
broader: g002080
in scheme: scheme
notation: 002080
scope note: 運営会社: 西日本旅客鉄道。路線名: 高山線。鉄道区分: 普通鉄道JR（11）。事業者種別: JR在来線（2）。

福野
type: Concept
alternative label: 福野（西日本旅客鉄道 城端線）
broader: g002081
in scheme: scheme
notation: 002081
scope note: 運営会社: 西日本旅客鉄道。路線名: 城端線。鉄道区分: 普通鉄道JR（11）。事業者種別: JR在来線（2）。

中之条
type: Concept
alternative label: 中之条（東日本旅客鉄道 吾妻線）
broader: g002082
in scheme: scheme
notation: 002082
scope note: 運営会社: 東日本旅客鉄道。路線名: 吾妻線。鉄道区分: 普通鉄道JR（11）。事業者種別: JR在来線（2）。

七ツ屋
type: Concept
alternative label: 七ツ屋（北陸鉄道 浅野川線）
broader: g002083
in scheme: scheme
notation: 002083
scope note: 運営会社: 北陸鉄道。路線名: 浅野川線。鉄道区分: 普通鉄道（12）。事業者種別: 民営鉄道（4）。

美女平
type: Concept
alternative label: 美女平（立山黒部貫光 鋼索線）
broader: g002084
in scheme: scheme
notation: 002084
scope note: 運営会社: 立山黒部貫光。路線名: 鋼索線。鉄道区分: 鋼索鉄道（13）。事業者種別: 民営鉄道（4）。

立山
type: Concept
alternative label: 立山（立山黒部貫光 鋼索線）
broader: g002085
in scheme: scheme
notation: 002085
scope note: 運営会社: 立山黒部貫光。路線名: 鋼索線。鉄道区分: 鋼索鉄道（13）。事業者種別: 民営鉄道（4）。

立山
type: Concept
alternative label: 立山（富山地方鉄道 立山線）
broader: g002085
in scheme: scheme
notation: 002086
scope note: 運営会社: 富山地方鉄道。路線名: 立山線。鉄道区分: 普通鉄道（12）。事業者種別: 民営鉄道（4）。

横江
type: Concept
alternative label: 横江（富山地方鉄道 立山線）
broader: g002087
in scheme: scheme
notation: 002087
scope note: 運営会社: 富山地方鉄道。路線名: 立山線。鉄道区分: 普通鉄道（12）。事業者種別: 民営鉄道（4）。

北鹿沼
type: Concept
alternative label: 北鹿沼（東武鉄道 日光線）
broader: g002088
in scheme: scheme
notation: 002088
scope note: 運営会社: 東武鉄道。路線名: 日光線。鉄道区分: 普通鉄道（12）。事業者種別: 民営鉄道（4）。

沢入
type: Concept
alternative label: 沢入（わたらせ渓谷鐵道 わたらせ渓谷線）
broader: g002089
in scheme: scheme
notation: 002089
scope note: 運営会社: わたらせ渓谷鐵道。路線名: わたらせ渓谷線。鉄道区分: 普通鉄道（12）。事業者種別: 第三セクター（5）。

玉川村
type: Concept
alternative label: 玉川村（東日本旅客鉄道 水郡線）
broader: g002090
in scheme: scheme
notation: 002090
scope note: 運営会社: 東日本旅客鉄道。路線名: 水郡線。鉄道区分: 普通鉄道JR（11）。事業者種別: JR在来線（2）。

北鉄金沢
type: Concept
alternative label: 北鉄金沢（北陸鉄道 浅野川線）
broader: g002091
in scheme: scheme
notation: 002091
scope note: 運営会社: 北陸鉄道。路線名: 浅野川線。鉄道区分: 普通鉄道（12）。事業者種別: 民営鉄道（4）。

金沢
type: Concept
alternative label: 金沢（IRいしかわ鉄道 IRいしかわ鉄道線）
broader: g002093
in scheme: scheme
notation: 002093
scope note: 運営会社: IRいしかわ鉄道。路線名: IRいしかわ鉄道線。鉄道区分: 普通鉄道（12）。事業者種別: 第三セクター（5）。

金沢
type: Concept
alternative label: 金沢（西日本旅客鉄道 北陸新幹線）
broader: g002093
in scheme: scheme
notation: 002094
scope note: 運営会社: 西日本旅客鉄道。路線名: 北陸新幹線。鉄道区分: 普通鉄道JR（11）。事業者種別: JRの新幹線（1）。

篠ノ井
type: Concept
alternative label: 篠ノ井（東日本旅客鉄道 篠ノ井線）
broader: g002096
in scheme: scheme
notation: 002096
scope note: 運営会社: 東日本旅客鉄道。路線名: 篠ノ井線。鉄道区分: 普通鉄道JR（11）。事業者種別: JR在来線（2）。

篠ノ井
type: Concept
alternative label: 篠ノ井（東日本旅客鉄道 信越線）
broader: g002096
in scheme: scheme
notation: 002097
scope note: 運営会社: 東日本旅客鉄道。路線名: 信越線。鉄道区分: 普通鉄道JR（11）。事業者種別: JR在来線（2）。

篠ノ井
type: Concept
alternative label: 篠ノ井（しなの鉄道 しなの鉄道線）
broader: g002096
in scheme: scheme
notation: 002098
scope note: 運営会社: しなの鉄道。路線名: しなの鉄道線。鉄道区分: 普通鉄道（12）。事業者種別: 第三セクター（5）。

東石黒
type: Concept
alternative label: 東石黒（西日本旅客鉄道 城端線）
broader: g002099
in scheme: scheme
notation: 002099
scope note: 運営会社: 西日本旅客鉄道。路線名: 城端線。鉄道区分: 普通鉄道JR（11）。事業者種別: JR在来線（2）。

本宮
type: Concept
alternative label: 本宮（富山地方鉄道 立山線）
broader: g002100
in scheme: scheme
notation: 002100
scope note: 運営会社: 富山地方鉄道。路線名: 立山線。鉄道区分: 普通鉄道（12）。事業者種別: 民営鉄道（4）。

千垣
type: Concept
alternative label: 千垣（富山地方鉄道 立山線）
broader: g002101
in scheme: scheme
notation: 002101
scope note: 運営会社: 富山地方鉄道。路線名: 立山線。鉄道区分: 普通鉄道（12）。事業者種別: 民営鉄道（4）。

有峰口
type: Concept
alternative label: 有峰口（富山地方鉄道 立山線）
broader: g002102
in scheme: scheme
notation: 002102
scope note: 運営会社: 富山地方鉄道。路線名: 立山線。鉄道区分: 普通鉄道（12）。事業者種別: 民営鉄道（4）。

群馬原町
type: Concept
alternative label: 群馬原町（東日本旅客鉄道 吾妻線）
broader: g002103
in scheme: scheme
notation: 002103
scope note: 運営会社: 東日本旅客鉄道。路線名: 吾妻線。鉄道区分: 普通鉄道JR（11）。事業者種別: JR在来線（2）。

鹿沼
type: Concept
alternative label: 鹿沼（東日本旅客鉄道 日光線）
broader: g002104
in scheme: scheme
notation: 002104
scope note: 運営会社: 東日本旅客鉄道。路線名: 日光線。鉄道区分: 普通鉄道JR（11）。事業者種別: JR在来線（2）。

市城
type: Concept
alternative label: 市城（東日本旅客鉄道 吾妻線）
broader: g002105
in scheme: scheme
notation: 002105
scope note: 運営会社: 東日本旅客鉄道。路線名: 吾妻線。鉄道区分: 普通鉄道JR（11）。事業者種別: JR在来線（2）。

黒部平
type: Concept
alternative label: 黒部平（立山黒部貫光 鋼索線）
broader: g002107
in scheme: scheme
notation: 002107
scope note: 運営会社: 立山黒部貫光。路線名: 鋼索線。鉄道区分: 鋼索鉄道（13）。事業者種別: 民営鉄道（4）。

黒部湖
type: Concept
alternative label: 黒部湖（立山黒部貫光 鋼索線）
broader: g002108
in scheme: scheme
notation: 002108
scope note: 運営会社: 立山黒部貫光。路線名: 鋼索線。鉄道区分: 鋼索鉄道（13）。事業者種別: 民営鉄道（4）。

海ノ口
type: Concept
alternative label: 海ノ口（東日本旅客鉄道 大糸線）
broader: g002109
in scheme: scheme
notation: 002109
scope note: 運営会社: 東日本旅客鉄道。路線名: 大糸線。鉄道区分: 普通鉄道JR（11）。事業者種別: JR在来線（2）。

岩島
type: Concept
alternative label: 岩島（東日本旅客鉄道 吾妻線）
broader: g002110
in scheme: scheme
notation: 002110
scope note: 運営会社: 東日本旅客鉄道。路線名: 吾妻線。鉄道区分: 普通鉄道JR（11）。事業者種別: JR在来線（2）。

笹津
type: Concept
alternative label: 笹津（西日本旅客鉄道 高山線）
broader: g002111
in scheme: scheme
notation: 002111
scope note: 運営会社: 西日本旅客鉄道。路線名: 高山線。鉄道区分: 普通鉄道JR（11）。事業者種別: JR在来線（2）。

津久田
type: Concept
alternative label: 津久田（東日本旅客鉄道 上越線）
broader: g002112
in scheme: scheme
notation: 002112
scope note: 運営会社: 東日本旅客鉄道。路線名: 上越線。鉄道区分: 普通鉄道JR（11）。事業者種別: JR在来線（2）。

宇都宮
type: Concept
alternative label: 宇都宮（東日本旅客鉄道 東北線）
broader: g002113
in scheme: scheme
notation: 002113
scope note: 運営会社: 東日本旅客鉄道。路線名: 東北線。鉄道区分: 普通鉄道JR（11）。事業者種別: JR在来線（2）。

宇都宮
type: Concept
alternative label: 宇都宮（東日本旅客鉄道 日光線）
broader: g002113
in scheme: scheme
notation: 002114
scope note: 運営会社: 東日本旅客鉄道。路線名: 日光線。鉄道区分: 普通鉄道JR（11）。事業者種別: JR在来線（2）。

宇都宮
type: Concept
alternative label: 宇都宮（東日本旅客鉄道 東北新幹線）
broader: g002113
in scheme: scheme
notation: 002115
scope note: 運営会社: 東日本旅客鉄道。路線名: 東北新幹線。鉄道区分: 普通鉄道JR（11）。事業者種別: JRの新幹線（1）。

東武宇都宮
type: Concept
alternative label: 東武宇都宮（東武鉄道 宇都宮線）
broader: g002116
in scheme: scheme
notation: 002116
scope note: 運営会社: 東武鉄道。路線名: 宇都宮線。鉄道区分: 普通鉄道（12）。事業者種別: 民営鉄道（4）。

福光
type: Concept
alternative label: 福光（西日本旅客鉄道 城端線）
broader: g002117
in scheme: scheme
notation: 002117
scope note: 運営会社: 西日本旅客鉄道。路線名: 城端線。鉄道区分: 普通鉄道JR（11）。事業者種別: JR在来線（2）。

新鹿沼
type: Concept
alternative label: 新鹿沼（東武鉄道 日光線）
broader: g002118
in scheme: scheme
notation: 002118
scope note: 運営会社: 東武鉄道。路線名: 日光線。鉄道区分: 普通鉄道（12）。事業者種別: 民営鉄道（4）。

小野上温泉
type: Concept
alternative label: 小野上温泉（東日本旅客鉄道 吾妻線）
broader: g002119
in scheme: scheme
notation: 002119
scope note: 運営会社: 東日本旅客鉄道。路線名: 吾妻線。鉄道区分: 普通鉄道JR（11）。事業者種別: JR在来線（2）。

稲尾
type: Concept
alternative label: 稲尾（東日本旅客鉄道 大糸線）
broader: g002120
in scheme: scheme
notation: 002120
scope note: 運営会社: 東日本旅客鉄道。路線名: 大糸線。鉄道区分: 普通鉄道JR（11）。事業者種別: JR在来線（2）。

群馬大津
type: Concept
alternative label: 群馬大津（東日本旅客鉄道 吾妻線）
broader: g002121
in scheme: scheme
notation: 002121
scope note: 運営会社: 東日本旅客鉄道。路線名: 吾妻線。鉄道区分: 普通鉄道JR（11）。事業者種別: JR在来線（2）。

野町
type: Concept
alternative label: 野町（北陸鉄道 石川線）
broader: g002122
in scheme: scheme
notation: 002122
scope note: 運営会社: 北陸鉄道。路線名: 石川線。鉄道区分: 普通鉄道（12）。事業者種別: 民営鉄道（4）。

西泉
type: Concept
alternative label: 西泉（北陸鉄道 石川線）
broader: g002123
in scheme: scheme
notation: 002123
scope note: 運営会社: 北陸鉄道。路線名: 石川線。鉄道区分: 普通鉄道（12）。事業者種別: 民営鉄道（4）。

西金沢
type: Concept
alternative label: 西金沢（IRいしかわ鉄道 IRいしかわ鉄道線）
broader: g002124
in scheme: scheme
notation: 002124
scope note: 運営会社: IRいしかわ鉄道。路線名: IRいしかわ鉄道線。鉄道区分: 普通鉄道（12）。事業者種別: 第三セクター（5）。

新西金沢
type: Concept
alternative label: 新西金沢（北陸鉄道 石川線）
broader: g002125
in scheme: scheme
notation: 002125
scope note: 運営会社: 北陸鉄道。路線名: 石川線。鉄道区分: 普通鉄道（12）。事業者種別: 民営鉄道（4）。

矢倉
type: Concept
alternative label: 矢倉（東日本旅客鉄道 吾妻線）
broader: g002126
in scheme: scheme
notation: 002126
scope note: 運営会社: 東日本旅客鉄道。路線名: 吾妻線。鉄道区分: 普通鉄道JR（11）。事業者種別: JR在来線（2）。

稲荷山
type: Concept
alternative label: 稲荷山（東日本旅客鉄道 篠ノ井線）
broader: g002127
in scheme: scheme
notation: 002127
scope note: 運営会社: 東日本旅客鉄道。路線名: 篠ノ井線。鉄道区分: 普通鉄道JR（11）。事業者種別: JR在来線（2）。

小野上
type: Concept
alternative label: 小野上（東日本旅客鉄道 吾妻線）
broader: g002128
in scheme: scheme
notation: 002128
scope note: 運営会社: 東日本旅客鉄道。路線名: 吾妻線。鉄道区分: 普通鉄道JR（11）。事業者種別: JR在来線（2）。

常陸多賀
type: Concept
alternative label: 常陸多賀（東日本旅客鉄道 常磐線）
broader: g002129
in scheme: scheme
notation: 002129
scope note: 運営会社: 東日本旅客鉄道。路線名: 常磐線。鉄道区分: 普通鉄道JR（11）。事業者種別: JR在来線（2）。

羽根尾
type: Concept
alternative label: 羽根尾（東日本旅客鉄道 吾妻線）
broader: g002130
in scheme: scheme
notation: 002130
scope note: 運営会社: 東日本旅客鉄道。路線名: 吾妻線。鉄道区分: 普通鉄道JR（11）。事業者種別: JR在来線（2）。

郷原
type: Concept
alternative label: 郷原（東日本旅客鉄道 吾妻線）
broader: g002131
in scheme: scheme
notation: 002131
scope note: 運営会社: 東日本旅客鉄道。路線名: 吾妻線。鉄道区分: 普通鉄道JR（11）。事業者種別: JR在来線（2）。

屋代高校前
type: Concept
alternative label: 屋代高校前（しなの鉄道 しなの鉄道線）
broader: g002132
in scheme: scheme
notation: 002132
scope note: 運営会社: しなの鉄道。路線名: しなの鉄道線。鉄道区分: 普通鉄道（12）。事業者種別: 第三セクター（5）。

常陸大宮
type: Concept
alternative label: 常陸大宮（東日本旅客鉄道 水郡線）
broader: g002133
in scheme: scheme
notation: 002133
scope note: 運営会社: 東日本旅客鉄道。路線名: 水郡線。鉄道区分: 普通鉄道JR（11）。事業者種別: JR在来線（2）。

長野原草津口
type: Concept
alternative label: 長野原草津口（東日本旅客鉄道 吾妻線）
broader: g002134
in scheme: scheme
notation: 002134
scope note: 運営会社: 東日本旅客鉄道。路線名: 吾妻線。鉄道区分: 普通鉄道JR（11）。事業者種別: JR在来線（2）。

川原湯温泉
type: Concept
alternative label: 川原湯温泉（東日本旅客鉄道 吾妻線）
broader: g002135
in scheme: scheme
notation: 002135
scope note: 運営会社: 東日本旅客鉄道。路線名: 吾妻線。鉄道区分: 普通鉄道JR（11）。事業者種別: JR在来線（2）。

袋倉
type: Concept
alternative label: 袋倉（東日本旅客鉄道 吾妻線）
broader: g002136
in scheme: scheme
notation: 002136
scope note: 運営会社: 東日本旅客鉄道。路線名: 吾妻線。鉄道区分: 普通鉄道JR（11）。事業者種別: JR在来線（2）。

南宇都宮
type: Concept
alternative label: 南宇都宮（東武鉄道 宇都宮線）
broader: g002137
in scheme: scheme
notation: 002137
scope note: 運営会社: 東武鉄道。路線名: 宇都宮線。鉄道区分: 普通鉄道（12）。事業者種別: 民営鉄道（4）。

押野
type: Concept
alternative label: 押野（北陸鉄道 石川線）
broader: g002138
in scheme: scheme
notation: 002138
scope note: 運営会社: 北陸鉄道。路線名: 石川線。鉄道区分: 普通鉄道（12）。事業者種別: 民営鉄道（4）。

野々市
type: Concept
alternative label: 野々市（IRいしかわ鉄道 IRいしかわ鉄道線）
broader: g002139
in scheme: scheme
notation: 002139
scope note: 運営会社: IRいしかわ鉄道。路線名: IRいしかわ鉄道線。鉄道区分: 普通鉄道（12）。事業者種別: 第三セクター（5）。

祖母島
type: Concept
alternative label: 祖母島（東日本旅客鉄道 吾妻線）
broader: g002140
in scheme: scheme
notation: 002140
scope note: 運営会社: 東日本旅客鉄道。路線名: 吾妻線。鉄道区分: 普通鉄道JR（11）。事業者種別: JR在来線（2）。

越中山田
type: Concept
alternative label: 越中山田（西日本旅客鉄道 城端線）
broader: g002141
in scheme: scheme
notation: 002141
scope note: 運営会社: 西日本旅客鉄道。路線名: 城端線。鉄道区分: 普通鉄道JR（11）。事業者種別: JR在来線（2）。

鶴田
type: Concept
alternative label: 鶴田（東日本旅客鉄道 日光線）
broader: g002142
in scheme: scheme
notation: 002142
scope note: 運営会社: 東日本旅客鉄道。路線名: 日光線。鉄道区分: 普通鉄道JR（11）。事業者種別: JR在来線（2）。

市塙
type: Concept
alternative label: 市塙（真岡鐵道 真岡線）
broader: g002143
in scheme: scheme
notation: 002143
scope note: 運営会社: 真岡鐵道。路線名: 真岡線。鉄道区分: 普通鉄道（12）。事業者種別: 第三セクター（5）。

敷島
type: Concept
alternative label: 敷島（東日本旅客鉄道 上越線）
broader: g002144
in scheme: scheme
notation: 002144
scope note: 運営会社: 東日本旅客鉄道。路線名: 上越線。鉄道区分: 普通鉄道JR（11）。事業者種別: JR在来線（2）。

神戸
type: Concept
alternative label: 神戸（わたらせ渓谷鐵道 わたらせ渓谷線）
broader: g002145
in scheme: scheme
notation: 002145
scope note: 運営会社: わたらせ渓谷鐵道。路線名: わたらせ渓谷線。鉄道区分: 普通鉄道（12）。事業者種別: 第三セクター（5）。

野々市
type: Concept
alternative label: 野々市（北陸鉄道 石川線）
broader: g002146
in scheme: scheme
notation: 002146
scope note: 運営会社: 北陸鉄道。路線名: 石川線。鉄道区分: 普通鉄道（12）。事業者種別: 民営鉄道（4）。

小中
type: Concept
alternative label: 小中（わたらせ渓谷鐵道 わたらせ渓谷線）
broader: g002147
in scheme: scheme
notation: 002147
scope note: 運営会社: わたらせ渓谷鐵道。路線名: わたらせ渓谷線。鉄道区分: 普通鉄道（12）。事業者種別: 第三セクター（5）。

信濃木崎
type: Concept
alternative label: 信濃木崎（東日本旅客鉄道 大糸線）
broader: g002148
in scheme: scheme
notation: 002148
scope note: 運営会社: 東日本旅客鉄道。路線名: 大糸線。鉄道区分: 普通鉄道JR（11）。事業者種別: JR在来線（2）。

笹原田
type: Concept
alternative label: 笹原田（真岡鐵道 真岡線）
broader: g002149
in scheme: scheme
notation: 002149
scope note: 運営会社: 真岡鐵道。路線名: 真岡線。鉄道区分: 普通鉄道（12）。事業者種別: 第三セクター（5）。

樅山
type: Concept
alternative label: 樅山（東武鉄道 日光線）
broader: g002150
in scheme: scheme
notation: 002150
scope note: 運営会社: 東武鉄道。路線名: 日光線。鉄道区分: 普通鉄道（12）。事業者種別: 民営鉄道（4）。

野々市工大前
type: Concept
alternative label: 野々市工大前（北陸鉄道 石川線）
broader: g002151
in scheme: scheme
notation: 002151
scope note: 運営会社: 北陸鉄道。路線名: 石川線。鉄道区分: 普通鉄道（12）。事業者種別: 民営鉄道（4）。

屋代
type: Concept
alternative label: 屋代（しなの鉄道 しなの鉄道線）
broader: g002152
in scheme: scheme
notation: 002152
scope note: 運営会社: しなの鉄道。路線名: しなの鉄道線。鉄道区分: 普通鉄道（12）。事業者種別: 第三セクター（5）。

万座・鹿沢口
type: Concept
alternative label: 万座・鹿沢口（東日本旅客鉄道 吾妻線）
broader: g002153
in scheme: scheme
notation: 002153
scope note: 運営会社: 東日本旅客鉄道。路線名: 吾妻線。鉄道区分: 普通鉄道JR（11）。事業者種別: JR在来線（2）。

常陸太田
type: Concept
alternative label: 常陸太田（東日本旅客鉄道 水郡線）
broader: g002154
in scheme: scheme
notation: 002154
scope note: 運営会社: 東日本旅客鉄道。路線名: 水郡線。鉄道区分: 普通鉄道JR（11）。事業者種別: JR在来線（2）。

江曾島
type: Concept
alternative label: 江曾島（東武鉄道 宇都宮線）
broader: g002155
in scheme: scheme
notation: 002155
scope note: 運営会社: 東武鉄道。路線名: 宇都宮線。鉄道区分: 普通鉄道（12）。事業者種別: 民営鉄道（4）。

茂木
type: Concept
alternative label: 茂木（真岡鐵道 真岡線）
broader: g002156
in scheme: scheme
notation: 002156
scope note: 運営会社: 真岡鐵道。路線名: 真岡線。鉄道区分: 普通鉄道（12）。事業者種別: 第三セクター（5）。

金島
type: Concept
alternative label: 金島（東日本旅客鉄道 吾妻線）
broader: g002157
in scheme: scheme
notation: 002157
scope note: 運営会社: 東日本旅客鉄道。路線名: 吾妻線。鉄道区分: 普通鉄道JR（11）。事業者種別: JR在来線（2）。

楡原
type: Concept
alternative label: 楡原（西日本旅客鉄道 高山線）
broader: g002158
in scheme: scheme
notation: 002158
scope note: 運営会社: 西日本旅客鉄道。路線名: 高山線。鉄道区分: 普通鉄道JR（11）。事業者種別: JR在来線（2）。

天矢場
type: Concept
alternative label: 天矢場（真岡鐵道 真岡線）
broader: g002159
in scheme: scheme
notation: 002159
scope note: 運営会社: 真岡鐵道。路線名: 真岡線。鉄道区分: 普通鉄道（12）。事業者種別: 第三セクター（5）。

松任
type: Concept
alternative label: 松任（IRいしかわ鉄道 IRいしかわ鉄道線）
broader: g002160
in scheme: scheme
notation: 002160
scope note: 運営会社: IRいしかわ鉄道。路線名: IRいしかわ鉄道線。鉄道区分: 普通鉄道（12）。事業者種別: 第三セクター（5）。

中野
type: Concept
alternative label: 中野（わたらせ渓谷鐵道 わたらせ渓谷線）
broader: g002161
in scheme: scheme
notation: 002161
scope note: 運営会社: わたらせ渓谷鐵道。路線名: わたらせ渓谷線。鉄道区分: 普通鉄道（12）。事業者種別: 第三セクター（5）。

馬替
type: Concept
alternative label: 馬替（北陸鉄道 石川線）
broader: g002162
in scheme: scheme
notation: 002162
scope note: 運営会社: 北陸鉄道。路線名: 石川線。鉄道区分: 普通鉄道（12）。事業者種別: 民営鉄道（4）。

城端
type: Concept
alternative label: 城端（西日本旅客鉄道 城端線）
broader: g002163
in scheme: scheme
notation: 002163
scope note: 運営会社: 西日本旅客鉄道。路線名: 城端線。鉄道区分: 普通鉄道JR（11）。事業者種別: JR在来線（2）。

花輪
type: Concept
alternative label: 花輪（わたらせ渓谷鐵道 わたらせ渓谷線）
broader: g002164
in scheme: scheme
notation: 002164
scope note: 運営会社: わたらせ渓谷鐵道。路線名: わたらせ渓谷線。鉄道区分: 普通鉄道（12）。事業者種別: 第三セクター（5）。

谷河原
type: Concept
alternative label: 谷河原（東日本旅客鉄道 水郡線）
broader: g002165
in scheme: scheme
notation: 002165
scope note: 運営会社: 東日本旅客鉄道。路線名: 水郡線。鉄道区分: 普通鉄道JR（11）。事業者種別: JR在来線（2）。

額住宅前
type: Concept
alternative label: 額住宅前（北陸鉄道 石川線）
broader: g002166
in scheme: scheme
notation: 002166
scope note: 運営会社: 北陸鉄道。路線名: 石川線。鉄道区分: 普通鉄道（12）。事業者種別: 民営鉄道（4）。

北大町
type: Concept
alternative label: 北大町（東日本旅客鉄道 大糸線）
broader: g002167
in scheme: scheme
notation: 002167
scope note: 運営会社: 東日本旅客鉄道。路線名: 大糸線。鉄道区分: 普通鉄道JR（11）。事業者種別: JR在来線（2）。

多田羅
type: Concept
alternative label: 多田羅（真岡鐵道 真岡線）
broader: g002168
in scheme: scheme
notation: 002168
scope note: 運営会社: 真岡鐵道。路線名: 真岡線。鉄道区分: 普通鉄道（12）。事業者種別: 第三セクター（5）。

西川田
type: Concept
alternative label: 西川田（東武鉄道 宇都宮線）
broader: g002169
in scheme: scheme
notation: 002169
scope note: 運営会社: 東武鉄道。路線名: 宇都宮線。鉄道区分: 普通鉄道（12）。事業者種別: 民営鉄道（4）。

大前
type: Concept
alternative label: 大前（東日本旅客鉄道 吾妻線）
broader: g002170
in scheme: scheme
notation: 002170
scope note: 運営会社: 東日本旅客鉄道。路線名: 吾妻線。鉄道区分: 普通鉄道JR（11）。事業者種別: JR在来線（2）。

大甕
type: Concept
alternative label: 大甕（東日本旅客鉄道 常磐線）
broader: g002171
in scheme: scheme
notation: 002171
scope note: 運営会社: 東日本旅客鉄道。路線名: 常磐線。鉄道区分: 普通鉄道JR（11）。事業者種別: JR在来線（2）。

乙丸
type: Concept
alternative label: 乙丸（北陸鉄道 石川線）
broader: g002172
in scheme: scheme
notation: 002172
scope note: 運営会社: 北陸鉄道。路線名: 石川線。鉄道区分: 普通鉄道（12）。事業者種別: 民営鉄道（4）。

千曲
type: Concept
alternative label: 千曲（しなの鉄道 しなの鉄道線）
broader: g002173
in scheme: scheme
notation: 002173
scope note: 運営会社: しなの鉄道。路線名: しなの鉄道線。鉄道区分: 普通鉄道（12）。事業者種別: 第三セクター（5）。

河合
type: Concept
alternative label: 河合（東日本旅客鉄道 水郡線）
broader: g002174
in scheme: scheme
notation: 002174
scope note: 運営会社: 東日本旅客鉄道。路線名: 水郡線。鉄道区分: 普通鉄道JR（11）。事業者種別: JR在来線（2）。

楡木
type: Concept
alternative label: 楡木（東武鉄道 日光線）
broader: g002175
in scheme: scheme
notation: 002175
scope note: 運営会社: 東武鉄道。路線名: 日光線。鉄道区分: 普通鉄道（12）。事業者種別: 民営鉄道（4）。

静
type: Concept
alternative label: 静（東日本旅客鉄道 水郡線）
broader: g002176
in scheme: scheme
notation: 002176
scope note: 運営会社: 東日本旅客鉄道。路線名: 水郡線。鉄道区分: 普通鉄道JR（11）。事業者種別: JR在来線（2）。

加賀笠間
type: Concept
alternative label: 加賀笠間（IRいしかわ鉄道 IRいしかわ鉄道線）
broader: g002177
in scheme: scheme
notation: 002177
scope note: 運営会社: IRいしかわ鉄道。路線名: IRいしかわ鉄道線。鉄道区分: 普通鉄道（12）。事業者種別: 第三セクター（5）。

姨捨
type: Concept
alternative label: 姨捨（東日本旅客鉄道 篠ノ井線）
broader: g002178
in scheme: scheme
notation: 002178
scope note: 運営会社: 東日本旅客鉄道。路線名: 篠ノ井線。鉄道区分: 普通鉄道JR（11）。事業者種別: JR在来線（2）。

信濃大町
type: Concept
alternative label: 信濃大町（東日本旅客鉄道 大糸線）
broader: g002179
in scheme: scheme
notation: 002179
scope note: 運営会社: 東日本旅客鉄道。路線名: 大糸線。鉄道区分: 普通鉄道JR（11）。事業者種別: JR在来線（2）。

水沼
type: Concept
alternative label: 水沼（わたらせ渓谷鐵道 わたらせ渓谷線）
broader: g002180
in scheme: scheme
notation: 002180
scope note: 運営会社: わたらせ渓谷鐵道。路線名: わたらせ渓谷線。鉄道区分: 普通鉄道（12）。事業者種別: 第三セクター（5）。

四十万
type: Concept
alternative label: 四十万（北陸鉄道 石川線）
broader: g002181
in scheme: scheme
notation: 002181
scope note: 運営会社: 北陸鉄道。路線名: 石川線。鉄道区分: 普通鉄道（12）。事業者種別: 民営鉄道（4）。

瓜連
type: Concept
alternative label: 瓜連（東日本旅客鉄道 水郡線）
broader: g002182
in scheme: scheme
notation: 002182
scope note: 運営会社: 東日本旅客鉄道。路線名: 水郡線。鉄道区分: 普通鉄道JR（11）。事業者種別: JR在来線（2）。

雀宮
type: Concept
alternative label: 雀宮（東日本旅客鉄道 東北線）
broader: g002183
in scheme: scheme
notation: 002183
scope note: 運営会社: 東日本旅客鉄道。路線名: 東北線。鉄道区分: 普通鉄道JR（11）。事業者種別: JR在来線（2）。

陽羽里
type: Concept
alternative label: 陽羽里（北陸鉄道 石川線）
broader: g002184
in scheme: scheme
notation: 002184
scope note: 運営会社: 北陸鉄道。路線名: 石川線。鉄道区分: 普通鉄道（12）。事業者種別: 民営鉄道（4）。

戸倉
type: Concept
alternative label: 戸倉（しなの鉄道 しなの鉄道線）
broader: g002185
in scheme: scheme
notation: 002185
scope note: 運営会社: しなの鉄道。路線名: しなの鉄道線。鉄道区分: 普通鉄道（12）。事業者種別: 第三セクター（5）。

七井
type: Concept
alternative label: 七井（真岡鐵道 真岡線）
broader: g002186
in scheme: scheme
notation: 002186
scope note: 運営会社: 真岡鐵道。路線名: 真岡線。鉄道区分: 普通鉄道（12）。事業者種別: 第三セクター（5）。

南大町
type: Concept
alternative label: 南大町（東日本旅客鉄道 大糸線）
broader: g002187
in scheme: scheme
notation: 002187
scope note: 運営会社: 東日本旅客鉄道。路線名: 大糸線。鉄道区分: 普通鉄道JR（11）。事業者種別: JR在来線（2）。

渋川
type: Concept
alternative label: 渋川（東日本旅客鉄道 吾妻線）
broader: g002188
in scheme: scheme
notation: 002188
scope note: 運営会社: 東日本旅客鉄道。路線名: 吾妻線。鉄道区分: 普通鉄道JR（11）。事業者種別: JR在来線（2）。

渋川
type: Concept
alternative label: 渋川（東日本旅客鉄道 上越線）
broader: g002188
in scheme: scheme
notation: 002189
scope note: 運営会社: 東日本旅客鉄道。路線名: 上越線。鉄道区分: 普通鉄道JR（11）。事業者種別: JR在来線（2）。

曽谷
type: Concept
alternative label: 曽谷（北陸鉄道 石川線）
broader: g002190
in scheme: scheme
notation: 002190
scope note: 運営会社: 北陸鉄道。路線名: 石川線。鉄道区分: 普通鉄道（12）。事業者種別: 民営鉄道（4）。

美川
type: Concept
alternative label: 美川（IRいしかわ鉄道 IRいしかわ鉄道線）
broader: g002191
in scheme: scheme
notation: 002191
scope note: 運営会社: IRいしかわ鉄道。路線名: IRいしかわ鉄道線。鉄道区分: 普通鉄道（12）。事業者種別: 第三セクター（5）。

額田
type: Concept
alternative label: 額田（東日本旅客鉄道 水郡線）
broader: g002192
in scheme: scheme
notation: 002192
scope note: 運営会社: 東日本旅客鉄道。路線名: 水郡線。鉄道区分: 普通鉄道JR（11）。事業者種別: JR在来線（2）。

安塚
type: Concept
alternative label: 安塚（東武鉄道 宇都宮線）
broader: g002193
in scheme: scheme
notation: 002193
scope note: 運営会社: 東武鉄道。路線名: 宇都宮線。鉄道区分: 普通鉄道（12）。事業者種別: 民営鉄道（4）。

道法寺
type: Concept
alternative label: 道法寺（北陸鉄道 石川線）
broader: g002194
in scheme: scheme
notation: 002194
scope note: 運営会社: 北陸鉄道。路線名: 石川線。鉄道区分: 普通鉄道（12）。事業者種別: 民営鉄道（4）。

本宿
type: Concept
alternative label: 本宿（わたらせ渓谷鐵道 わたらせ渓谷線）
broader: g002195
in scheme: scheme
notation: 002195
scope note: 運営会社: わたらせ渓谷鐵道。路線名: わたらせ渓谷線。鉄道区分: 普通鉄道（12）。事業者種別: 第三セクター（5）。

南酒出
type: Concept
alternative label: 南酒出（東日本旅客鉄道 水郡線）
broader: g002196
in scheme: scheme
notation: 002196
scope note: 運営会社: 東日本旅客鉄道。路線名: 水郡線。鉄道区分: 普通鉄道JR（11）。事業者種別: JR在来線（2）。

井口
type: Concept
alternative label: 井口（北陸鉄道 石川線）
broader: g002197
in scheme: scheme
notation: 002197
scope note: 運営会社: 北陸鉄道。路線名: 石川線。鉄道区分: 普通鉄道（12）。事業者種別: 民営鉄道（4）。

小舞子
type: Concept
alternative label: 小舞子（IRいしかわ鉄道 IRいしかわ鉄道線）
broader: g002198
in scheme: scheme
notation: 002198
scope note: 運営会社: IRいしかわ鉄道。路線名: IRいしかわ鉄道線。鉄道区分: 普通鉄道（12）。事業者種別: 第三セクター（5）。

常陸鴻巣
type: Concept
alternative label: 常陸鴻巣（東日本旅客鉄道 水郡線）
broader: g002199
in scheme: scheme
notation: 002199
scope note: 運営会社: 東日本旅客鉄道。路線名: 水郡線。鉄道区分: 普通鉄道JR（11）。事業者種別: JR在来線（2）。

猪谷
type: Concept
alternative label: 猪谷（西日本旅客鉄道 高山線）
broader: g002200
in scheme: scheme
notation: 002200
scope note: 運営会社: 西日本旅客鉄道。路線名: 高山線。鉄道区分: 普通鉄道JR（11）。事業者種別: JR在来線（2）。

猪谷
type: Concept
alternative label: 猪谷（東海旅客鉄道 高山線）
broader: g002200
in scheme: scheme
notation: 002201
scope note: 運営会社: 東海旅客鉄道。路線名: 高山線。鉄道区分: 普通鉄道JR（11）。事業者種別: JR在来線（2）。

小柳
type: Concept
alternative label: 小柳（北陸鉄道 石川線）
broader: g002202
in scheme: scheme
notation: 002202
scope note: 運営会社: 北陸鉄道。路線名: 石川線。鉄道区分: 普通鉄道（12）。事業者種別: 民営鉄道（4）。

上神梅
type: Concept
alternative label: 上神梅（わたらせ渓谷鐵道 わたらせ渓谷線）
broader: g002203
in scheme: scheme
notation: 002203
scope note: 運営会社: わたらせ渓谷鐵道。路線名: わたらせ渓谷線。鉄道区分: 普通鉄道（12）。事業者種別: 第三セクター（5）。

信濃常盤
type: Concept
alternative label: 信濃常盤（東日本旅客鉄道 大糸線）
broader: g002204
in scheme: scheme
notation: 002204
scope note: 運営会社: 東日本旅客鉄道。路線名: 大糸線。鉄道区分: 普通鉄道JR（11）。事業者種別: JR在来線（2）。

おもちゃのまち
type: Concept
alternative label: おもちゃのまち（東武鉄道 宇都宮線）
broader: g002205
in scheme: scheme
notation: 002205
scope note: 運営会社: 東武鉄道。路線名: 宇都宮線。鉄道区分: 普通鉄道（12）。事業者種別: 民営鉄道（4）。

東武金崎
type: Concept
alternative label: 東武金崎（東武鉄道 日光線）
broader: g002206
in scheme: scheme
notation: 002206
scope note: 運営会社: 東武鉄道。路線名: 日光線。鉄道区分: 普通鉄道（12）。事業者種別: 民営鉄道（4）。

東海
type: Concept
alternative label: 東海（東日本旅客鉄道 常磐線）
broader: g002207
in scheme: scheme
notation: 002207
scope note: 運営会社: 東日本旅客鉄道。路線名: 常磐線。鉄道区分: 普通鉄道JR（11）。事業者種別: JR在来線（2）。

日御子
type: Concept
alternative label: 日御子（北陸鉄道 石川線）
broader: g002208
in scheme: scheme
notation: 002208
scope note: 運営会社: 北陸鉄道。路線名: 石川線。鉄道区分: 普通鉄道（12）。事業者種別: 民営鉄道（4）。

八木原
type: Concept
alternative label: 八木原（東日本旅客鉄道 上越線）
broader: g002209
in scheme: scheme
notation: 002209
scope note: 運営会社: 東日本旅客鉄道。路線名: 上越線。鉄道区分: 普通鉄道JR（11）。事業者種別: JR在来線（2）。

益子
type: Concept
alternative label: 益子（真岡鐵道 真岡線）
broader: g002210
in scheme: scheme
notation: 002210
scope note: 運営会社: 真岡鐵道。路線名: 真岡線。鉄道区分: 普通鉄道（12）。事業者種別: 第三セクター（5）。

坂城
type: Concept
alternative label: 坂城（しなの鉄道 しなの鉄道線）
broader: g002211
in scheme: scheme
notation: 002211
scope note: 運営会社: しなの鉄道。路線名: しなの鉄道線。鉄道区分: 普通鉄道（12）。事業者種別: 第三セクター（5）。

冠着
type: Concept
alternative label: 冠着（東日本旅客鉄道 篠ノ井線）
broader: g002212
in scheme: scheme
notation: 002212
scope note: 運営会社: 東日本旅客鉄道。路線名: 篠ノ井線。鉄道区分: 普通鉄道JR（11）。事業者種別: JR在来線（2）。

上菅谷
type: Concept
alternative label: 上菅谷（東日本旅客鉄道 水郡線）
broader: g002213
in scheme: scheme
notation: 002213
scope note: 運営会社: 東日本旅客鉄道。路線名: 水郡線。鉄道区分: 普通鉄道JR（11）。事業者種別: JR在来線（2）。

北山
type: Concept
alternative label: 北山（真岡鐵道 真岡線）
broader: g002214
in scheme: scheme
notation: 002214
scope note: 運営会社: 真岡鐵道。路線名: 真岡線。鉄道区分: 普通鉄道（12）。事業者種別: 第三セクター（5）。

聖高原
type: Concept
alternative label: 聖高原（東日本旅客鉄道 篠ノ井線）
broader: g002215
in scheme: scheme
notation: 002215
scope note: 運営会社: 東日本旅客鉄道。路線名: 篠ノ井線。鉄道区分: 普通鉄道JR（11）。事業者種別: JR在来線（2）。

西田井
type: Concept
alternative label: 西田井（真岡鐵道 真岡線）
broader: g002216
in scheme: scheme
notation: 002216
scope note: 運営会社: 真岡鐵道。路線名: 真岡線。鉄道区分: 普通鉄道（12）。事業者種別: 第三セクター（5）。

鶴来
type: Concept
alternative label: 鶴来（北陸鉄道 石川線）
broader: g002217
in scheme: scheme
notation: 002217
scope note: 運営会社: 北陸鉄道。路線名: 石川線。鉄道区分: 普通鉄道（12）。事業者種別: 民営鉄道（4）。

能美根上
type: Concept
alternative label: 能美根上（IRいしかわ鉄道 IRいしかわ鉄道線）
broader: g002218
in scheme: scheme
notation: 002218
scope note: 運営会社: IRいしかわ鉄道。路線名: IRいしかわ鉄道線。鉄道区分: 普通鉄道（12）。事業者種別: 第三セクター（5）。

国谷
type: Concept
alternative label: 国谷（東武鉄道 宇都宮線）
broader: g002219
in scheme: scheme
notation: 002219
scope note: 運営会社: 東武鉄道。路線名: 宇都宮線。鉄道区分: 普通鉄道（12）。事業者種別: 民営鉄道（4）。

北真岡
type: Concept
alternative label: 北真岡（真岡鐵道 真岡線）
broader: g002220
in scheme: scheme
notation: 002220
scope note: 運営会社: 真岡鐵道。路線名: 真岡線。鉄道区分: 普通鉄道（12）。事業者種別: 第三セクター（5）。

安曇沓掛
type: Concept
alternative label: 安曇沓掛（東日本旅客鉄道 大糸線）
broader: g002221
in scheme: scheme
notation: 002221
scope note: 運営会社: 東日本旅客鉄道。路線名: 大糸線。鉄道区分: 普通鉄道JR（11）。事業者種別: JR在来線（2）。

中菅谷
type: Concept
alternative label: 中菅谷（東日本旅客鉄道 水郡線）
broader: g002222
in scheme: scheme
notation: 002222
scope note: 運営会社: 東日本旅客鉄道。路線名: 水郡線。鉄道区分: 普通鉄道JR（11）。事業者種別: JR在来線（2）。

テクノさかき
type: Concept
alternative label: テクノさかき（しなの鉄道 しなの鉄道線）
broader: g002223
in scheme: scheme
notation: 002223
scope note: 運営会社: しなの鉄道。路線名: しなの鉄道線。鉄道区分: 普通鉄道（12）。事業者種別: 第三セクター（5）。

真岡
type: Concept
alternative label: 真岡（真岡鐵道 真岡線）
broader: g002224
in scheme: scheme
notation: 002224
scope note: 運営会社: 真岡鐵道。路線名: 真岡線。鉄道区分: 普通鉄道（12）。事業者種別: 第三セクター（5）。

石橋
type: Concept
alternative label: 石橋（東日本旅客鉄道 東北線）
broader: g002225
in scheme: scheme
notation: 002225
scope note: 運営会社: 東日本旅客鉄道。路線名: 東北線。鉄道区分: 普通鉄道JR（11）。事業者種別: JR在来線（2）。

下菅谷
type: Concept
alternative label: 下菅谷（東日本旅客鉄道 水郡線）
broader: g002226
in scheme: scheme
notation: 002226
scope note: 運営会社: 東日本旅客鉄道。路線名: 水郡線。鉄道区分: 普通鉄道JR（11）。事業者種別: JR在来線（2）。

大間々
type: Concept
alternative label: 大間々（わたらせ渓谷鐵道 わたらせ渓谷線）
broader: g002227
in scheme: scheme
notation: 002227
scope note: 運営会社: わたらせ渓谷鐵道。路線名: わたらせ渓谷線。鉄道区分: 普通鉄道（12）。事業者種別: 第三セクター（5）。

坂北
type: Concept
alternative label: 坂北（東日本旅客鉄道 篠ノ井線）
broader: g002228
in scheme: scheme
notation: 002228
scope note: 運営会社: 東日本旅客鉄道。路線名: 篠ノ井線。鉄道区分: 普通鉄道JR（11）。事業者種別: JR在来線（2）。

佐和
type: Concept
alternative label: 佐和（東日本旅客鉄道 常磐線）
broader: g002229
in scheme: scheme
notation: 002229
scope note: 運営会社: 東日本旅客鉄道。路線名: 常磐線。鉄道区分: 普通鉄道JR（11）。事業者種別: JR在来線（2）。

家中
type: Concept
alternative label: 家中（東武鉄道 日光線）
broader: g002230
in scheme: scheme
notation: 002230
scope note: 運営会社: 東武鉄道。路線名: 日光線。鉄道区分: 普通鉄道（12）。事業者種別: 民営鉄道（4）。

赤城
type: Concept
alternative label: 赤城（東武鉄道 桐生線）
broader: g002231
in scheme: scheme
notation: 002231
scope note: 運営会社: 東武鉄道。路線名: 桐生線。鉄道区分: 普通鉄道（12）。事業者種別: 民営鉄道（4）。

赤城
type: Concept
alternative label: 赤城（上毛電気鉄道 上毛線）
broader: g002231
in scheme: scheme
notation: 002232
scope note: 運営会社: 上毛電気鉄道。路線名: 上毛線。鉄道区分: 普通鉄道（12）。事業者種別: 民営鉄道（4）。

明峰
type: Concept
alternative label: 明峰（IRいしかわ鉄道 IRいしかわ鉄道線）
broader: g002233
in scheme: scheme
notation: 002233
scope note: 運営会社: IRいしかわ鉄道。路線名: IRいしかわ鉄道線。鉄道区分: 普通鉄道（12）。事業者種別: 第三セクター（5）。

信濃松川
type: Concept
alternative label: 信濃松川（東日本旅客鉄道 大糸線）
broader: g002234
in scheme: scheme
notation: 002234
scope note: 運営会社: 東日本旅客鉄道。路線名: 大糸線。鉄道区分: 普通鉄道JR（11）。事業者種別: JR在来線（2）。

後台
type: Concept
alternative label: 後台（東日本旅客鉄道 水郡線）
broader: g002235
in scheme: scheme
notation: 002235
scope note: 運営会社: 東日本旅客鉄道。路線名: 水郡線。鉄道区分: 普通鉄道JR（11）。事業者種別: JR在来線（2）。

壬生
type: Concept
alternative label: 壬生（東武鉄道 宇都宮線）
broader: g002236
in scheme: scheme
notation: 002236
scope note: 運営会社: 東武鉄道。路線名: 宇都宮線。鉄道区分: 普通鉄道（12）。事業者種別: 民営鉄道（4）。

東新川
type: Concept
alternative label: 東新川（上毛電気鉄道 上毛線）
broader: g002237
in scheme: scheme
notation: 002237
scope note: 運営会社: 上毛電気鉄道。路線名: 上毛線。鉄道区分: 普通鉄道（12）。事業者種別: 民営鉄道（4）。

運動公園
type: Concept
alternative label: 運動公園（わたらせ渓谷鐵道 わたらせ渓谷線）
broader: g002238
in scheme: scheme
notation: 002238
scope note: 運営会社: わたらせ渓谷鐵道。路線名: わたらせ渓谷線。鉄道区分: 普通鉄道（12）。事業者種別: 第三セクター（5）。

桐生球場前
type: Concept
alternative label: 桐生球場前（上毛電気鉄道 上毛線）
broader: g002239
in scheme: scheme
notation: 002239
scope note: 運営会社: 上毛電気鉄道。路線名: 上毛線。鉄道区分: 普通鉄道（12）。事業者種別: 民営鉄道（4）。

新里
type: Concept
alternative label: 新里（上毛電気鉄道 上毛線）
broader: g002240
in scheme: scheme
notation: 002240
scope note: 運営会社: 上毛電気鉄道。路線名: 上毛線。鉄道区分: 普通鉄道（12）。事業者種別: 民営鉄道（4）。

新川
type: Concept
alternative label: 新川（上毛電気鉄道 上毛線）
broader: g002241
in scheme: scheme
notation: 002241
scope note: 運営会社: 上毛電気鉄道。路線名: 上毛線。鉄道区分: 普通鉄道（12）。事業者種別: 民営鉄道（4）。

膳
type: Concept
alternative label: 膳（上毛電気鉄道 上毛線）
broader: g002242
in scheme: scheme
notation: 002242
scope note: 運営会社: 上毛電気鉄道。路線名: 上毛線。鉄道区分: 普通鉄道（12）。事業者種別: 民営鉄道（4）。

西上田
type: Concept
alternative label: 西上田（しなの鉄道 しなの鉄道線）
broader: g002243
in scheme: scheme
notation: 002243
scope note: 運営会社: しなの鉄道。路線名: しなの鉄道線。鉄道区分: 普通鉄道（12）。事業者種別: 第三セクター（5）。

丸山下
type: Concept
alternative label: 丸山下（上毛電気鉄道 上毛線）
broader: g002244
in scheme: scheme
notation: 002244
scope note: 運営会社: 上毛電気鉄道。路線名: 上毛線。鉄道区分: 普通鉄道（12）。事業者種別: 民営鉄道（4）。

粕川
type: Concept
alternative label: 粕川（上毛電気鉄道 上毛線）
broader: g002245
in scheme: scheme
notation: 002245
scope note: 運営会社: 上毛電気鉄道。路線名: 上毛線。鉄道区分: 普通鉄道（12）。事業者種別: 民営鉄道（4）。

杉原
type: Concept
alternative label: 杉原（東海旅客鉄道 高山線）
broader: g002246
in scheme: scheme
notation: 002246
scope note: 運営会社: 東海旅客鉄道。路線名: 高山線。鉄道区分: 普通鉄道JR（11）。事業者種別: JR在来線（2）。

群馬総社
type: Concept
alternative label: 群馬総社（東日本旅客鉄道 上越線）
broader: g002247
in scheme: scheme
notation: 002247
scope note: 運営会社: 東日本旅客鉄道。路線名: 上越線。鉄道区分: 普通鉄道JR（11）。事業者種別: JR在来線（2）。

樋越
type: Concept
alternative label: 樋越（上毛電気鉄道 上毛線）
broader: g002248
in scheme: scheme
notation: 002248
scope note: 運営会社: 上毛電気鉄道。路線名: 上毛線。鉄道区分: 普通鉄道（12）。事業者種別: 民営鉄道（4）。

天王宿
type: Concept
alternative label: 天王宿（上毛電気鉄道 上毛線）
broader: g002249
in scheme: scheme
notation: 002249
scope note: 運営会社: 上毛電気鉄道。路線名: 上毛線。鉄道区分: 普通鉄道（12）。事業者種別: 民営鉄道（4）。

西桐生
type: Concept
alternative label: 西桐生（上毛電気鉄道 上毛線）
broader: g002250
in scheme: scheme
notation: 002250
scope note: 運営会社: 上毛電気鉄道。路線名: 上毛線。鉄道区分: 普通鉄道（12）。事業者種別: 民営鉄道（4）。

富士山下
type: Concept
alternative label: 富士山下（上毛電気鉄道 上毛線）
broader: g002251
in scheme: scheme
notation: 002251
scope note: 運営会社: 上毛電気鉄道。路線名: 上毛線。鉄道区分: 普通鉄道（12）。事業者種別: 民営鉄道（4）。

新屋
type: Concept
alternative label: 新屋（上毛電気鉄道 上毛線）
broader: g002252
in scheme: scheme
notation: 002252
scope note: 運営会社: 上毛電気鉄道。路線名: 上毛線。鉄道区分: 普通鉄道（12）。事業者種別: 民営鉄道（4）。

北原
type: Concept
alternative label: 北原（上毛電気鉄道 上毛線）
broader: g002253
in scheme: scheme
notation: 002253
scope note: 運営会社: 上毛電気鉄道。路線名: 上毛線。鉄道区分: 普通鉄道（12）。事業者種別: 民営鉄道（4）。

大胡
type: Concept
alternative label: 大胡（上毛電気鉄道 上毛線）
broader: g002254
in scheme: scheme
notation: 002254
scope note: 運営会社: 上毛電気鉄道。路線名: 上毛線。鉄道区分: 普通鉄道（12）。事業者種別: 民営鉄道（4）。

桐生
type: Concept
alternative label: 桐生（東日本旅客鉄道 両毛線）
broader: g002255
in scheme: scheme
notation: 002255
scope note: 運営会社: 東日本旅客鉄道。路線名: 両毛線。鉄道区分: 普通鉄道JR（11）。事業者種別: JR在来線（2）。

桐生
type: Concept
alternative label: 桐生（わたらせ渓谷鐵道 わたらせ渓谷線）
broader: g002255
in scheme: scheme
notation: 002256
scope note: 運営会社: わたらせ渓谷鐵道。路線名: わたらせ渓谷線。鉄道区分: 普通鉄道（12）。事業者種別: 第三セクター（5）。

寺内
type: Concept
alternative label: 寺内（真岡鐵道 真岡線）
broader: g002257
in scheme: scheme
notation: 002257
scope note: 運営会社: 真岡鐵道。路線名: 真岡線。鉄道区分: 普通鉄道（12）。事業者種別: 第三セクター（5）。

相老
type: Concept
alternative label: 相老（東武鉄道 桐生線）
broader: g002258
in scheme: scheme
notation: 002258
scope note: 運営会社: 東武鉄道。路線名: 桐生線。鉄道区分: 普通鉄道（12）。事業者種別: 民営鉄道（4）。

相老
type: Concept
alternative label: 相老（わたらせ渓谷鐵道 わたらせ渓谷線）
broader: g002258
in scheme: scheme
notation: 002259
scope note: 運営会社: わたらせ渓谷鐵道。路線名: わたらせ渓谷線。鉄道区分: 普通鉄道（12）。事業者種別: 第三セクター（5）。

野州大塚
type: Concept
alternative label: 野州大塚（東武鉄道 宇都宮線）
broader: g002260
in scheme: scheme
notation: 002260
scope note: 運営会社: 東武鉄道。路線名: 宇都宮線。鉄道区分: 普通鉄道（12）。事業者種別: 民営鉄道（4）。

下新田
type: Concept
alternative label: 下新田（わたらせ渓谷鐵道 わたらせ渓谷線）
broader: g002261
in scheme: scheme
notation: 002261
scope note: 運営会社: わたらせ渓谷鐵道。路線名: わたらせ渓谷線。鉄道区分: 普通鉄道（12）。事業者種別: 第三セクター（5）。

合戦場
type: Concept
alternative label: 合戦場（東武鉄道 日光線）
broader: g002262
in scheme: scheme
notation: 002262
scope note: 運営会社: 東武鉄道。路線名: 日光線。鉄道区分: 普通鉄道（12）。事業者種別: 民営鉄道（4）。

江木
type: Concept
alternative label: 江木（上毛電気鉄道 上毛線）
broader: g002263
in scheme: scheme
notation: 002263
scope note: 運営会社: 上毛電気鉄道。路線名: 上毛線。鉄道区分: 普通鉄道（12）。事業者種別: 民営鉄道（4）。

北細野
type: Concept
alternative label: 北細野（東日本旅客鉄道 大糸線）
broader: g002264
in scheme: scheme
notation: 002264
scope note: 運営会社: 東日本旅客鉄道。路線名: 大糸線。鉄道区分: 普通鉄道JR（11）。事業者種別: JR在来線（2）。

心臓血管センター
type: Concept
alternative label: 心臓血管センター（上毛電気鉄道 上毛線）
broader: g002265
in scheme: scheme
notation: 002265
scope note: 運営会社: 上毛電気鉄道。路線名: 上毛線。鉄道区分: 普通鉄道（12）。事業者種別: 民営鉄道（4）。

常陸津田
type: Concept
alternative label: 常陸津田（東日本旅客鉄道 水郡線）
broader: g002266
in scheme: scheme
notation: 002266
scope note: 運営会社: 東日本旅客鉄道。路線名: 水郡線。鉄道区分: 普通鉄道JR（11）。事業者種別: JR在来線（2）。

小松
type: Concept
alternative label: 小松（IRいしかわ鉄道 IRいしかわ鉄道線）
broader: g002267
in scheme: scheme
notation: 002267
scope note: 運営会社: IRいしかわ鉄道。路線名: IRいしかわ鉄道線。鉄道区分: 普通鉄道（12）。事業者種別: 第三セクター（5）。

野州平川
type: Concept
alternative label: 野州平川（東武鉄道 宇都宮線）
broader: g002268
in scheme: scheme
notation: 002268
scope note: 運営会社: 東武鉄道。路線名: 宇都宮線。鉄道区分: 普通鉄道（12）。事業者種別: 民営鉄道（4）。

西条
type: Concept
alternative label: 西条（東日本旅客鉄道 篠ノ井線）
broader: g002269
in scheme: scheme
notation: 002269
scope note: 運営会社: 東日本旅客鉄道。路線名: 篠ノ井線。鉄道区分: 普通鉄道JR（11）。事業者種別: JR在来線（2）。

葛生
type: Concept
alternative label: 葛生（東武鉄道 佐野線）
broader: g002270
in scheme: scheme
notation: 002270
scope note: 運営会社: 東武鉄道。路線名: 佐野線。鉄道区分: 普通鉄道（12）。事業者種別: 民営鉄道（4）。

赤坂
type: Concept
alternative label: 赤坂（上毛電気鉄道 上毛線）
broader: g002271
in scheme: scheme
notation: 002271
scope note: 運営会社: 上毛電気鉄道。路線名: 上毛線。鉄道区分: 普通鉄道（12）。事業者種別: 民営鉄道（4）。

細野
type: Concept
alternative label: 細野（東日本旅客鉄道 大糸線）
broader: g002272
in scheme: scheme
notation: 002272
scope note: 運営会社: 東日本旅客鉄道。路線名: 大糸線。鉄道区分: 普通鉄道JR（11）。事業者種別: JR在来線（2）。

上田
type: Concept
alternative label: 上田（東日本旅客鉄道 北陸新幹線）
broader: g002275
in scheme: scheme
notation: 002273
scope note: 運営会社: 東日本旅客鉄道。路線名: 北陸新幹線。鉄道区分: 普通鉄道JR（11）。事業者種別: JRの新幹線（1）。

岩宿
type: Concept
alternative label: 岩宿（東日本旅客鉄道 両毛線）
broader: g002274
in scheme: scheme
notation: 002274
scope note: 運営会社: 東日本旅客鉄道。路線名: 両毛線。鉄道区分: 普通鉄道JR（11）。事業者種別: JR在来線（2）。

上田
type: Concept
alternative label: 上田（上田電鉄 別所線）
broader: g002275
in scheme: scheme
notation: 002275
scope note: 運営会社: 上田電鉄。路線名: 別所線。鉄道区分: 普通鉄道（12）。事業者種別: 民営鉄道（4）。

上田
type: Concept
alternative label: 上田（しなの鉄道 しなの鉄道線）
broader: g002275
in scheme: scheme
notation: 002276
scope note: 運営会社: しなの鉄道。路線名: しなの鉄道線。鉄道区分: 普通鉄道（12）。事業者種別: 第三セクター（5）。

自治医大
type: Concept
alternative label: 自治医大（東日本旅客鉄道 東北線）
broader: g002277
in scheme: scheme
notation: 002277
scope note: 運営会社: 東日本旅客鉄道。路線名: 東北線。鉄道区分: 普通鉄道JR（11）。事業者種別: JR在来線（2）。

新桐生
type: Concept
alternative label: 新桐生（東武鉄道 桐生線）
broader: g002278
in scheme: scheme
notation: 002278
scope note: 運営会社: 東武鉄道。路線名: 桐生線。鉄道区分: 普通鉄道（12）。事業者種別: 民営鉄道（4）。

上泉
type: Concept
alternative label: 上泉（上毛電気鉄道 上毛線）
broader: g002279
in scheme: scheme
notation: 002279
scope note: 運営会社: 上毛電気鉄道。路線名: 上毛線。鉄道区分: 普通鉄道（12）。事業者種別: 民営鉄道（4）。

勝田
type: Concept
alternative label: 勝田（東日本旅客鉄道 常磐線）
broader: g002280
in scheme: scheme
notation: 002280
scope note: 運営会社: 東日本旅客鉄道。路線名: 常磐線。鉄道区分: 普通鉄道JR（11）。事業者種別: JR在来線（2）。

片貝
type: Concept
alternative label: 片貝（上毛電気鉄道 上毛線）
broader: g002281
in scheme: scheme
notation: 002281
scope note: 運営会社: 上毛電気鉄道。路線名: 上毛線。鉄道区分: 普通鉄道（12）。事業者種別: 民営鉄道（4）。

三俣
type: Concept
alternative label: 三俣（上毛電気鉄道 上毛線）
broader: g002282
in scheme: scheme
notation: 002282
scope note: 運営会社: 上毛電気鉄道。路線名: 上毛線。鉄道区分: 普通鉄道（12）。事業者種別: 民営鉄道（4）。

勝田
type: Concept
alternative label: 勝田（ひたちなか海浜鉄道 湊線）
broader: g002280
in scheme: scheme
notation: 002283
scope note: 運営会社: ひたちなか海浜鉄道。路線名: 湊線。鉄道区分: 普通鉄道（12）。事業者種別: 第三セクター（5）。

城下
type: Concept
alternative label: 城下（上田電鉄 別所線）
broader: g002284
in scheme: scheme
notation: 002284
scope note: 運営会社: 上田電鉄。路線名: 別所線。鉄道区分: 普通鉄道（12）。事業者種別: 民営鉄道（4）。

三好町
type: Concept
alternative label: 三好町（上田電鉄 別所線）
broader: g002285
in scheme: scheme
notation: 002285
scope note: 運営会社: 上田電鉄。路線名: 別所線。鉄道区分: 普通鉄道（12）。事業者種別: 民営鉄道（4）。

赤坂上
type: Concept
alternative label: 赤坂上（上田電鉄 別所線）
broader: g002286
in scheme: scheme
notation: 002286
scope note: 運営会社: 上田電鉄。路線名: 別所線。鉄道区分: 普通鉄道（12）。事業者種別: 民営鉄道（4）。

城東
type: Concept
alternative label: 城東（上毛電気鉄道 上毛線）
broader: g002287
in scheme: scheme
notation: 002287
scope note: 運営会社: 上毛電気鉄道。路線名: 上毛線。鉄道区分: 普通鉄道（12）。事業者種別: 民営鉄道（4）。

中央前橋
type: Concept
alternative label: 中央前橋（上毛電気鉄道 上毛線）
broader: g002288
in scheme: scheme
notation: 002288
scope note: 運営会社: 上毛電気鉄道。路線名: 上毛線。鉄道区分: 普通鉄道（12）。事業者種別: 民営鉄道（4）。

上田原
type: Concept
alternative label: 上田原（上田電鉄 別所線）
broader: g002289
in scheme: scheme
notation: 002289
scope note: 運営会社: 上田電鉄。路線名: 別所線。鉄道区分: 普通鉄道（12）。事業者種別: 民営鉄道（4）。

新栃木
type: Concept
alternative label: 新栃木（東武鉄道 宇都宮線）
broader: g002290
in scheme: scheme
notation: 002290
scope note: 運営会社: 東武鉄道。路線名: 宇都宮線。鉄道区分: 普通鉄道（12）。事業者種別: 民営鉄道（4）。

新栃木
type: Concept
alternative label: 新栃木（東武鉄道 日光線）
broader: g002290
in scheme: scheme
notation: 002291
scope note: 運営会社: 東武鉄道。路線名: 日光線。鉄道区分: 普通鉄道（12）。事業者種別: 民営鉄道（4）。

工機前
type: Concept
alternative label: 工機前（ひたちなか海浜鉄道 湊線）
broader: g002292
in scheme: scheme
notation: 002292
scope note: 運営会社: ひたちなか海浜鉄道。路線名: 湊線。鉄道区分: 普通鉄道（12）。事業者種別: 第三セクター（5）。

阿左美
type: Concept
alternative label: 阿左美（東武鉄道 桐生線）
broader: g002293
in scheme: scheme
notation: 002293
scope note: 運営会社: 東武鉄道。路線名: 桐生線。鉄道区分: 普通鉄道（12）。事業者種別: 民営鉄道（4）。

打保
type: Concept
alternative label: 打保（東海旅客鉄道 高山線）
broader: g002294
in scheme: scheme
notation: 002294
scope note: 運営会社: 東海旅客鉄道。路線名: 高山線。鉄道区分: 普通鉄道JR（11）。事業者種別: JR在来線（2）。

寺下
type: Concept
alternative label: 寺下（上田電鉄 別所線）
broader: g002295
in scheme: scheme
notation: 002295
scope note: 運営会社: 上田電鉄。路線名: 別所線。鉄道区分: 普通鉄道（12）。事業者種別: 民営鉄道（4）。

常陸青柳
type: Concept
alternative label: 常陸青柳（東日本旅客鉄道 水郡線）
broader: g002296
in scheme: scheme
notation: 002296
scope note: 運営会社: 東日本旅客鉄道。路線名: 水郡線。鉄道区分: 普通鉄道JR（11）。事業者種別: JR在来線（2）。

前橋
type: Concept
alternative label: 前橋（東日本旅客鉄道 両毛線）
broader: g002297
in scheme: scheme
notation: 002297
scope note: 運営会社: 東日本旅客鉄道。路線名: 両毛線。鉄道区分: 普通鉄道JR（11）。事業者種別: JR在来線（2）。

阿字ヶ浦
type: Concept
alternative label: 阿字ヶ浦（ひたちなか海浜鉄道 湊線）
broader: g002298
in scheme: scheme
notation: 002298
scope note: 運営会社: ひたちなか海浜鉄道。路線名: 湊線。鉄道区分: 普通鉄道（12）。事業者種別: 第三セクター（5）。

金上
type: Concept
alternative label: 金上（ひたちなか海浜鉄道 湊線）
broader: g002299
in scheme: scheme
notation: 002299
scope note: 運営会社: ひたちなか海浜鉄道。路線名: 湊線。鉄道区分: 普通鉄道（12）。事業者種別: 第三セクター（5）。

赤塚
type: Concept
alternative label: 赤塚（東日本旅客鉄道 常磐線）
broader: g002300
in scheme: scheme
notation: 002300
scope note: 運営会社: 東日本旅客鉄道。路線名: 常磐線。鉄道区分: 普通鉄道JR（11）。事業者種別: JR在来線（2）。

新前橋
type: Concept
alternative label: 新前橋（東日本旅客鉄道 上越線）
broader: g002301
in scheme: scheme
notation: 002301
scope note: 運営会社: 東日本旅客鉄道。路線名: 上越線。鉄道区分: 普通鉄道JR（11）。事業者種別: JR在来線（2）。

新前橋
type: Concept
alternative label: 新前橋（東日本旅客鉄道 両毛線）
broader: g002301
in scheme: scheme
notation: 002302
scope note: 運営会社: 東日本旅客鉄道。路線名: 両毛線。鉄道区分: 普通鉄道JR（11）。事業者種別: JR在来線（2）。

信濃国分寺
type: Concept
alternative label: 信濃国分寺（しなの鉄道 しなの鉄道線）
broader: g002303
in scheme: scheme
notation: 002303
scope note: 運営会社: しなの鉄道。路線名: しなの鉄道線。鉄道区分: 普通鉄道（12）。事業者種別: 第三セクター（5）。

多田
type: Concept
alternative label: 多田（東武鉄道 佐野線）
broader: g002304
in scheme: scheme
notation: 002304
scope note: 運営会社: 東武鉄道。路線名: 佐野線。鉄道区分: 普通鉄道（12）。事業者種別: 民営鉄道（4）。

神畑
type: Concept
alternative label: 神畑（上田電鉄 別所線）
broader: g002305
in scheme: scheme
notation: 002305
scope note: 運営会社: 上田電鉄。路線名: 別所線。鉄道区分: 普通鉄道（12）。事業者種別: 民営鉄道（4）。

磯崎
type: Concept
alternative label: 磯崎（ひたちなか海浜鉄道 湊線）
broader: g002306
in scheme: scheme
notation: 002306
scope note: 運営会社: ひたちなか海浜鉄道。路線名: 湊線。鉄道区分: 普通鉄道（12）。事業者種別: 第三セクター（5）。

久下田
type: Concept
alternative label: 久下田（真岡鐵道 真岡線）
broader: g002307
in scheme: scheme
notation: 002307
scope note: 運営会社: 真岡鐵道。路線名: 真岡線。鉄道区分: 普通鉄道（12）。事業者種別: 第三セクター（5）。

小俣
type: Concept
alternative label: 小俣（東日本旅客鉄道 両毛線）
broader: g002308
in scheme: scheme
notation: 002308
scope note: 運営会社: 東日本旅客鉄道。路線名: 両毛線。鉄道区分: 普通鉄道JR（11）。事業者種別: JR在来線（2）。

小金井
type: Concept
alternative label: 小金井（東日本旅客鉄道 東北線）
broader: g002309
in scheme: scheme
notation: 002309
scope note: 運営会社: 東日本旅客鉄道。路線名: 東北線。鉄道区分: 普通鉄道JR（11）。事業者種別: JR在来線（2）。

笠間
type: Concept
alternative label: 笠間（東日本旅客鉄道 水戸線）
broader: g002310
in scheme: scheme
notation: 002310
scope note: 運営会社: 東日本旅客鉄道。路線名: 水戸線。鉄道区分: 普通鉄道JR（11）。事業者種別: JR在来線（2）。

偕楽園
type: Concept
alternative label: 偕楽園（東日本旅客鉄道 常磐線）
broader: g002311
in scheme: scheme
notation: 002311
scope note: 運営会社: 東日本旅客鉄道。路線名: 常磐線。鉄道区分: 普通鉄道JR（11）。事業者種別: JR在来線（2）。

美乃浜学園
type: Concept
alternative label: 美乃浜学園（ひたちなか海浜鉄道 湊線）
broader: g002312
in scheme: scheme
notation: 002312
scope note: 運営会社: ひたちなか海浜鉄道。路線名: 湊線。鉄道区分: 普通鉄道（12）。事業者種別: 第三セクター（5）。

栃木
type: Concept
alternative label: 栃木（東日本旅客鉄道 両毛線）
broader: g002313
in scheme: scheme
notation: 002313
scope note: 運営会社: 東日本旅客鉄道。路線名: 両毛線。鉄道区分: 普通鉄道JR（11）。事業者種別: JR在来線（2）。

安曇追分
type: Concept
alternative label: 安曇追分（東日本旅客鉄道 大糸線）
broader: g002314
in scheme: scheme
notation: 002314
scope note: 運営会社: 東日本旅客鉄道。路線名: 大糸線。鉄道区分: 普通鉄道JR（11）。事業者種別: JR在来線（2）。

栃木
type: Concept
alternative label: 栃木（東武鉄道 日光線）
broader: g002313
in scheme: scheme
notation: 002315
scope note: 運営会社: 東武鉄道。路線名: 日光線。鉄道区分: 普通鉄道（12）。事業者種別: 民営鉄道（4）。

大学前
type: Concept
alternative label: 大学前（上田電鉄 別所線）
broader: g002316
in scheme: scheme
notation: 002316
scope note: 運営会社: 上田電鉄。路線名: 別所線。鉄道区分: 普通鉄道（12）。事業者種別: 民営鉄道（4）。

水戸
type: Concept
alternative label: 水戸（東日本旅客鉄道 水郡線）
broader: g002319
in scheme: scheme
notation: 002317
scope note: 運営会社: 東日本旅客鉄道。路線名: 水郡線。鉄道区分: 普通鉄道JR（11）。事業者種別: JR在来線（2）。

前橋大島
type: Concept
alternative label: 前橋大島（東日本旅客鉄道 両毛線）
broader: g002318
in scheme: scheme
notation: 002318
scope note: 運営会社: 東日本旅客鉄道。路線名: 両毛線。鉄道区分: 普通鉄道JR（11）。事業者種別: JR在来線（2）。

水戸
type: Concept
alternative label: 水戸（東日本旅客鉄道 常磐線）
broader: g002319
in scheme: scheme
notation: 002319
scope note: 運営会社: 東日本旅客鉄道。路線名: 常磐線。鉄道区分: 普通鉄道JR（11）。事業者種別: JR在来線（2）。

水戸
type: Concept
alternative label: 水戸（鹿島臨海鉄道 大洗鹿島線）
broader: g002319
in scheme: scheme
notation: 002320
scope note: 運営会社: 鹿島臨海鉄道。路線名: 大洗鹿島線。鉄道区分: 普通鉄道（12）。事業者種別: 第三セクター（5）。

内原
type: Concept
alternative label: 内原（東日本旅客鉄道 常磐線）
broader: g002321
in scheme: scheme
notation: 002321
scope note: 運営会社: 東日本旅客鉄道。路線名: 常磐線。鉄道区分: 普通鉄道JR（11）。事業者種別: JR在来線（2）。

大屋
type: Concept
alternative label: 大屋（しなの鉄道 しなの鉄道線）
broader: g002322
in scheme: scheme
notation: 002322
scope note: 運営会社: しなの鉄道。路線名: しなの鉄道線。鉄道区分: 普通鉄道（12）。事業者種別: 第三セクター（5）。

稲田
type: Concept
alternative label: 稲田（東日本旅客鉄道 水戸線）
broader: g002323
in scheme: scheme
notation: 002323
scope note: 運営会社: 東日本旅客鉄道。路線名: 水戸線。鉄道区分: 普通鉄道JR（11）。事業者種別: JR在来線（2）。

中根
type: Concept
alternative label: 中根（ひたちなか海浜鉄道 湊線）
broader: g002324
in scheme: scheme
notation: 002324
scope note: 運営会社: ひたちなか海浜鉄道。路線名: 湊線。鉄道区分: 普通鉄道（12）。事業者種別: 第三セクター（5）。

田沼
type: Concept
alternative label: 田沼（東武鉄道 佐野線）
broader: g002325
in scheme: scheme
notation: 002325
scope note: 運営会社: 東武鉄道。路線名: 佐野線。鉄道区分: 普通鉄道（12）。事業者種別: 民営鉄道（4）。

下之郷
type: Concept
alternative label: 下之郷（上田電鉄 別所線）
broader: g002326
in scheme: scheme
notation: 002326
scope note: 運営会社: 上田電鉄。路線名: 別所線。鉄道区分: 普通鉄道（12）。事業者種別: 民営鉄道（4）。

中塩田
type: Concept
alternative label: 中塩田（上田電鉄 別所線）
broader: g002327
in scheme: scheme
notation: 002327
scope note: 運営会社: 上田電鉄。路線名: 別所線。鉄道区分: 普通鉄道（12）。事業者種別: 民営鉄道（4）。

安中榛名
type: Concept
alternative label: 安中榛名（東日本旅客鉄道 北陸新幹線）
broader: g002328
in scheme: scheme
notation: 002328
scope note: 運営会社: 東日本旅客鉄道。路線名: 北陸新幹線。鉄道区分: 普通鉄道JR（11）。事業者種別: JRの新幹線（1）。

東水戸
type: Concept
alternative label: 東水戸（鹿島臨海鉄道 大洗鹿島線）
broader: g002329
in scheme: scheme
notation: 002329
scope note: 運営会社: 鹿島臨海鉄道。路線名: 大洗鹿島線。鉄道区分: 普通鉄道（12）。事業者種別: 第三セクター（5）。

塩田町
type: Concept
alternative label: 塩田町（上田電鉄 別所線）
broader: g002330
in scheme: scheme
notation: 002330
scope note: 運営会社: 上田電鉄。路線名: 別所線。鉄道区分: 普通鉄道（12）。事業者種別: 民営鉄道（4）。

中野
type: Concept
alternative label: 中野（上田電鉄 別所線）
broader: g002331
in scheme: scheme
notation: 002331
scope note: 運営会社: 上田電鉄。路線名: 別所線。鉄道区分: 普通鉄道（12）。事業者種別: 民営鉄道（4）。

有明
type: Concept
alternative label: 有明（東日本旅客鉄道 大糸線）
broader: g002332
in scheme: scheme
notation: 002332
scope note: 運営会社: 東日本旅客鉄道。路線名: 大糸線。鉄道区分: 普通鉄道JR（11）。事業者種別: JR在来線（2）。

舞田
type: Concept
alternative label: 舞田（上田電鉄 別所線）
broader: g002333
in scheme: scheme
notation: 002333
scope note: 運営会社: 上田電鉄。路線名: 別所線。鉄道区分: 普通鉄道（12）。事業者種別: 民営鉄道（4）。

岩瀬
type: Concept
alternative label: 岩瀬（東日本旅客鉄道 水戸線）
broader: g002334
in scheme: scheme
notation: 002334
scope note: 運営会社: 東日本旅客鉄道。路線名: 水戸線。鉄道区分: 普通鉄道JR（11）。事業者種別: JR在来線（2）。

国定
type: Concept
alternative label: 国定（東日本旅客鉄道 両毛線）
broader: g002335
in scheme: scheme
notation: 002335
scope note: 運営会社: 東日本旅客鉄道。路線名: 両毛線。鉄道区分: 普通鉄道JR（11）。事業者種別: JR在来線（2）。

藪塚
type: Concept
alternative label: 藪塚（東武鉄道 桐生線）
broader: g002336
in scheme: scheme
notation: 002336
scope note: 運営会社: 東武鉄道。路線名: 桐生線。鉄道区分: 普通鉄道（12）。事業者種別: 民営鉄道（4）。

ひぐち
type: Concept
alternative label: ひぐち（真岡鐵道 真岡線）
broader: g002337
in scheme: scheme
notation: 002337
scope note: 運営会社: 真岡鐵道。路線名: 真岡線。鉄道区分: 普通鉄道（12）。事業者種別: 第三セクター（5）。

八木沢
type: Concept
alternative label: 八木沢（上田電鉄 別所線）
broader: g002338
in scheme: scheme
notation: 002338
scope note: 運営会社: 上田電鉄。路線名: 別所線。鉄道区分: 普通鉄道（12）。事業者種別: 民営鉄道（4）。

平磯
type: Concept
alternative label: 平磯（ひたちなか海浜鉄道 湊線）
broader: g002339
in scheme: scheme
notation: 002339
scope note: 運営会社: ひたちなか海浜鉄道。路線名: 湊線。鉄道区分: 普通鉄道（12）。事業者種別: 第三セクター（5）。

井野
type: Concept
alternative label: 井野（東日本旅客鉄道 上越線）
broader: g002340
in scheme: scheme
notation: 002340
scope note: 運営会社: 東日本旅客鉄道。路線名: 上越線。鉄道区分: 普通鉄道JR（11）。事業者種別: JR在来線（2）。

粟津
type: Concept
alternative label: 粟津（IRいしかわ鉄道 IRいしかわ鉄道線）
broader: g002341
in scheme: scheme
notation: 002341
scope note: 運営会社: IRいしかわ鉄道。路線名: IRいしかわ鉄道線。鉄道区分: 普通鉄道（12）。事業者種別: 第三セクター（5）。

羽黒
type: Concept
alternative label: 羽黒（東日本旅客鉄道 水戸線）
broader: g002342
in scheme: scheme
notation: 002342
scope note: 運営会社: 東日本旅客鉄道。路線名: 水戸線。鉄道区分: 普通鉄道JR（11）。事業者種別: JR在来線（2）。

田中
type: Concept
alternative label: 田中（しなの鉄道 しなの鉄道線）
broader: g002343
in scheme: scheme
notation: 002343
scope note: 運営会社: しなの鉄道。路線名: しなの鉄道線。鉄道区分: 普通鉄道（12）。事業者種別: 第三セクター（5）。

駒形
type: Concept
alternative label: 駒形（東日本旅客鉄道 両毛線）
broader: g002344
in scheme: scheme
notation: 002344
scope note: 運営会社: 東日本旅客鉄道。路線名: 両毛線。鉄道区分: 普通鉄道JR（11）。事業者種別: JR在来線（2）。

明科
type: Concept
alternative label: 明科（東日本旅客鉄道 篠ノ井線）
broader: g002345
in scheme: scheme
notation: 002345
scope note: 運営会社: 東日本旅客鉄道。路線名: 篠ノ井線。鉄道区分: 普通鉄道JR（11）。事業者種別: JR在来線（2）。

別所温泉
type: Concept
alternative label: 別所温泉（上田電鉄 別所線）
broader: g002346
in scheme: scheme
notation: 002346
scope note: 運営会社: 上田電鉄。路線名: 別所線。鉄道区分: 普通鉄道（12）。事業者種別: 民営鉄道（4）。

高田の鉄橋
type: Concept
alternative label: 高田の鉄橋（ひたちなか海浜鉄道 湊線）
broader: g002347
in scheme: scheme
notation: 002347
scope note: 運営会社: ひたちなか海浜鉄道。路線名: 湊線。鉄道区分: 普通鉄道（12）。事業者種別: 第三セクター（5）。

福原
type: Concept
alternative label: 福原（東日本旅客鉄道 水戸線）
broader: g002348
in scheme: scheme
notation: 002348
scope note: 運営会社: 東日本旅客鉄道。路線名: 水戸線。鉄道区分: 普通鉄道JR（11）。事業者種別: JR在来線（2）。

思川
type: Concept
alternative label: 思川（東日本旅客鉄道 両毛線）
broader: g002349
in scheme: scheme
notation: 002349
scope note: 運営会社: 東日本旅客鉄道。路線名: 両毛線。鉄道区分: 普通鉄道JR（11）。事業者種別: JR在来線（2）。

友部
type: Concept
alternative label: 友部（東日本旅客鉄道 常磐線）
broader: g002350
in scheme: scheme
notation: 002350
scope note: 運営会社: 東日本旅客鉄道。路線名: 常磐線。鉄道区分: 普通鉄道JR（11）。事業者種別: JR在来線（2）。

友部
type: Concept
alternative label: 友部（東日本旅客鉄道 水戸線）
broader: g002350
in scheme: scheme
notation: 002351
scope note: 運営会社: 東日本旅客鉄道。路線名: 水戸線。鉄道区分: 普通鉄道JR（11）。事業者種別: JR在来線（2）。

殿山
type: Concept
alternative label: 殿山（ひたちなか海浜鉄道 湊線）
broader: g002352
in scheme: scheme
notation: 002352
scope note: 運営会社: ひたちなか海浜鉄道。路線名: 湊線。鉄道区分: 普通鉄道（12）。事業者種別: 第三セクター（5）。

中軽井沢
type: Concept
alternative label: 中軽井沢（しなの鉄道 しなの鉄道線）
broader: g002353
in scheme: scheme
notation: 002353
scope note: 運営会社: しなの鉄道。路線名: しなの鉄道線。鉄道区分: 普通鉄道（12）。事業者種別: 第三セクター（5）。

山前
type: Concept
alternative label: 山前（東日本旅客鉄道 両毛線）
broader: g002354
in scheme: scheme
notation: 002354
scope note: 運営会社: 東日本旅客鉄道。路線名: 両毛線。鉄道区分: 普通鉄道JR（11）。事業者種別: JR在来線（2）。

高崎問屋町
type: Concept
alternative label: 高崎問屋町（東日本旅客鉄道 上越線）
broader: g002355
in scheme: scheme
notation: 002355
scope note: 運営会社: 東日本旅客鉄道。路線名: 上越線。鉄道区分: 普通鉄道JR（11）。事業者種別: JR在来線（2）。

吉水
type: Concept
alternative label: 吉水（東武鉄道 佐野線）
broader: g002356
in scheme: scheme
notation: 002356
scope note: 運営会社: 東武鉄道。路線名: 佐野線。鉄道区分: 普通鉄道（12）。事業者種別: 民営鉄道（4）。

大和
type: Concept
alternative label: 大和（東日本旅客鉄道 水戸線）
broader: g002357
in scheme: scheme
notation: 002357
scope note: 運営会社: 東日本旅客鉄道。路線名: 水戸線。鉄道区分: 普通鉄道JR（11）。事業者種別: JR在来線（2）。

那珂湊
type: Concept
alternative label: 那珂湊（ひたちなか海浜鉄道 湊線）
broader: g002358
in scheme: scheme
notation: 002358
scope note: 運営会社: ひたちなか海浜鉄道。路線名: 湊線。鉄道区分: 普通鉄道（12）。事業者種別: 第三セクター（5）。

宍戸
type: Concept
alternative label: 宍戸（東日本旅客鉄道 水戸線）
broader: g002359
in scheme: scheme
notation: 002359
scope note: 運営会社: 東日本旅客鉄道。路線名: 水戸線。鉄道区分: 普通鉄道JR（11）。事業者種別: JR在来線（2）。

大平下
type: Concept
alternative label: 大平下（東日本旅客鉄道 両毛線）
broader: g002360
in scheme: scheme
notation: 002360
scope note: 運営会社: 東日本旅客鉄道。路線名: 両毛線。鉄道区分: 普通鉄道JR（11）。事業者種別: JR在来線（2）。

軽井沢
type: Concept
alternative label: 軽井沢（しなの鉄道 しなの鉄道線）
broader: g002361
in scheme: scheme
notation: 002361
scope note: 運営会社: しなの鉄道。路線名: しなの鉄道線。鉄道区分: 普通鉄道（12）。事業者種別: 第三セクター（5）。

軽井沢
type: Concept
alternative label: 軽井沢（東日本旅客鉄道 北陸新幹線）
broader: g002361
in scheme: scheme
notation: 002362
scope note: 運営会社: 東日本旅客鉄道。路線名: 北陸新幹線。鉄道区分: 普通鉄道JR（11）。事業者種別: JRの新幹線（1）。

滋野
type: Concept
alternative label: 滋野（しなの鉄道 しなの鉄道線）
broader: g002363
in scheme: scheme
notation: 002363
scope note: 運営会社: しなの鉄道。路線名: しなの鉄道線。鉄道区分: 普通鉄道（12）。事業者種別: 第三セクター（5）。

常澄
type: Concept
alternative label: 常澄（鹿島臨海鉄道 大洗鹿島線）
broader: g002364
in scheme: scheme
notation: 002364
scope note: 運営会社: 鹿島臨海鉄道。路線名: 大洗鹿島線。鉄道区分: 普通鉄道（12）。事業者種別: 第三セクター（5）。

折本
type: Concept
alternative label: 折本（真岡鐵道 真岡線）
broader: g002365
in scheme: scheme
notation: 002365
scope note: 運営会社: 真岡鐵道。路線名: 真岡線。鉄道区分: 普通鉄道（12）。事業者種別: 第三セクター（5）。

穂高
type: Concept
alternative label: 穂高（東日本旅客鉄道 大糸線）
broader: g002366
in scheme: scheme
notation: 002366
scope note: 運営会社: 東日本旅客鉄道。路線名: 大糸線。鉄道区分: 普通鉄道JR（11）。事業者種別: JR在来線（2）。

新大平下
type: Concept
alternative label: 新大平下（東武鉄道 日光線）
broader: g002367
in scheme: scheme
notation: 002367
scope note: 運営会社: 東武鉄道。路線名: 日光線。鉄道区分: 普通鉄道（12）。事業者種別: 民営鉄道（4）。

北高崎
type: Concept
alternative label: 北高崎（東日本旅客鉄道 信越線）
broader: g002368
in scheme: scheme
notation: 002368
scope note: 運営会社: 東日本旅客鉄道。路線名: 信越線。鉄道区分: 普通鉄道JR（11）。事業者種別: JR在来線（2）。

群馬八幡
type: Concept
alternative label: 群馬八幡（東日本旅客鉄道 信越線）
broader: g002369
in scheme: scheme
notation: 002369
scope note: 運営会社: 東日本旅客鉄道。路線名: 信越線。鉄道区分: 普通鉄道JR（11）。事業者種別: JR在来線（2）。

横川
type: Concept
alternative label: 横川（東日本旅客鉄道 信越線）
broader: g002370
in scheme: scheme
notation: 002370
scope note: 運営会社: 東日本旅客鉄道。路線名: 信越線。鉄道区分: 普通鉄道JR（11）。事業者種別: JR在来線（2）。

信濃追分
type: Concept
alternative label: 信濃追分（しなの鉄道 しなの鉄道線）
broader: g002371
in scheme: scheme
notation: 002371
scope note: 運営会社: しなの鉄道。路線名: しなの鉄道線。鉄道区分: 普通鉄道（12）。事業者種別: 第三セクター（5）。

治良門橋
type: Concept
alternative label: 治良門橋（東武鉄道 桐生線）
broader: g002372
in scheme: scheme
notation: 002372
scope note: 運営会社: 東武鉄道。路線名: 桐生線。鉄道区分: 普通鉄道（12）。事業者種別: 民営鉄道（4）。

足利
type: Concept
alternative label: 足利（東日本旅客鉄道 両毛線）
broader: g002373
in scheme: scheme
notation: 002373
scope note: 運営会社: 東日本旅客鉄道。路線名: 両毛線。鉄道区分: 普通鉄道JR（11）。事業者種別: JR在来線（2）。

安中
type: Concept
alternative label: 安中（東日本旅客鉄道 信越線）
broader: g002374
in scheme: scheme
notation: 002374
scope note: 運営会社: 東日本旅客鉄道。路線名: 信越線。鉄道区分: 普通鉄道JR（11）。事業者種別: JR在来線（2）。

足利市
type: Concept
alternative label: 足利市（東武鉄道 伊勢崎線）
broader: g002375
in scheme: scheme
notation: 002375
scope note: 運営会社: 東武鉄道。路線名: 伊勢崎線。鉄道区分: 普通鉄道（12）。事業者種別: 民営鉄道（4）。

堀米
type: Concept
alternative label: 堀米（東武鉄道 佐野線）
broader: g002376
in scheme: scheme
notation: 002376
scope note: 運営会社: 東武鉄道。路線名: 佐野線。鉄道区分: 普通鉄道（12）。事業者種別: 民営鉄道（4）。

動橋
type: Concept
alternative label: 動橋（IRいしかわ鉄道 IRいしかわ鉄道線）
broader: g002377
in scheme: scheme
notation: 002377
scope note: 運営会社: IRいしかわ鉄道。路線名: IRいしかわ鉄道線。鉄道区分: 普通鉄道（12）。事業者種別: 第三セクター（5）。

新治
type: Concept
alternative label: 新治（東日本旅客鉄道 水戸線）
broader: g002378
in scheme: scheme
notation: 002378
scope note: 運営会社: 東日本旅客鉄道。路線名: 水戸線。鉄道区分: 普通鉄道JR（11）。事業者種別: JR在来線（2）。

坂上
type: Concept
alternative label: 坂上（東海旅客鉄道 高山線）
broader: g002379
in scheme: scheme
notation: 002379
scope note: 運営会社: 東海旅客鉄道。路線名: 高山線。鉄道区分: 普通鉄道JR（11）。事業者種別: JR在来線（2）。

伊勢崎
type: Concept
alternative label: 伊勢崎（東日本旅客鉄道 両毛線）
broader: g002380
in scheme: scheme
notation: 002380
scope note: 運営会社: 東日本旅客鉄道。路線名: 両毛線。鉄道区分: 普通鉄道JR（11）。事業者種別: JR在来線（2）。

岩舟
type: Concept
alternative label: 岩舟（東日本旅客鉄道 両毛線）
broader: g002381
in scheme: scheme
notation: 002381
scope note: 運営会社: 東日本旅客鉄道。路線名: 両毛線。鉄道区分: 普通鉄道JR（11）。事業者種別: JR在来線（2）。

伊勢崎
type: Concept
alternative label: 伊勢崎（東武鉄道 伊勢崎線）
broader: g002380
in scheme: scheme
notation: 002382
scope note: 運営会社: 東武鉄道。路線名: 伊勢崎線。鉄道区分: 普通鉄道（12）。事業者種別: 民営鉄道（4）。

野州山辺
type: Concept
alternative label: 野州山辺（東武鉄道 伊勢崎線）
broader: g002383
in scheme: scheme
notation: 002383
scope note: 運営会社: 東武鉄道。路線名: 伊勢崎線。鉄道区分: 普通鉄道（12）。事業者種別: 民営鉄道（4）。

小諸
type: Concept
alternative label: 小諸（しなの鉄道 しなの鉄道線）
broader: g002384
in scheme: scheme
notation: 002384
scope note: 運営会社: しなの鉄道。路線名: しなの鉄道線。鉄道区分: 普通鉄道（12）。事業者種別: 第三セクター（5）。

小諸
type: Concept
alternative label: 小諸（東日本旅客鉄道 小海線）
broader: g002384
in scheme: scheme
notation: 002385
scope note: 運営会社: 東日本旅客鉄道。路線名: 小海線。鉄道区分: 普通鉄道JR（11）。事業者種別: JR在来線（2）。

高崎
type: Concept
alternative label: 高崎（東日本旅客鉄道 上越新幹線）
broader: g002389
in scheme: scheme
notation: 002386
scope note: 運営会社: 東日本旅客鉄道。路線名: 上越新幹線。鉄道区分: 普通鉄道JR（11）。事業者種別: JRの新幹線（1）。

高崎
type: Concept
alternative label: 高崎（東日本旅客鉄道 北陸新幹線）
broader: g002389
in scheme: scheme
notation: 002387
scope note: 運営会社: 東日本旅客鉄道。路線名: 北陸新幹線。鉄道区分: 普通鉄道JR（11）。事業者種別: JRの新幹線（1）。

柏矢町
type: Concept
alternative label: 柏矢町（東日本旅客鉄道 大糸線）
broader: g002388
in scheme: scheme
notation: 002388
scope note: 運営会社: 東日本旅客鉄道。路線名: 大糸線。鉄道区分: 普通鉄道JR（11）。事業者種別: JR在来線（2）。

高崎
type: Concept
alternative label: 高崎（東日本旅客鉄道 高崎線）
broader: g002389
in scheme: scheme
notation: 002389
scope note: 運営会社: 東日本旅客鉄道。路線名: 高崎線。鉄道区分: 普通鉄道JR（11）。事業者種別: JR在来線（2）。

高崎
type: Concept
alternative label: 高崎（東日本旅客鉄道 上越線）
broader: g002389
in scheme: scheme
notation: 002390
scope note: 運営会社: 東日本旅客鉄道。路線名: 上越線。鉄道区分: 普通鉄道JR（11）。事業者種別: JR在来線（2）。

高崎
type: Concept
alternative label: 高崎（東日本旅客鉄道 信越線）
broader: g002389
in scheme: scheme
notation: 002391
scope note: 運営会社: 東日本旅客鉄道。路線名: 信越線。鉄道区分: 普通鉄道JR（11）。事業者種別: JR在来線（2）。

加賀温泉
type: Concept
alternative label: 加賀温泉（IRいしかわ鉄道 IRいしかわ鉄道線）
broader: g002392
in scheme: scheme
notation: 002392
scope note: 運営会社: IRいしかわ鉄道。路線名: IRいしかわ鉄道線。鉄道区分: 普通鉄道（12）。事業者種別: 第三セクター（5）。

高崎
type: Concept
alternative label: 高崎（上信電鉄 上信線）
broader: g002389
in scheme: scheme
notation: 002393
scope note: 運営会社: 上信電鉄。路線名: 上信線。鉄道区分: 普通鉄道（12）。事業者種別: 民営鉄道（4）。

下館二高前
type: Concept
alternative label: 下館二高前（真岡鐵道 真岡線）
broader: g002394
in scheme: scheme
notation: 002394
scope note: 運営会社: 真岡鐵道。路線名: 真岡線。鉄道区分: 普通鉄道（12）。事業者種別: 第三セクター（5）。

御代田
type: Concept
alternative label: 御代田（しなの鉄道 しなの鉄道線）
broader: g002395
in scheme: scheme
notation: 002395
scope note: 運営会社: しなの鉄道。路線名: しなの鉄道線。鉄道区分: 普通鉄道（12）。事業者種別: 第三セクター（5）。

新伊勢崎
type: Concept
alternative label: 新伊勢崎（東武鉄道 伊勢崎線）
broader: g002396
in scheme: scheme
notation: 002396
scope note: 運営会社: 東武鉄道。路線名: 伊勢崎線。鉄道区分: 普通鉄道（12）。事業者種別: 民営鉄道（4）。

東小諸
type: Concept
alternative label: 東小諸（東日本旅客鉄道 小海線）
broader: g002397
in scheme: scheme
notation: 002397
scope note: 運営会社: 東日本旅客鉄道。路線名: 小海線。鉄道区分: 普通鉄道JR（11）。事業者種別: JR在来線（2）。

佐野
type: Concept
alternative label: 佐野（東武鉄道 佐野線）
broader: g002398
in scheme: scheme
notation: 002398
scope note: 運営会社: 東武鉄道。路線名: 佐野線。鉄道区分: 普通鉄道（12）。事業者種別: 民営鉄道（4）。

佐野
type: Concept
alternative label: 佐野（東日本旅客鉄道 両毛線）
broader: g002398
in scheme: scheme
notation: 002399
scope note: 運営会社: 東日本旅客鉄道。路線名: 両毛線。鉄道区分: 普通鉄道JR（11）。事業者種別: JR在来線（2）。

静和
type: Concept
alternative label: 静和（東武鉄道 日光線）
broader: g002400
in scheme: scheme
notation: 002400
scope note: 運営会社: 東武鉄道。路線名: 日光線。鉄道区分: 普通鉄道（12）。事業者種別: 民営鉄道（4）。

富田
type: Concept
alternative label: 富田（東日本旅客鉄道 両毛線）
broader: g002401
in scheme: scheme
notation: 002401
scope note: 運営会社: 東日本旅客鉄道。路線名: 両毛線。鉄道区分: 普通鉄道JR（11）。事業者種別: JR在来線（2）。

西松井田
type: Concept
alternative label: 西松井田（東日本旅客鉄道 信越線）
broader: g002402
in scheme: scheme
notation: 002402
scope note: 運営会社: 東日本旅客鉄道。路線名: 信越線。鉄道区分: 普通鉄道JR（11）。事業者種別: JR在来線（2）。

東武和泉
type: Concept
alternative label: 東武和泉（東武鉄道 伊勢崎線）
broader: g002403
in scheme: scheme
notation: 002403
scope note: 運営会社: 東武鉄道。路線名: 伊勢崎線。鉄道区分: 普通鉄道（12）。事業者種別: 民営鉄道（4）。

大洗
type: Concept
alternative label: 大洗（鹿島臨海鉄道 大洗鹿島線）
broader: g002404
in scheme: scheme
notation: 002404
scope note: 運営会社: 鹿島臨海鉄道。路線名: 大洗鹿島線。鉄道区分: 普通鉄道（12）。事業者種別: 第三セクター（5）。

あしかがフラワーパーク
type: Concept
alternative label: あしかがフラワーパーク（東日本旅客鉄道 両毛線）
broader: g002405
in scheme: scheme
notation: 002405
scope note: 運営会社: 東日本旅客鉄道。路線名: 両毛線。鉄道区分: 普通鉄道JR（11）。事業者種別: JR在来線（2）。

小山
type: Concept
alternative label: 小山（東日本旅客鉄道 東北新幹線）
broader: g002407
in scheme: scheme
notation: 002406
scope note: 運営会社: 東日本旅客鉄道。路線名: 東北新幹線。鉄道区分: 普通鉄道JR（11）。事業者種別: JRの新幹線（1）。

小山
type: Concept
alternative label: 小山（東日本旅客鉄道 東北線）
broader: g002407
in scheme: scheme
notation: 002407
scope note: 運営会社: 東日本旅客鉄道。路線名: 東北線。鉄道区分: 普通鉄道JR（11）。事業者種別: JR在来線（2）。

三枚橋
type: Concept
alternative label: 三枚橋（東武鉄道 桐生線）
broader: g002408
in scheme: scheme
notation: 002408
scope note: 運営会社: 東武鉄道。路線名: 桐生線。鉄道区分: 普通鉄道（12）。事業者種別: 民営鉄道（4）。

南高崎
type: Concept
alternative label: 南高崎（上信電鉄 上信線）
broader: g002409
in scheme: scheme
notation: 002409
scope note: 運営会社: 上信電鉄。路線名: 上信線。鉄道区分: 普通鉄道（12）。事業者種別: 民営鉄道（4）。

小山
type: Concept
alternative label: 小山（東日本旅客鉄道 水戸線）
broader: g002407
in scheme: scheme
notation: 002410
scope note: 運営会社: 東日本旅客鉄道。路線名: 水戸線。鉄道区分: 普通鉄道JR（11）。事業者種別: JR在来線（2）。

小山
type: Concept
alternative label: 小山（東日本旅客鉄道 両毛線）
broader: g002407
in scheme: scheme
notation: 002411
scope note: 運営会社: 東日本旅客鉄道。路線名: 両毛線。鉄道区分: 普通鉄道JR（11）。事業者種別: JR在来線（2）。

乙女
type: Concept
alternative label: 乙女（東日本旅客鉄道 小海線）
broader: g002412
in scheme: scheme
notation: 002412
scope note: 運営会社: 東日本旅客鉄道。路線名: 小海線。鉄道区分: 普通鉄道JR（11）。事業者種別: JR在来線（2）。

松井田
type: Concept
alternative label: 松井田（東日本旅客鉄道 信越線）
broader: g002413
in scheme: scheme
notation: 002413
scope note: 運営会社: 東日本旅客鉄道。路線名: 信越線。鉄道区分: 普通鉄道JR（11）。事業者種別: JR在来線（2）。

平原
type: Concept
alternative label: 平原（しなの鉄道 しなの鉄道線）
broader: g002414
in scheme: scheme
notation: 002414
scope note: 運営会社: しなの鉄道。路線名: しなの鉄道線。鉄道区分: 普通鉄道（12）。事業者種別: 第三セクター（5）。

韮川
type: Concept
alternative label: 韮川（東武鉄道 伊勢崎線）
broader: g002415
in scheme: scheme
notation: 002415
scope note: 運営会社: 東武鉄道。路線名: 伊勢崎線。鉄道区分: 普通鉄道（12）。事業者種別: 民営鉄道（4）。

佐野市
type: Concept
alternative label: 佐野市（東武鉄道 佐野線）
broader: g002416
in scheme: scheme
notation: 002416
scope note: 運営会社: 東武鉄道。路線名: 佐野線。鉄道区分: 普通鉄道（12）。事業者種別: 民営鉄道（4）。

福居
type: Concept
alternative label: 福居（東武鉄道 伊勢崎線）
broader: g002417
in scheme: scheme
notation: 002417
scope note: 運営会社: 東武鉄道。路線名: 伊勢崎線。鉄道区分: 普通鉄道（12）。事業者種別: 民営鉄道（4）。

三岡
type: Concept
alternative label: 三岡（東日本旅客鉄道 小海線）
broader: g002418
in scheme: scheme
notation: 002418
scope note: 運営会社: 東日本旅客鉄道。路線名: 小海線。鉄道区分: 普通鉄道JR（11）。事業者種別: JR在来線（2）。

下館
type: Concept
alternative label: 下館（東日本旅客鉄道 水戸線）
broader: g002419
in scheme: scheme
notation: 002419
scope note: 運営会社: 東日本旅客鉄道。路線名: 水戸線。鉄道区分: 普通鉄道JR（11）。事業者種別: JR在来線（2）。

下館
type: Concept
alternative label: 下館（真岡鐵道 真岡線）
broader: g002419
in scheme: scheme
notation: 002420
scope note: 運営会社: 真岡鐵道。路線名: 真岡線。鉄道区分: 普通鉄道（12）。事業者種別: 第三セクター（5）。

下館
type: Concept
alternative label: 下館（関東鉄道 常総線）
broader: g002419
in scheme: scheme
notation: 002421
scope note: 運営会社: 関東鉄道。路線名: 常総線。鉄道区分: 普通鉄道（12）。事業者種別: 民営鉄道（4）。

佐野のわたし
type: Concept
alternative label: 佐野のわたし（上信電鉄 上信線）
broader: g002422
in scheme: scheme
notation: 002422
scope note: 運営会社: 上信電鉄。路線名: 上信線。鉄道区分: 普通鉄道（12）。事業者種別: 民営鉄道（4）。

田沢
type: Concept
alternative label: 田沢（東日本旅客鉄道 篠ノ井線）
broader: g002423
in scheme: scheme
notation: 002423
scope note: 運営会社: 東日本旅客鉄道。路線名: 篠ノ井線。鉄道区分: 普通鉄道JR（11）。事業者種別: JR在来線（2）。

小田林
type: Concept
alternative label: 小田林（東日本旅客鉄道 水戸線）
broader: g002424
in scheme: scheme
notation: 002424
scope note: 運営会社: 東日本旅客鉄道。路線名: 水戸線。鉄道区分: 普通鉄道JR（11）。事業者種別: JR在来線（2）。

大聖寺
type: Concept
alternative label: 大聖寺（ハピラインふくい ハピラインふくい線）
broader: g002425
in scheme: scheme
notation: 002425
scope note: 運営会社: ハピラインふくい。路線名: ハピラインふくい線。鉄道区分: 普通鉄道（12）。事業者種別: 第三セクター（5）。

倉賀野
type: Concept
alternative label: 倉賀野（東日本旅客鉄道 高崎線）
broader: g002426
in scheme: scheme
notation: 002426
scope note: 運営会社: 東日本旅客鉄道。路線名: 高崎線。鉄道区分: 普通鉄道JR（11）。事業者種別: JR在来線（2）。

倉賀野
type: Concept
alternative label: 倉賀野（東日本旅客鉄道 八高線）
broader: g002426
in scheme: scheme
notation: 002427
scope note: 運営会社: 東日本旅客鉄道。路線名: 八高線。鉄道区分: 普通鉄道JR（11）。事業者種別: JR在来線（2）。

豊科
type: Concept
alternative label: 豊科（東日本旅客鉄道 大糸線）
broader: g002428
in scheme: scheme
notation: 002428
scope note: 運営会社: 東日本旅客鉄道。路線名: 大糸線。鉄道区分: 普通鉄道JR（11）。事業者種別: JR在来線（2）。

角川
type: Concept
alternative label: 角川（東海旅客鉄道 高山線）
broader: g002429
in scheme: scheme
notation: 002429
scope note: 運営会社: 東海旅客鉄道。路線名: 高山線。鉄道区分: 普通鉄道JR（11）。事業者種別: JR在来線（2）。

玉戸
type: Concept
alternative label: 玉戸（東日本旅客鉄道 水戸線）
broader: g002430
in scheme: scheme
notation: 002430
scope note: 運営会社: 東日本旅客鉄道。路線名: 水戸線。鉄道区分: 普通鉄道JR（11）。事業者種別: JR在来線（2）。

磯部
type: Concept
alternative label: 磯部（東日本旅客鉄道 信越線）
broader: g002431
in scheme: scheme
notation: 002431
scope note: 運営会社: 東日本旅客鉄道。路線名: 信越線。鉄道区分: 普通鉄道JR（11）。事業者種別: JR在来線（2）。

結城
type: Concept
alternative label: 結城（東日本旅客鉄道 水戸線）
broader: g002432
in scheme: scheme
notation: 002432
scope note: 運営会社: 東日本旅客鉄道。路線名: 水戸線。鉄道区分: 普通鉄道JR（11）。事業者種別: JR在来線（2）。

東結城
type: Concept
alternative label: 東結城（東日本旅客鉄道 水戸線）
broader: g002433
in scheme: scheme
notation: 002433
scope note: 運営会社: 東日本旅客鉄道。路線名: 水戸線。鉄道区分: 普通鉄道JR（11）。事業者種別: JR在来線（2）。

川島
type: Concept
alternative label: 川島（東日本旅客鉄道 水戸線）
broader: g002434
in scheme: scheme
notation: 002434
scope note: 運営会社: 東日本旅客鉄道。路線名: 水戸線。鉄道区分: 普通鉄道JR（11）。事業者種別: JR在来線（2）。

岩間
type: Concept
alternative label: 岩間（東日本旅客鉄道 常磐線）
broader: g002435
in scheme: scheme
notation: 002435
scope note: 運営会社: 東日本旅客鉄道。路線名: 常磐線。鉄道区分: 普通鉄道JR（11）。事業者種別: JR在来線（2）。

剛志
type: Concept
alternative label: 剛志（東武鉄道 伊勢崎線）
broader: g002436
in scheme: scheme
notation: 002436
scope note: 運営会社: 東武鉄道。路線名: 伊勢崎線。鉄道区分: 普通鉄道（12）。事業者種別: 民営鉄道（4）。

太田
type: Concept
alternative label: 太田（東武鉄道 伊勢崎線）
broader: g002437
in scheme: scheme
notation: 002437
scope note: 運営会社: 東武鉄道。路線名: 伊勢崎線。鉄道区分: 普通鉄道（12）。事業者種別: 民営鉄道（4）。

太田
type: Concept
alternative label: 太田（東武鉄道 桐生線）
broader: g002437
in scheme: scheme
notation: 002438
scope note: 運営会社: 東武鉄道。路線名: 桐生線。鉄道区分: 普通鉄道（12）。事業者種別: 民営鉄道（4）。

太田
type: Concept
alternative label: 太田（東武鉄道 小泉線）
broader: g002437
in scheme: scheme
notation: 002439
scope note: 運営会社: 東武鉄道。路線名: 小泉線。鉄道区分: 普通鉄道（12）。事業者種別: 民営鉄道（4）。

美里
type: Concept
alternative label: 美里（東日本旅客鉄道 小海線）
broader: g002440
in scheme: scheme
notation: 002440
scope note: 運営会社: 東日本旅客鉄道。路線名: 小海線。鉄道区分: 普通鉄道JR（11）。事業者種別: JR在来線（2）。

根小屋
type: Concept
alternative label: 根小屋（上信電鉄 上信線）
broader: g002441
in scheme: scheme
notation: 002441
scope note: 運営会社: 上信電鉄。路線名: 上信線。鉄道区分: 普通鉄道（12）。事業者種別: 民営鉄道（4）。

南豊科
type: Concept
alternative label: 南豊科（東日本旅客鉄道 大糸線）
broader: g002442
in scheme: scheme
notation: 002442
scope note: 運営会社: 東日本旅客鉄道。路線名: 大糸線。鉄道区分: 普通鉄道JR（11）。事業者種別: JR在来線（2）。

県
type: Concept
alternative label: 県（東武鉄道 伊勢崎線）
broader: g002443
in scheme: scheme
notation: 002443
scope note: 運営会社: 東武鉄道。路線名: 伊勢崎線。鉄道区分: 普通鉄道（12）。事業者種別: 民営鉄道（4）。

田島
type: Concept
alternative label: 田島（東武鉄道 佐野線）
broader: g002444
in scheme: scheme
notation: 002444
scope note: 運営会社: 東武鉄道。路線名: 佐野線。鉄道区分: 普通鉄道（12）。事業者種別: 民営鉄道（4）。

高崎商科大学前
type: Concept
alternative label: 高崎商科大学前（上信電鉄 上信線）
broader: g002445
in scheme: scheme
notation: 002445
scope note: 運営会社: 上信電鉄。路線名: 上信線。鉄道区分: 普通鉄道（12）。事業者種別: 民営鉄道（4）。

細谷
type: Concept
alternative label: 細谷（東武鉄道 伊勢崎線）
broader: g002446
in scheme: scheme
notation: 002446
scope note: 運営会社: 東武鉄道。路線名: 伊勢崎線。鉄道区分: 普通鉄道（12）。事業者種別: 民営鉄道（4）。

北藤岡
type: Concept
alternative label: 北藤岡（東日本旅客鉄道 八高線）
broader: g002447
in scheme: scheme
notation: 002447
scope note: 運営会社: 東日本旅客鉄道。路線名: 八高線。鉄道区分: 普通鉄道JR（11）。事業者種別: JR在来線（2）。

中佐都
type: Concept
alternative label: 中佐都（東日本旅客鉄道 小海線）
broader: g002448
in scheme: scheme
notation: 002448
scope note: 運営会社: 東日本旅客鉄道。路線名: 小海線。鉄道区分: 普通鉄道JR（11）。事業者種別: JR在来線（2）。

竜舞
type: Concept
alternative label: 竜舞（東武鉄道 小泉線）
broader: g002449
in scheme: scheme
notation: 002449
scope note: 運営会社: 東武鉄道。路線名: 小泉線。鉄道区分: 普通鉄道（12）。事業者種別: 民営鉄道（4）。

大田郷
type: Concept
alternative label: 大田郷（関東鉄道 常総線）
broader: g002450
in scheme: scheme
notation: 002450
scope note: 運営会社: 関東鉄道。路線名: 常総線。鉄道区分: 普通鉄道（12）。事業者種別: 民営鉄道（4）。

佐久平
type: Concept
alternative label: 佐久平（東日本旅客鉄道 北陸新幹線）
broader: g002451
in scheme: scheme
notation: 002451
scope note: 運営会社: 東日本旅客鉄道。路線名: 北陸新幹線。鉄道区分: 普通鉄道JR（11）。事業者種別: JRの新幹線（1）。

山名
type: Concept
alternative label: 山名（上信電鉄 上信線）
broader: g002452
in scheme: scheme
notation: 002452
scope note: 運営会社: 上信電鉄。路線名: 上信線。鉄道区分: 普通鉄道（12）。事業者種別: 民営鉄道（4）。

佐久平
type: Concept
alternative label: 佐久平（東日本旅客鉄道 小海線）
broader: g002451
in scheme: scheme
notation: 002453
scope note: 運営会社: 東日本旅客鉄道。路線名: 小海線。鉄道区分: 普通鉄道JR（11）。事業者種別: JR在来線（2）。

境町
type: Concept
alternative label: 境町（東武鉄道 伊勢崎線）
broader: g002454
in scheme: scheme
notation: 002454
scope note: 運営会社: 東武鉄道。路線名: 伊勢崎線。鉄道区分: 普通鉄道（12）。事業者種別: 民営鉄道（4）。

岩村田
type: Concept
alternative label: 岩村田（東日本旅客鉄道 小海線）
broader: g002455
in scheme: scheme
notation: 002455
scope note: 運営会社: 東日本旅客鉄道。路線名: 小海線。鉄道区分: 普通鉄道JR（11）。事業者種別: JR在来線（2）。

中萱
type: Concept
alternative label: 中萱（東日本旅客鉄道 大糸線）
broader: g002456
in scheme: scheme
notation: 002456
scope note: 運営会社: 東日本旅客鉄道。路線名: 大糸線。鉄道区分: 普通鉄道JR（11）。事業者種別: JR在来線（2）。

多々良
type: Concept
alternative label: 多々良（東武鉄道 伊勢崎線）
broader: g002457
in scheme: scheme
notation: 002457
scope note: 運営会社: 東武鉄道。路線名: 伊勢崎線。鉄道区分: 普通鉄道（12）。事業者種別: 民営鉄道（4）。

新町
type: Concept
alternative label: 新町（東日本旅客鉄道 高崎線）
broader: g002458
in scheme: scheme
notation: 002458
scope note: 運営会社: 東日本旅客鉄道。路線名: 高崎線。鉄道区分: 普通鉄道JR（11）。事業者種別: JR在来線（2）。

世良田
type: Concept
alternative label: 世良田（東武鉄道 伊勢崎線）
broader: g002459
in scheme: scheme
notation: 002459
scope note: 運営会社: 東武鉄道。路線名: 伊勢崎線。鉄道区分: 普通鉄道（12）。事業者種別: 民営鉄道（4）。

木崎
type: Concept
alternative label: 木崎（東武鉄道 伊勢崎線）
broader: g002460
in scheme: scheme
notation: 002460
scope note: 運営会社: 東武鉄道。路線名: 伊勢崎線。鉄道区分: 普通鉄道（12）。事業者種別: 民営鉄道（4）。

西山名
type: Concept
alternative label: 西山名（上信電鉄 上信線）
broader: g002461
in scheme: scheme
notation: 002461
scope note: 運営会社: 上信電鉄。路線名: 上信線。鉄道区分: 普通鉄道（12）。事業者種別: 民営鉄道（4）。

涸沼
type: Concept
alternative label: 涸沼（鹿島臨海鉄道 大洗鹿島線）
broader: g002462
in scheme: scheme
notation: 002462
scope note: 運営会社: 鹿島臨海鉄道。路線名: 大洗鹿島線。鉄道区分: 普通鉄道（12）。事業者種別: 第三セクター（5）。

渡瀬
type: Concept
alternative label: 渡瀬（東武鉄道 佐野線）
broader: g002463
in scheme: scheme
notation: 002463
scope note: 運営会社: 東武鉄道。路線名: 佐野線。鉄道区分: 普通鉄道（12）。事業者種別: 民営鉄道（4）。

小泉町
type: Concept
alternative label: 小泉町（東武鉄道 小泉線）
broader: g002464
in scheme: scheme
notation: 002464
scope note: 運営会社: 東武鉄道。路線名: 小泉線。鉄道区分: 普通鉄道（12）。事業者種別: 民営鉄道（4）。

馬庭
type: Concept
alternative label: 馬庭（上信電鉄 上信線）
broader: g002465
in scheme: scheme
notation: 002465
scope note: 運営会社: 上信電鉄。路線名: 上信線。鉄道区分: 普通鉄道（12）。事業者種別: 民営鉄道（4）。

飛騨細江
type: Concept
alternative label: 飛騨細江（東海旅客鉄道 高山線）
broader: g002466
in scheme: scheme
notation: 002466
scope note: 運営会社: 東海旅客鉄道。路線名: 高山線。鉄道区分: 普通鉄道JR（11）。事業者種別: JR在来線（2）。

東富岡
type: Concept
alternative label: 東富岡（上信電鉄 上信線）
broader: g002467
in scheme: scheme
notation: 002467
scope note: 運営会社: 上信電鉄。路線名: 上信線。鉄道区分: 普通鉄道（12）。事業者種別: 民営鉄道（4）。

上州富岡
type: Concept
alternative label: 上州富岡（上信電鉄 上信線）
broader: g002468
in scheme: scheme
notation: 002468
scope note: 運営会社: 上信電鉄。路線名: 上信線。鉄道区分: 普通鉄道（12）。事業者種別: 民営鉄道（4）。

西富岡
type: Concept
alternative label: 西富岡（上信電鉄 上信線）
broader: g002469
in scheme: scheme
notation: 002469
scope note: 運営会社: 上信電鉄。路線名: 上信線。鉄道区分: 普通鉄道（12）。事業者種別: 民営鉄道（4）。

一日市場
type: Concept
alternative label: 一日市場（東日本旅客鉄道 大糸線）
broader: g002470
in scheme: scheme
notation: 002470
scope note: 運営会社: 東日本旅客鉄道。路線名: 大糸線。鉄道区分: 普通鉄道JR（11）。事業者種別: JR在来線（2）。

東小泉
type: Concept
alternative label: 東小泉（東武鉄道 小泉線）
broader: g002471
in scheme: scheme
notation: 002471
scope note: 運営会社: 東武鉄道。路線名: 小泉線。鉄道区分: 普通鉄道（12）。事業者種別: 民営鉄道（4）。

牛ノ谷
type: Concept
alternative label: 牛ノ谷（ハピラインふくい ハピラインふくい線）
broader: g002472
in scheme: scheme
notation: 002472
scope note: 運営会社: ハピラインふくい。路線名: ハピラインふくい線。鉄道区分: 普通鉄道（12）。事業者種別: 第三セクター（5）。

西小泉
type: Concept
alternative label: 西小泉（東武鉄道 小泉線）
broader: g002473
in scheme: scheme
notation: 002473
scope note: 運営会社: 東武鉄道。路線名: 小泉線。鉄道区分: 普通鉄道（12）。事業者種別: 民営鉄道（4）。

上州七日市
type: Concept
alternative label: 上州七日市（上信電鉄 上信線）
broader: g002474
in scheme: scheme
notation: 002474
scope note: 運営会社: 上信電鉄。路線名: 上信線。鉄道区分: 普通鉄道（12）。事業者種別: 民営鉄道（4）。

本中野
type: Concept
alternative label: 本中野（東武鉄道 小泉線）
broader: g002475
in scheme: scheme
notation: 002475
scope note: 運営会社: 東武鉄道。路線名: 小泉線。鉄道区分: 普通鉄道（12）。事業者種別: 民営鉄道（4）。

間々田
type: Concept
alternative label: 間々田（東日本旅客鉄道 東北線）
broader: g002476
in scheme: scheme
notation: 002476
scope note: 運営会社: 東日本旅客鉄道。路線名: 東北線。鉄道区分: 普通鉄道JR（11）。事業者種別: JR在来線（2）。

篠塚
type: Concept
alternative label: 篠塚（東武鉄道 小泉線）
broader: g002477
in scheme: scheme
notation: 002477
scope note: 運営会社: 東武鉄道。路線名: 小泉線。鉄道区分: 普通鉄道（12）。事業者種別: 民営鉄道（4）。

上州福島
type: Concept
alternative label: 上州福島（上信電鉄 上信線）
broader: g002478
in scheme: scheme
notation: 002478
scope note: 運営会社: 上信電鉄。路線名: 上信線。鉄道区分: 普通鉄道（12）。事業者種別: 民営鉄道（4）。

吉井
type: Concept
alternative label: 吉井（上信電鉄 上信線）
broader: g002479
in scheme: scheme
notation: 002479
scope note: 運営会社: 上信電鉄。路線名: 上信線。鉄道区分: 普通鉄道（12）。事業者種別: 民営鉄道（4）。

上州新屋
type: Concept
alternative label: 上州新屋（上信電鉄 上信線）
broader: g002480
in scheme: scheme
notation: 002480
scope note: 運営会社: 上信電鉄。路線名: 上信線。鉄道区分: 普通鉄道（12）。事業者種別: 民営鉄道（4）。

西吉井
type: Concept
alternative label: 西吉井（上信電鉄 上信線）
broader: g002481
in scheme: scheme
notation: 002481
scope note: 運営会社: 上信電鉄。路線名: 上信線。鉄道区分: 普通鉄道（12）。事業者種別: 民営鉄道（4）。

藤岡
type: Concept
alternative label: 藤岡（東武鉄道 日光線）
broader: g002482
in scheme: scheme
notation: 002482
scope note: 運営会社: 東武鉄道。路線名: 日光線。鉄道区分: 普通鉄道（12）。事業者種別: 民営鉄道（4）。

北中込
type: Concept
alternative label: 北中込（東日本旅客鉄道 小海線）
broader: g002483
in scheme: scheme
notation: 002483
scope note: 運営会社: 東日本旅客鉄道。路線名: 小海線。鉄道区分: 普通鉄道JR（11）。事業者種別: JR在来線（2）。

神保原
type: Concept
alternative label: 神保原（東日本旅客鉄道 高崎線）
broader: g002484
in scheme: scheme
notation: 002484
scope note: 運営会社: 東日本旅客鉄道。路線名: 高崎線。鉄道区分: 普通鉄道JR（11）。事業者種別: JR在来線（2）。

上州一ノ宮
type: Concept
alternative label: 上州一ノ宮（上信電鉄 上信線）
broader: g002485
in scheme: scheme
notation: 002485
scope note: 運営会社: 上信電鉄。路線名: 上信線。鉄道区分: 普通鉄道（12）。事業者種別: 民営鉄道（4）。

群馬藤岡
type: Concept
alternative label: 群馬藤岡（東日本旅客鉄道 八高線）
broader: g002486
in scheme: scheme
notation: 002486
scope note: 運営会社: 東日本旅客鉄道。路線名: 八高線。鉄道区分: 普通鉄道JR（11）。事業者種別: JR在来線（2）。

梓橋
type: Concept
alternative label: 梓橋（東日本旅客鉄道 大糸線）
broader: g002487
in scheme: scheme
notation: 002487
scope note: 運営会社: 東日本旅客鉄道。路線名: 大糸線。鉄道区分: 普通鉄道JR（11）。事業者種別: JR在来線（2）。

杉崎
type: Concept
alternative label: 杉崎（東海旅客鉄道 高山線）
broader: g002488
in scheme: scheme
notation: 002488
scope note: 運営会社: 東海旅客鉄道。路線名: 高山線。鉄道区分: 普通鉄道JR（11）。事業者種別: JR在来線（2）。

成島
type: Concept
alternative label: 成島（東武鉄道 小泉線）
broader: g002489
in scheme: scheme
notation: 002489
scope note: 運営会社: 東武鉄道。路線名: 小泉線。鉄道区分: 普通鉄道（12）。事業者種別: 民営鉄道（4）。

羽鳥
type: Concept
alternative label: 羽鳥（東日本旅客鉄道 常磐線）
broader: g002490
in scheme: scheme
notation: 002490
scope note: 運営会社: 東日本旅客鉄道。路線名: 常磐線。鉄道区分: 普通鉄道JR（11）。事業者種別: JR在来線（2）。

黒子
type: Concept
alternative label: 黒子（関東鉄道 常総線）
broader: g002491
in scheme: scheme
notation: 002491
scope note: 運営会社: 関東鉄道。路線名: 常総線。鉄道区分: 普通鉄道（12）。事業者種別: 民営鉄道（4）。

島内
type: Concept
alternative label: 島内（東日本旅客鉄道 大糸線）
broader: g002492
in scheme: scheme
notation: 002492
scope note: 運営会社: 東日本旅客鉄道。路線名: 大糸線。鉄道区分: 普通鉄道JR（11）。事業者種別: JR在来線（2）。

館林
type: Concept
alternative label: 館林（東武鉄道 伊勢崎線）
broader: g002493
in scheme: scheme
notation: 002493
scope note: 運営会社: 東武鉄道。路線名: 伊勢崎線。鉄道区分: 普通鉄道（12）。事業者種別: 民営鉄道（4）。

館林
type: Concept
alternative label: 館林（東武鉄道 佐野線）
broader: g002493
in scheme: scheme
notation: 002494
scope note: 運営会社: 東武鉄道。路線名: 佐野線。鉄道区分: 普通鉄道（12）。事業者種別: 民営鉄道（4）。

館林
type: Concept
alternative label: 館林（東武鉄道 小泉線）
broader: g002493
in scheme: scheme
notation: 002495
scope note: 運営会社: 東武鉄道。路線名: 小泉線。鉄道区分: 普通鉄道（12）。事業者種別: 民営鉄道（4）。

島高松
type: Concept
alternative label: 島高松（東日本旅客鉄道 大糸線）
broader: g002496
in scheme: scheme
notation: 002496
scope note: 運営会社: 東日本旅客鉄道。路線名: 大糸線。鉄道区分: 普通鉄道JR（11）。事業者種別: JR在来線（2）。

神農原
type: Concept
alternative label: 神農原（上信電鉄 上信線）
broader: g002497
in scheme: scheme
notation: 002497
scope note: 運営会社: 上信電鉄。路線名: 上信線。鉄道区分: 普通鉄道（12）。事業者種別: 民営鉄道（4）。

細呂木
type: Concept
alternative label: 細呂木（ハピラインふくい ハピラインふくい線）
broader: g002498
in scheme: scheme
notation: 002498
scope note: 運営会社: ハピラインふくい。路線名: ハピラインふくい線。鉄道区分: 普通鉄道（12）。事業者種別: 第三セクター（5）。

滑津
type: Concept
alternative label: 滑津（東日本旅客鉄道 小海線）
broader: g002499
in scheme: scheme
notation: 002499
scope note: 運営会社: 東日本旅客鉄道。路線名: 小海線。鉄道区分: 普通鉄道JR（11）。事業者種別: JR在来線（2）。

南蛇井
type: Concept
alternative label: 南蛇井（上信電鉄 上信線）
broader: g002500
in scheme: scheme
notation: 002500
scope note: 運営会社: 上信電鉄。路線名: 上信線。鉄道区分: 普通鉄道（12）。事業者種別: 民営鉄道（4）。

北松本
type: Concept
alternative label: 北松本（東日本旅客鉄道 大糸線）
broader: g002501
in scheme: scheme
notation: 002501
scope note: 運営会社: 東日本旅客鉄道。路線名: 大糸線。鉄道区分: 普通鉄道JR（11）。事業者種別: JR在来線（2）。

飛騨古川
type: Concept
alternative label: 飛騨古川（東海旅客鉄道 高山線）
broader: g002502
in scheme: scheme
notation: 002502
scope note: 運営会社: 東海旅客鉄道。路線名: 高山線。鉄道区分: 普通鉄道JR（11）。事業者種別: JR在来線（2）。

本庄
type: Concept
alternative label: 本庄（東日本旅客鉄道 高崎線）
broader: g002503
in scheme: scheme
notation: 002503
scope note: 運営会社: 東日本旅客鉄道。路線名: 高崎線。鉄道区分: 普通鉄道JR（11）。事業者種別: JR在来線（2）。

松本
type: Concept
alternative label: 松本（アルピコ交通 上高地線）
broader: g002506
in scheme: scheme
notation: 002504
scope note: 運営会社: アルピコ交通。路線名: 上高地線。鉄道区分: 普通鉄道（12）。事業者種別: 民営鉄道（4）。

中込
type: Concept
alternative label: 中込（東日本旅客鉄道 小海線）
broader: g002505
in scheme: scheme
notation: 002505
scope note: 運営会社: 東日本旅客鉄道。路線名: 小海線。鉄道区分: 普通鉄道JR（11）。事業者種別: JR在来線（2）。

松本
type: Concept
alternative label: 松本（東日本旅客鉄道 篠ノ井線）
broader: g002506
in scheme: scheme
notation: 002506
scope note: 運営会社: 東日本旅客鉄道。路線名: 篠ノ井線。鉄道区分: 普通鉄道JR（11）。事業者種別: JR在来線（2）。

松本
type: Concept
alternative label: 松本（東日本旅客鉄道 大糸線）
broader: g002506
in scheme: scheme
notation: 002507
scope note: 運営会社: 東日本旅客鉄道。路線名: 大糸線。鉄道区分: 普通鉄道JR（11）。事業者種別: JR在来線（2）。

千平
type: Concept
alternative label: 千平（上信電鉄 上信線）
broader: g002508
in scheme: scheme
notation: 002508
scope note: 運営会社: 上信電鉄。路線名: 上信線。鉄道区分: 普通鉄道（12）。事業者種別: 民営鉄道（4）。

野木
type: Concept
alternative label: 野木（東日本旅客鉄道 東北線）
broader: g002509
in scheme: scheme
notation: 002509
scope note: 運営会社: 東日本旅客鉄道。路線名: 東北線。鉄道区分: 普通鉄道JR（11）。事業者種別: JR在来線（2）。

信濃荒井
type: Concept
alternative label: 信濃荒井（アルピコ交通 上高地線）
broader: g002510
in scheme: scheme
notation: 002510
scope note: 運営会社: アルピコ交通。路線名: 上高地線。鉄道区分: 普通鉄道（12）。事業者種別: 民営鉄道（4）。

渚
type: Concept
alternative label: 渚（アルピコ交通 上高地線）
broader: g002511
in scheme: scheme
notation: 002511
scope note: 運営会社: アルピコ交通。路線名: 上高地線。鉄道区分: 普通鉄道（12）。事業者種別: 民営鉄道（4）。

西松本
type: Concept
alternative label: 西松本（アルピコ交通 上高地線）
broader: g002512
in scheme: scheme
notation: 002512
scope note: 運営会社: アルピコ交通。路線名: 上高地線。鉄道区分: 普通鉄道（12）。事業者種別: 民営鉄道（4）。

大庭
type: Concept
alternative label: 大庭（アルピコ交通 上高地線）
broader: g002513
in scheme: scheme
notation: 002513
scope note: 運営会社: アルピコ交通。路線名: 上高地線。鉄道区分: 普通鉄道（12）。事業者種別: 民営鉄道（4）。

茂林寺前
type: Concept
alternative label: 茂林寺前（東武鉄道 伊勢崎線）
broader: g002514
in scheme: scheme
notation: 002514
scope note: 運営会社: 東武鉄道。路線名: 伊勢崎線。鉄道区分: 普通鉄道（12）。事業者種別: 民営鉄道（4）。

筑波山頂
type: Concept
alternative label: 筑波山頂（筑波観光鉄道 筑波山鋼索鉄道線）
broader: g002515
in scheme: scheme
notation: 002515
scope note: 運営会社: 筑波観光鉄道。路線名: 筑波山鋼索鉄道線。鉄道区分: 鋼索鉄道（13）。事業者種別: 民営鉄道（4）。

下新
type: Concept
alternative label: 下新（アルピコ交通 上高地線）
broader: g002516
in scheme: scheme
notation: 002516
scope note: 運営会社: アルピコ交通。路線名: 上高地線。鉄道区分: 普通鉄道（12）。事業者種別: 民営鉄道（4）。

鹿島旭
type: Concept
alternative label: 鹿島旭（鹿島臨海鉄道 大洗鹿島線）
broader: g002517
in scheme: scheme
notation: 002517
scope note: 運営会社: 鹿島臨海鉄道。路線名: 大洗鹿島線。鉄道区分: 普通鉄道（12）。事業者種別: 第三セクター（5）。

騰波ノ江
type: Concept
alternative label: 騰波ノ江（関東鉄道 常総線）
broader: g002518
in scheme: scheme
notation: 002518
scope note: 運営会社: 関東鉄道。路線名: 常総線。鉄道区分: 普通鉄道（12）。事業者種別: 民営鉄道（4）。

あわら湯のまち
type: Concept
alternative label: あわら湯のまち（えちぜん鉄道 三国芦原線）
broader: g002519
in scheme: scheme
notation: 002519
scope note: 運営会社: えちぜん鉄道。路線名: 三国芦原線。鉄道区分: 普通鉄道（12）。事業者種別: 第三セクター（5）。

板倉東洋大前
type: Concept
alternative label: 板倉東洋大前（東武鉄道 日光線）
broader: g002520
in scheme: scheme
notation: 002520
scope note: 運営会社: 東武鉄道。路線名: 日光線。鉄道区分: 普通鉄道（12）。事業者種別: 民営鉄道（4）。

太田部
type: Concept
alternative label: 太田部（東日本旅客鉄道 小海線）
broader: g002521
in scheme: scheme
notation: 002521
scope note: 運営会社: 東日本旅客鉄道。路線名: 小海線。鉄道区分: 普通鉄道JR（11）。事業者種別: JR在来線（2）。

三国港
type: Concept
alternative label: 三国港（えちぜん鉄道 三国芦原線）
broader: g002522
in scheme: scheme
notation: 002522
scope note: 運営会社: えちぜん鉄道。路線名: 三国芦原線。鉄道区分: 普通鉄道（12）。事業者種別: 第三セクター（5）。

北新・松本大学前
type: Concept
alternative label: 北新・松本大学前（アルピコ交通 上高地線）
broader: g002523
in scheme: scheme
notation: 002523
scope note: 運営会社: アルピコ交通。路線名: 上高地線。鉄道区分: 普通鉄道（12）。事業者種別: 民営鉄道（4）。

水居
type: Concept
alternative label: 水居（えちぜん鉄道 三国芦原線）
broader: g002524
in scheme: scheme
notation: 002524
scope note: 運営会社: えちぜん鉄道。路線名: 三国芦原線。鉄道区分: 普通鉄道（12）。事業者種別: 第三セクター（5）。

本庄早稲田
type: Concept
alternative label: 本庄早稲田（東日本旅客鉄道 上越新幹線）
broader: g002525
in scheme: scheme
notation: 002525
scope note: 運営会社: 東日本旅客鉄道。路線名: 上越新幹線。鉄道区分: 普通鉄道JR（11）。事業者種別: JRの新幹線（1）。

三国
type: Concept
alternative label: 三国（えちぜん鉄道 三国芦原線）
broader: g002526
in scheme: scheme
notation: 002526
scope note: 運営会社: えちぜん鉄道。路線名: 三国芦原線。鉄道区分: 普通鉄道（12）。事業者種別: 第三セクター（5）。

丹荘
type: Concept
alternative label: 丹荘（東日本旅客鉄道 八高線）
broader: g002527
in scheme: scheme
notation: 002527
scope note: 運営会社: 東日本旅客鉄道。路線名: 八高線。鉄道区分: 普通鉄道JR（11）。事業者種別: JR在来線（2）。

新村
type: Concept
alternative label: 新村（アルピコ交通 上高地線）
broader: g002528
in scheme: scheme
notation: 002528
scope note: 運営会社: アルピコ交通。路線名: 上高地線。鉄道区分: 普通鉄道（12）。事業者種別: 民営鉄道（4）。

芦原温泉
type: Concept
alternative label: 芦原温泉（ハピラインふくい ハピラインふくい線）
broader: g002529
in scheme: scheme
notation: 002529
scope note: 運営会社: ハピラインふくい。路線名: ハピラインふくい線。鉄道区分: 普通鉄道（12）。事業者種別: 第三セクター（5）。

三国神社
type: Concept
alternative label: 三国神社（えちぜん鉄道 三国芦原線）
broader: g002530
in scheme: scheme
notation: 002530
scope note: 運営会社: えちぜん鉄道。路線名: 三国芦原線。鉄道区分: 普通鉄道（12）。事業者種別: 第三セクター（5）。

宮脇
type: Concept
alternative label: 宮脇（筑波観光鉄道 筑波山鋼索鉄道線）
broader: g002531
in scheme: scheme
notation: 002531
scope note: 運営会社: 筑波観光鉄道。路線名: 筑波山鋼索鉄道線。鉄道区分: 鋼索鉄道（13）。事業者種別: 民営鉄道（4）。

三溝
type: Concept
alternative label: 三溝（アルピコ交通 上高地線）
broader: g002532
in scheme: scheme
notation: 002532
scope note: 運営会社: アルピコ交通。路線名: 上高地線。鉄道区分: 普通鉄道（12）。事業者種別: 民営鉄道（4）。

番田
type: Concept
alternative label: 番田（えちぜん鉄道 三国芦原線）
broader: g002533
in scheme: scheme
notation: 002533
scope note: 運営会社: えちぜん鉄道。路線名: 三国芦原線。鉄道区分: 普通鉄道（12）。事業者種別: 第三セクター（5）。

飛騨国府
type: Concept
alternative label: 飛騨国府（東海旅客鉄道 高山線）
broader: g002534
in scheme: scheme
notation: 002534
scope note: 運営会社: 東海旅客鉄道。路線名: 高山線。鉄道区分: 普通鉄道JR（11）。事業者種別: JR在来線（2）。

南松本
type: Concept
alternative label: 南松本（東日本旅客鉄道 篠ノ井線）
broader: g002535
in scheme: scheme
notation: 002535
scope note: 運営会社: 東日本旅客鉄道。路線名: 篠ノ井線。鉄道区分: 普通鉄道JR（11）。事業者種別: JR在来線（2）。

下仁田
type: Concept
alternative label: 下仁田（上信電鉄 上信線）
broader: g002536
in scheme: scheme
notation: 002536
scope note: 運営会社: 上信電鉄。路線名: 上信線。鉄道区分: 普通鉄道（12）。事業者種別: 民営鉄道（4）。

川俣
type: Concept
alternative label: 川俣（東武鉄道 伊勢崎線）
broader: g002537
in scheme: scheme
notation: 002537
scope note: 運営会社: 東武鉄道。路線名: 伊勢崎線。鉄道区分: 普通鉄道（12）。事業者種別: 民営鉄道（4）。

森口
type: Concept
alternative label: 森口（アルピコ交通 上高地線）
broader: g002538
in scheme: scheme
notation: 002538
scope note: 運営会社: アルピコ交通。路線名: 上高地線。鉄道区分: 普通鉄道（12）。事業者種別: 民営鉄道（4）。

柳生
type: Concept
alternative label: 柳生（東武鉄道 日光線）
broader: g002539
in scheme: scheme
notation: 002539
scope note: 運営会社: 東武鉄道。路線名: 日光線。鉄道区分: 普通鉄道（12）。事業者種別: 民営鉄道（4）。

下島
type: Concept
alternative label: 下島（アルピコ交通 上高地線）
broader: g002540
in scheme: scheme
notation: 002540
scope note: 運営会社: アルピコ交通。路線名: 上高地線。鉄道区分: 普通鉄道（12）。事業者種別: 民営鉄道（4）。

岡部
type: Concept
alternative label: 岡部（東日本旅客鉄道 高崎線）
broader: g002541
in scheme: scheme
notation: 002541
scope note: 運営会社: 東日本旅客鉄道。路線名: 高崎線。鉄道区分: 普通鉄道JR（11）。事業者種別: JR在来線（2）。

本荘
type: Concept
alternative label: 本荘（えちぜん鉄道 三国芦原線）
broader: g002542
in scheme: scheme
notation: 002542
scope note: 運営会社: えちぜん鉄道。路線名: 三国芦原線。鉄道区分: 普通鉄道（12）。事業者種別: 第三セクター（5）。

龍岡城
type: Concept
alternative label: 龍岡城（東日本旅客鉄道 小海線）
broader: g002543
in scheme: scheme
notation: 002543
scope note: 運営会社: 東日本旅客鉄道。路線名: 小海線。鉄道区分: 普通鉄道JR（11）。事業者種別: JR在来線（2）。

大宝
type: Concept
alternative label: 大宝（関東鉄道 常総線）
broader: g002544
in scheme: scheme
notation: 002544
scope note: 運営会社: 関東鉄道。路線名: 常総線。鉄道区分: 普通鉄道（12）。事業者種別: 民営鉄道（4）。

波田
type: Concept
alternative label: 波田（アルピコ交通 上高地線）
broader: g002545
in scheme: scheme
notation: 002545
scope note: 運営会社: アルピコ交通。路線名: 上高地線。鉄道区分: 普通鉄道（12）。事業者種別: 民営鉄道（4）。

渕東
type: Concept
alternative label: 渕東（アルピコ交通 上高地線）
broader: g002546
in scheme: scheme
notation: 002546
scope note: 運営会社: アルピコ交通。路線名: 上高地線。鉄道区分: 普通鉄道（12）。事業者種別: 民営鉄道（4）。

古河
type: Concept
alternative label: 古河（東日本旅客鉄道 東北線）
broader: g002547
in scheme: scheme
notation: 002547
scope note: 運営会社: 東日本旅客鉄道。路線名: 東北線。鉄道区分: 普通鉄道JR（11）。事業者種別: JR在来線（2）。

臼田
type: Concept
alternative label: 臼田（東日本旅客鉄道 小海線）
broader: g002548
in scheme: scheme
notation: 002548
scope note: 運営会社: 東日本旅客鉄道。路線名: 小海線。鉄道区分: 普通鉄道JR（11）。事業者種別: JR在来線（2）。

児玉
type: Concept
alternative label: 児玉（東日本旅客鉄道 八高線）
broader: g002549
in scheme: scheme
notation: 002549
scope note: 運営会社: 東日本旅客鉄道。路線名: 八高線。鉄道区分: 普通鉄道JR（11）。事業者種別: JR在来線（2）。

新古河
type: Concept
alternative label: 新古河（東武鉄道 日光線）
broader: g002550
in scheme: scheme
notation: 002550
scope note: 運営会社: 東武鉄道。路線名: 日光線。鉄道区分: 普通鉄道（12）。事業者種別: 民営鉄道（4）。

平田
type: Concept
alternative label: 平田（東日本旅客鉄道 篠ノ井線）
broader: g002551
in scheme: scheme
notation: 002551
scope note: 運営会社: 東日本旅客鉄道。路線名: 篠ノ井線。鉄道区分: 普通鉄道JR（11）。事業者種別: JR在来線（2）。

石岡
type: Concept
alternative label: 石岡（東日本旅客鉄道 常磐線）
broader: g002552
in scheme: scheme
notation: 002552
scope note: 運営会社: 東日本旅客鉄道。路線名: 常磐線。鉄道区分: 普通鉄道JR（11）。事業者種別: JR在来線（2）。

深谷
type: Concept
alternative label: 深谷（東日本旅客鉄道 高崎線）
broader: g002553
in scheme: scheme
notation: 002553
scope note: 運営会社: 東日本旅客鉄道。路線名: 高崎線。鉄道区分: 普通鉄道JR（11）。事業者種別: JR在来線（2）。

徳宿
type: Concept
alternative label: 徳宿（鹿島臨海鉄道 大洗鹿島線）
broader: g002554
in scheme: scheme
notation: 002554
scope note: 運営会社: 鹿島臨海鉄道。路線名: 大洗鹿島線。鉄道区分: 普通鉄道（12）。事業者種別: 第三セクター（5）。

新島々
type: Concept
alternative label: 新島々（アルピコ交通 上高地線）
broader: g002555
in scheme: scheme
notation: 002555
scope note: 運営会社: アルピコ交通。路線名: 上高地線。鉄道区分: 普通鉄道（12）。事業者種別: 民営鉄道（4）。

大関
type: Concept
alternative label: 大関（えちぜん鉄道 三国芦原線）
broader: g002556
in scheme: scheme
notation: 002556
scope note: 運営会社: えちぜん鉄道。路線名: 三国芦原線。鉄道区分: 普通鉄道（12）。事業者種別: 第三セクター（5）。

下妻
type: Concept
alternative label: 下妻（関東鉄道 常総線）
broader: g002557
in scheme: scheme
notation: 002557
scope note: 運営会社: 関東鉄道。路線名: 常総線。鉄道区分: 普通鉄道（12）。事業者種別: 民営鉄道（4）。

青沼
type: Concept
alternative label: 青沼（東日本旅客鉄道 小海線）
broader: g002558
in scheme: scheme
notation: 002558
scope note: 運営会社: 東日本旅客鉄道。路線名: 小海線。鉄道区分: 普通鉄道JR（11）。事業者種別: JR在来線（2）。

上枝
type: Concept
alternative label: 上枝（東海旅客鉄道 高山線）
broader: g002559
in scheme: scheme
notation: 002559
scope note: 運営会社: 東海旅客鉄道。路線名: 高山線。鉄道区分: 普通鉄道JR（11）。事業者種別: JR在来線（2）。

西羽生
type: Concept
alternative label: 西羽生（秩父鉄道 秩父本線）
broader: g002560
in scheme: scheme
notation: 002560
scope note: 運営会社: 秩父鉄道。路線名: 秩父本線。鉄道区分: 普通鉄道（12）。事業者種別: 民営鉄道（4）。

籠原
type: Concept
alternative label: 籠原（東日本旅客鉄道 高崎線）
broader: g002561
in scheme: scheme
notation: 002561
scope note: 運営会社: 東日本旅客鉄道。路線名: 高崎線。鉄道区分: 普通鉄道JR（11）。事業者種別: JR在来線（2）。

村井
type: Concept
alternative label: 村井（東日本旅客鉄道 篠ノ井線）
broader: g002562
in scheme: scheme
notation: 002562
scope note: 運営会社: 東日本旅客鉄道。路線名: 篠ノ井線。鉄道区分: 普通鉄道JR（11）。事業者種別: JR在来線（2）。

松久
type: Concept
alternative label: 松久（東日本旅客鉄道 八高線）
broader: g002563
in scheme: scheme
notation: 002563
scope note: 運営会社: 東日本旅客鉄道。路線名: 八高線。鉄道区分: 普通鉄道JR（11）。事業者種別: JR在来線（2）。

新郷
type: Concept
alternative label: 新郷（秩父鉄道 秩父本線）
broader: g002564
in scheme: scheme
notation: 002564
scope note: 運営会社: 秩父鉄道。路線名: 秩父本線。鉄道区分: 普通鉄道（12）。事業者種別: 民営鉄道（4）。

羽生
type: Concept
alternative label: 羽生（秩父鉄道 秩父本線）
broader: g002565
in scheme: scheme
notation: 002565
scope note: 運営会社: 秩父鉄道。路線名: 秩父本線。鉄道区分: 普通鉄道（12）。事業者種別: 民営鉄道（4）。

羽生
type: Concept
alternative label: 羽生（東武鉄道 伊勢崎線）
broader: g002565
in scheme: scheme
notation: 002566
scope note: 運営会社: 東武鉄道。路線名: 伊勢崎線。鉄道区分: 普通鉄道（12）。事業者種別: 民営鉄道（4）。

下兵庫こうふく
type: Concept
alternative label: 下兵庫こうふく（えちぜん鉄道 三国芦原線）
broader: g002567
in scheme: scheme
notation: 002567
scope note: 運営会社: えちぜん鉄道。路線名: 三国芦原線。鉄道区分: 普通鉄道（12）。事業者種別: 第三セクター（5）。

羽黒下
type: Concept
alternative label: 羽黒下（東日本旅客鉄道 小海線）
broader: g002568
in scheme: scheme
notation: 002568
scope note: 運営会社: 東日本旅客鉄道。路線名: 小海線。鉄道区分: 普通鉄道JR（11）。事業者種別: JR在来線（2）。

高浜
type: Concept
alternative label: 高浜（東日本旅客鉄道 常磐線）
broader: g002569
in scheme: scheme
notation: 002569
scope note: 運営会社: 東日本旅客鉄道。路線名: 常磐線。鉄道区分: 普通鉄道JR（11）。事業者種別: JR在来線（2）。

丸岡
type: Concept
alternative label: 丸岡（ハピラインふくい ハピラインふくい線）
broader: g002570
in scheme: scheme
notation: 002570
scope note: 運営会社: ハピラインふくい。路線名: ハピラインふくい線。鉄道区分: 普通鉄道（12）。事業者種別: 第三セクター（5）。

武州荒木
type: Concept
alternative label: 武州荒木（秩父鉄道 秩父本線）
broader: g002571
in scheme: scheme
notation: 002571
scope note: 運営会社: 秩父鉄道。路線名: 秩父本線。鉄道区分: 普通鉄道（12）。事業者種別: 民営鉄道（4）。

海瀬
type: Concept
alternative label: 海瀬（東日本旅客鉄道 小海線）
broader: g002572
in scheme: scheme
notation: 002572
scope note: 運営会社: 東日本旅客鉄道。路線名: 小海線。鉄道区分: 普通鉄道JR（11）。事業者種別: JR在来線（2）。

用土
type: Concept
alternative label: 用土（東日本旅客鉄道 八高線）
broader: g002573
in scheme: scheme
notation: 002573
scope note: 運営会社: 東日本旅客鉄道。路線名: 八高線。鉄道区分: 普通鉄道JR（11）。事業者種別: JR在来線（2）。

宗道
type: Concept
alternative label: 宗道（関東鉄道 常総線）
broader: g002574
in scheme: scheme
notation: 002574
scope note: 運営会社: 関東鉄道。路線名: 常総線。鉄道区分: 普通鉄道（12）。事業者種別: 民営鉄道（4）。

西長田ゆりの里
type: Concept
alternative label: 西長田ゆりの里（えちぜん鉄道 三国芦原線）
broader: g002575
in scheme: scheme
notation: 002575
scope note: 運営会社: えちぜん鉄道。路線名: 三国芦原線。鉄道区分: 普通鉄道（12）。事業者種別: 第三セクター（5）。

新鉾田
type: Concept
alternative label: 新鉾田（鹿島臨海鉄道 大洗鹿島線）
broader: g002576
in scheme: scheme
notation: 002576
scope note: 運営会社: 鹿島臨海鉄道。路線名: 大洗鹿島線。鉄道区分: 普通鉄道（12）。事業者種別: 第三セクター（5）。

南羽生
type: Concept
alternative label: 南羽生（東武鉄道 伊勢崎線）
broader: g002577
in scheme: scheme
notation: 002577
scope note: 運営会社: 東武鉄道。路線名: 伊勢崎線。鉄道区分: 普通鉄道（12）。事業者種別: 民営鉄道（4）。

広丘
type: Concept
alternative label: 広丘（東日本旅客鉄道 篠ノ井線）
broader: g002578
in scheme: scheme
notation: 002578
scope note: 運営会社: 東日本旅客鉄道。路線名: 篠ノ井線。鉄道区分: 普通鉄道JR（11）。事業者種別: JR在来線（2）。

石原
type: Concept
alternative label: 石原（秩父鉄道 秩父本線）
broader: g002579
in scheme: scheme
notation: 002579
scope note: 運営会社: 秩父鉄道。路線名: 秩父本線。鉄道区分: 普通鉄道（12）。事業者種別: 民営鉄道（4）。

東行田
type: Concept
alternative label: 東行田（秩父鉄道 秩父本線）
broader: g002580
in scheme: scheme
notation: 002580
scope note: 運営会社: 秩父鉄道。路線名: 秩父本線。鉄道区分: 普通鉄道（12）。事業者種別: 民営鉄道（4）。

ひろせ野鳥の森
type: Concept
alternative label: ひろせ野鳥の森（秩父鉄道 秩父本線）
broader: g002581
in scheme: scheme
notation: 002581
scope note: 運営会社: 秩父鉄道。路線名: 秩父本線。鉄道区分: 普通鉄道（12）。事業者種別: 民営鉄道（4）。

大麻生
type: Concept
alternative label: 大麻生（秩父鉄道 秩父本線）
broader: g002582
in scheme: scheme
notation: 002582
scope note: 運営会社: 秩父鉄道。路線名: 秩父本線。鉄道区分: 普通鉄道（12）。事業者種別: 民営鉄道（4）。

行田市
type: Concept
alternative label: 行田市（秩父鉄道 秩父本線）
broader: g002583
in scheme: scheme
notation: 002583
scope note: 運営会社: 秩父鉄道。路線名: 秩父本線。鉄道区分: 普通鉄道（12）。事業者種別: 民営鉄道（4）。

上熊谷
type: Concept
alternative label: 上熊谷（秩父鉄道 秩父本線）
broader: g002584
in scheme: scheme
notation: 002584
scope note: 運営会社: 秩父鉄道。路線名: 秩父本線。鉄道区分: 普通鉄道（12）。事業者種別: 民営鉄道（4）。

明戸
type: Concept
alternative label: 明戸（秩父鉄道 秩父本線）
broader: g002585
in scheme: scheme
notation: 002585
scope note: 運営会社: 秩父鉄道。路線名: 秩父本線。鉄道区分: 普通鉄道（12）。事業者種別: 民営鉄道（4）。

武川
type: Concept
alternative label: 武川（秩父鉄道 秩父本線）
broader: g002586
in scheme: scheme
notation: 002586
scope note: 運営会社: 秩父鉄道。路線名: 秩父本線。鉄道区分: 普通鉄道（12）。事業者種別: 民営鉄道（4）。

高山
type: Concept
alternative label: 高山（東海旅客鉄道 高山線）
broader: g002587
in scheme: scheme
notation: 002587
scope note: 運営会社: 東海旅客鉄道。路線名: 高山線。鉄道区分: 普通鉄道JR（11）。事業者種別: JR在来線（2）。

熊谷
type: Concept
alternative label: 熊谷（東日本旅客鉄道 高崎線）
broader: g002589
in scheme: scheme
notation: 002588
scope note: 運営会社: 東日本旅客鉄道。路線名: 高崎線。鉄道区分: 普通鉄道JR（11）。事業者種別: JR在来線（2）。

熊谷
type: Concept
alternative label: 熊谷（東日本旅客鉄道 上越新幹線）
broader: g002589
in scheme: scheme
notation: 002589
scope note: 運営会社: 東日本旅客鉄道。路線名: 上越新幹線。鉄道区分: 普通鉄道JR（11）。事業者種別: JRの新幹線（1）。

熊谷
type: Concept
alternative label: 熊谷（秩父鉄道 秩父本線）
broader: g002589
in scheme: scheme
notation: 002590
scope note: 運営会社: 秩父鉄道。路線名: 秩父本線。鉄道区分: 普通鉄道（12）。事業者種別: 民営鉄道（4）。

西春江ハートピア
type: Concept
alternative label: 西春江ハートピア（えちぜん鉄道 三国芦原線）
broader: g002591
in scheme: scheme
notation: 002591
scope note: 運営会社: えちぜん鉄道。路線名: 三国芦原線。鉄道区分: 普通鉄道（12）。事業者種別: 第三セクター（5）。

栗橋
type: Concept
alternative label: 栗橋（東武鉄道 日光線）
broader: g002592
in scheme: scheme
notation: 002592
scope note: 運営会社: 東武鉄道。路線名: 日光線。鉄道区分: 普通鉄道（12）。事業者種別: 民営鉄道（4）。

持田
type: Concept
alternative label: 持田（秩父鉄道 秩父本線）
broader: g002593
in scheme: scheme
notation: 002593
scope note: 運営会社: 秩父鉄道。路線名: 秩父本線。鉄道区分: 普通鉄道（12）。事業者種別: 民営鉄道（4）。

ソシオ流通センター
type: Concept
alternative label: ソシオ流通センター（秩父鉄道 秩父本線）
broader: g002594
in scheme: scheme
notation: 002594
scope note: 運営会社: 秩父鉄道。路線名: 秩父本線。鉄道区分: 普通鉄道（12）。事業者種別: 民営鉄道（4）。

栗橋
type: Concept
alternative label: 栗橋（東日本旅客鉄道 東北線）
broader: g002592
in scheme: scheme
notation: 002595
scope note: 運営会社: 東日本旅客鉄道。路線名: 東北線。鉄道区分: 普通鉄道JR（11）。事業者種別: JR在来線（2）。

玉村
type: Concept
alternative label: 玉村（関東鉄道 常総線）
broader: g002596
in scheme: scheme
notation: 002596
scope note: 運営会社: 関東鉄道。路線名: 常総線。鉄道区分: 普通鉄道（12）。事業者種別: 民営鉄道（4）。

永田
type: Concept
alternative label: 永田（秩父鉄道 秩父本線）
broader: g002597
in scheme: scheme
notation: 002597
scope note: 運営会社: 秩父鉄道。路線名: 秩父本線。鉄道区分: 普通鉄道（12）。事業者種別: 民営鉄道（4）。

八千穂
type: Concept
alternative label: 八千穂（東日本旅客鉄道 小海線）
broader: g002598
in scheme: scheme
notation: 002598
scope note: 運営会社: 東日本旅客鉄道。路線名: 小海線。鉄道区分: 普通鉄道JR（11）。事業者種別: JR在来線（2）。

太郎丸エンゼルランド
type: Concept
alternative label: 太郎丸エンゼルランド（えちぜん鉄道 三国芦原線）
broader: g002599
in scheme: scheme
notation: 002599
scope note: 運営会社: えちぜん鉄道。路線名: 三国芦原線。鉄道区分: 普通鉄道（12）。事業者種別: 第三セクター（5）。

樋口
type: Concept
alternative label: 樋口（秩父鉄道 秩父本線）
broader: g002600
in scheme: scheme
notation: 002600
scope note: 運営会社: 秩父鉄道。路線名: 秩父本線。鉄道区分: 普通鉄道（12）。事業者種別: 民営鉄道（4）。

ふかや花園
type: Concept
alternative label: ふかや花園（秩父鉄道 秩父本線）
broader: g002601
in scheme: scheme
notation: 002601
scope note: 運営会社: 秩父鉄道。路線名: 秩父本線。鉄道区分: 普通鉄道（12）。事業者種別: 民営鉄道（4）。

春江
type: Concept
alternative label: 春江（ハピラインふくい ハピラインふくい線）
broader: g002602
in scheme: scheme
notation: 002602
scope note: 運営会社: ハピラインふくい。路線名: ハピラインふくい線。鉄道区分: 普通鉄道（12）。事業者種別: 第三セクター（5）。

小前田
type: Concept
alternative label: 小前田（秩父鉄道 秩父本線）
broader: g002603
in scheme: scheme
notation: 002603
scope note: 運営会社: 秩父鉄道。路線名: 秩父本線。鉄道区分: 普通鉄道（12）。事業者種別: 民営鉄道（4）。

桜沢
type: Concept
alternative label: 桜沢（秩父鉄道 秩父本線）
broader: g002604
in scheme: scheme
notation: 002604
scope note: 運営会社: 秩父鉄道。路線名: 秩父本線。鉄道区分: 普通鉄道（12）。事業者種別: 民営鉄道（4）。

波久礼
type: Concept
alternative label: 波久礼（秩父鉄道 秩父本線）
broader: g002605
in scheme: scheme
notation: 002605
scope note: 運営会社: 秩父鉄道。路線名: 秩父本線。鉄道区分: 普通鉄道（12）。事業者種別: 民営鉄道（4）。

加須
type: Concept
alternative label: 加須（東武鉄道 伊勢崎線）
broader: g002606
in scheme: scheme
notation: 002606
scope note: 運営会社: 東武鉄道。路線名: 伊勢崎線。鉄道区分: 普通鉄道（12）。事業者種別: 民営鉄道（4）。

北浦湖畔
type: Concept
alternative label: 北浦湖畔（鹿島臨海鉄道 大洗鹿島線）
broader: g002607
in scheme: scheme
notation: 002607
scope note: 運営会社: 鹿島臨海鉄道。路線名: 大洗鹿島線。鉄道区分: 普通鉄道（12）。事業者種別: 第三セクター（5）。

神立
type: Concept
alternative label: 神立（東日本旅客鉄道 常磐線）
broader: g002608
in scheme: scheme
notation: 002608
scope note: 運営会社: 東日本旅客鉄道。路線名: 常磐線。鉄道区分: 普通鉄道JR（11）。事業者種別: JR在来線（2）。

鷲塚針原
type: Concept
alternative label: 鷲塚針原（えちぜん鉄道 三国芦原線）
broader: g002609
in scheme: scheme
notation: 002609
scope note: 運営会社: えちぜん鉄道。路線名: 三国芦原線。鉄道区分: 普通鉄道（12）。事業者種別: 第三セクター（5）。

寄居
type: Concept
alternative label: 寄居（東日本旅客鉄道 八高線）
broader: g002611
in scheme: scheme
notation: 002610
scope note: 運営会社: 東日本旅客鉄道。路線名: 八高線。鉄道区分: 普通鉄道JR（11）。事業者種別: JR在来線（2）。

寄居
type: Concept
alternative label: 寄居（秩父鉄道 秩父本線）
broader: g002611
in scheme: scheme
notation: 002611
scope note: 運営会社: 秩父鉄道。路線名: 秩父本線。鉄道区分: 普通鉄道（12）。事業者種別: 民営鉄道（4）。

寄居
type: Concept
alternative label: 寄居（東武鉄道 東上本線）
broader: g002611
in scheme: scheme
notation: 002612
scope note: 運営会社: 東武鉄道。路線名: 東上本線。鉄道区分: 普通鉄道（12）。事業者種別: 民営鉄道（4）。

石下
type: Concept
alternative label: 石下（関東鉄道 常総線）
broader: g002613
in scheme: scheme
notation: 002613
scope note: 運営会社: 関東鉄道。路線名: 常総線。鉄道区分: 普通鉄道（12）。事業者種別: 民営鉄道（4）。

玉淀
type: Concept
alternative label: 玉淀（東武鉄道 東上本線）
broader: g002614
in scheme: scheme
notation: 002614
scope note: 運営会社: 東武鉄道。路線名: 東上本線。鉄道区分: 普通鉄道（12）。事業者種別: 民営鉄道（4）。

高岩
type: Concept
alternative label: 高岩（東日本旅客鉄道 小海線）
broader: g002615
in scheme: scheme
notation: 002615
scope note: 運営会社: 東日本旅客鉄道。路線名: 小海線。鉄道区分: 普通鉄道JR（11）。事業者種別: JR在来線（2）。

塩尻
type: Concept
alternative label: 塩尻（東日本旅客鉄道 篠ノ井線）
broader: g002616
in scheme: scheme
notation: 002616
scope note: 運営会社: 東日本旅客鉄道。路線名: 篠ノ井線。鉄道区分: 普通鉄道JR（11）。事業者種別: JR在来線（2）。

塩尻
type: Concept
alternative label: 塩尻（東海旅客鉄道 中央線）
broader: g002616
in scheme: scheme
notation: 002617
scope note: 運営会社: 東海旅客鉄道。路線名: 中央線。鉄道区分: 普通鉄道JR（11）。事業者種別: JR在来線（2）。

塩尻
type: Concept
alternative label: 塩尻（東日本旅客鉄道 中央線）
broader: g002616
in scheme: scheme
notation: 002618
scope note: 運営会社: 東日本旅客鉄道。路線名: 中央線。鉄道区分: 普通鉄道JR（11）。事業者種別: JR在来線（2）。

行田
type: Concept
alternative label: 行田（東日本旅客鉄道 高崎線）
broader: g002619
in scheme: scheme
notation: 002619
scope note: 運営会社: 東日本旅客鉄道。路線名: 高崎線。鉄道区分: 普通鉄道JR（11）。事業者種別: JR在来線（2）。

鉢形
type: Concept
alternative label: 鉢形（東武鉄道 東上本線）
broader: g002620
in scheme: scheme
notation: 002620
scope note: 運営会社: 東武鉄道。路線名: 東上本線。鉄道区分: 普通鉄道（12）。事業者種別: 民営鉄道（4）。

南栗橋
type: Concept
alternative label: 南栗橋（東武鉄道 日光線）
broader: g002621
in scheme: scheme
notation: 002621
scope note: 運営会社: 東武鉄道。路線名: 日光線。鉄道区分: 普通鉄道（12）。事業者種別: 民営鉄道（4）。

野上
type: Concept
alternative label: 野上（秩父鉄道 秩父本線）
broader: g002622
in scheme: scheme
notation: 002622
scope note: 運営会社: 秩父鉄道。路線名: 秩父本線。鉄道区分: 普通鉄道（12）。事業者種別: 民営鉄道（4）。

花崎
type: Concept
alternative label: 花崎（東武鉄道 伊勢崎線）
broader: g002623
in scheme: scheme
notation: 002623
scope note: 運営会社: 東武鉄道。路線名: 伊勢崎線。鉄道区分: 普通鉄道（12）。事業者種別: 民営鉄道（4）。

森田
type: Concept
alternative label: 森田（ハピラインふくい ハピラインふくい線）
broader: g002624
in scheme: scheme
notation: 002624
scope note: 運営会社: ハピラインふくい。路線名: ハピラインふくい線。鉄道区分: 普通鉄道（12）。事業者種別: 第三セクター（5）。

大洋
type: Concept
alternative label: 大洋（鹿島臨海鉄道 大洗鹿島線）
broader: g002625
in scheme: scheme
notation: 002625
scope note: 運営会社: 鹿島臨海鉄道。路線名: 大洗鹿島線。鉄道区分: 普通鉄道（12）。事業者種別: 第三セクター（5）。

男衾
type: Concept
alternative label: 男衾（東武鉄道 東上本線）
broader: g002626
in scheme: scheme
notation: 002626
scope note: 運営会社: 東武鉄道。路線名: 東上本線。鉄道区分: 普通鉄道（12）。事業者種別: 民営鉄道（4）。

吹上
type: Concept
alternative label: 吹上（東日本旅客鉄道 高崎線）
broader: g002627
in scheme: scheme
notation: 002627
scope note: 運営会社: 東日本旅客鉄道。路線名: 高崎線。鉄道区分: 普通鉄道JR（11）。事業者種別: JR在来線（2）。

南石下
type: Concept
alternative label: 南石下（関東鉄道 常総線）
broader: g002628
in scheme: scheme
notation: 002628
scope note: 運営会社: 関東鉄道。路線名: 常総線。鉄道区分: 普通鉄道（12）。事業者種別: 民営鉄道（4）。

馬流
type: Concept
alternative label: 馬流（東日本旅客鉄道 小海線）
broader: g002629
in scheme: scheme
notation: 002629
scope note: 運営会社: 東日本旅客鉄道。路線名: 小海線。鉄道区分: 普通鉄道JR（11）。事業者種別: JR在来線（2）。

中角
type: Concept
alternative label: 中角（えちぜん鉄道 三国芦原線）
broader: g002630
in scheme: scheme
notation: 002630
scope note: 運営会社: えちぜん鉄道。路線名: 三国芦原線。鉄道区分: 普通鉄道（12）。事業者種別: 第三セクター（5）。

志比堺
type: Concept
alternative label: 志比堺（えちぜん鉄道 勝山永平寺線）
broader: g002631
in scheme: scheme
notation: 002631
scope note: 運営会社: えちぜん鉄道。路線名: 勝山永平寺線。鉄道区分: 普通鉄道（12）。事業者種別: 第三セクター（5）。

鷲宮
type: Concept
alternative label: 鷲宮（東武鉄道 伊勢崎線）
broader: g002632
in scheme: scheme
notation: 002632
scope note: 運営会社: 東武鉄道。路線名: 伊勢崎線。鉄道区分: 普通鉄道（12）。事業者種別: 民営鉄道（4）。

折原
type: Concept
alternative label: 折原（東日本旅客鉄道 八高線）
broader: g002633
in scheme: scheme
notation: 002633
scope note: 運営会社: 東日本旅客鉄道。路線名: 八高線。鉄道区分: 普通鉄道JR（11）。事業者種別: JR在来線（2）。

永平寺口
type: Concept
alternative label: 永平寺口（えちぜん鉄道 勝山永平寺線）
broader: g002634
in scheme: scheme
notation: 002634
scope note: 運営会社: えちぜん鉄道。路線名: 勝山永平寺線。鉄道区分: 普通鉄道（12）。事業者種別: 第三セクター（5）。

長瀞
type: Concept
alternative label: 長瀞（秩父鉄道 秩父本線）
broader: g002635
in scheme: scheme
notation: 002635
scope note: 運営会社: 秩父鉄道。路線名: 秩父本線。鉄道区分: 普通鉄道（12）。事業者種別: 民営鉄道（4）。

みどり湖
type: Concept
alternative label: みどり湖（東日本旅客鉄道 中央線）
broader: g002636
in scheme: scheme
notation: 002636
scope note: 運営会社: 東日本旅客鉄道。路線名: 中央線。鉄道区分: 普通鉄道JR（11）。事業者種別: JR在来線（2）。

松岡
type: Concept
alternative label: 松岡（えちぜん鉄道 勝山永平寺線）
broader: g002637
in scheme: scheme
notation: 002637
scope note: 運営会社: えちぜん鉄道。路線名: 勝山永平寺線。鉄道区分: 普通鉄道（12）。事業者種別: 第三セクター（5）。

新田塚
type: Concept
alternative label: 新田塚（えちぜん鉄道 三国芦原線）
broader: g002638
in scheme: scheme
notation: 002638
scope note: 運営会社: えちぜん鉄道。路線名: 三国芦原線。鉄道区分: 普通鉄道（12）。事業者種別: 第三セクター（5）。

観音町
type: Concept
alternative label: 観音町（えちぜん鉄道 勝山永平寺線）
broader: g002639
in scheme: scheme
notation: 002639
scope note: 運営会社: えちぜん鉄道。路線名: 勝山永平寺線。鉄道区分: 普通鉄道（12）。事業者種別: 第三セクター（5）。

みなみ寄居
type: Concept
alternative label: みなみ寄居（東武鉄道 東上本線）
broader: g002640
in scheme: scheme
notation: 002640
scope note: 運営会社: 東武鉄道。路線名: 東上本線。鉄道区分: 普通鉄道（12）。事業者種別: 民営鉄道（4）。

下志比
type: Concept
alternative label: 下志比（えちぜん鉄道 勝山永平寺線）
broader: g002641
in scheme: scheme
notation: 002641
scope note: 運営会社: えちぜん鉄道。路線名: 勝山永平寺線。鉄道区分: 普通鉄道（12）。事業者種別: 第三セクター（5）。

越前島橋
type: Concept
alternative label: 越前島橋（えちぜん鉄道 勝山永平寺線）
broader: g002642
in scheme: scheme
notation: 002642
scope note: 運営会社: えちぜん鉄道。路線名: 勝山永平寺線。鉄道区分: 普通鉄道（12）。事業者種別: 第三セクター（5）。

東鷲宮
type: Concept
alternative label: 東鷲宮（東日本旅客鉄道 東北線）
broader: g002643
in scheme: scheme
notation: 002643
scope note: 運営会社: 東日本旅客鉄道。路線名: 東北線。鉄道区分: 普通鉄道JR（11）。事業者種別: JR在来線（2）。

小海
type: Concept
alternative label: 小海（東日本旅客鉄道 小海線）
broader: g002644
in scheme: scheme
notation: 002644
scope note: 運営会社: 東日本旅客鉄道。路線名: 小海線。鉄道区分: 普通鉄道JR（11）。事業者種別: JR在来線（2）。

光明寺
type: Concept
alternative label: 光明寺（えちぜん鉄道 勝山永平寺線）
broader: g002645
in scheme: scheme
notation: 002645
scope note: 運営会社: えちぜん鉄道。路線名: 勝山永平寺線。鉄道区分: 普通鉄道（12）。事業者種別: 第三セクター（5）。

飛騨一ノ宮
type: Concept
alternative label: 飛騨一ノ宮（東海旅客鉄道 高山線）
broader: g002646
in scheme: scheme
notation: 002646
scope note: 運営会社: 東海旅客鉄道。路線名: 高山線。鉄道区分: 普通鉄道JR（11）。事業者種別: JR在来線（2）。

洗馬
type: Concept
alternative label: 洗馬（東海旅客鉄道 中央線）
broader: g002647
in scheme: scheme
notation: 002647
scope note: 運営会社: 東海旅客鉄道。路線名: 中央線。鉄道区分: 普通鉄道JR（11）。事業者種別: JR在来線（2）。

轟
type: Concept
alternative label: 轟（えちぜん鉄道 勝山永平寺線）
broader: g002648
in scheme: scheme
notation: 002648
scope note: 運営会社: えちぜん鉄道。路線名: 勝山永平寺線。鉄道区分: 普通鉄道（12）。事業者種別: 第三セクター（5）。

東藤島
type: Concept
alternative label: 東藤島（えちぜん鉄道 勝山永平寺線）
broader: g002649
in scheme: scheme
notation: 002649
scope note: 運営会社: えちぜん鉄道。路線名: 勝山永平寺線。鉄道区分: 普通鉄道（12）。事業者種別: 第三セクター（5）。

上長瀞
type: Concept
alternative label: 上長瀞（秩父鉄道 秩父本線）
broader: g002650
in scheme: scheme
notation: 002650
scope note: 運営会社: 秩父鉄道。路線名: 秩父本線。鉄道区分: 普通鉄道（12）。事業者種別: 民営鉄道（4）。

八ツ島
type: Concept
alternative label: 八ツ島（えちぜん鉄道 三国芦原線）
broader: g002651
in scheme: scheme
notation: 002651
scope note: 運営会社: えちぜん鉄道。路線名: 三国芦原線。鉄道区分: 普通鉄道（12）。事業者種別: 第三セクター（5）。

北鴻巣
type: Concept
alternative label: 北鴻巣（東日本旅客鉄道 高崎線）
broader: g002652
in scheme: scheme
notation: 002652
scope note: 運営会社: 東日本旅客鉄道。路線名: 高崎線。鉄道区分: 普通鉄道JR（11）。事業者種別: JR在来線（2）。

越前野中
type: Concept
alternative label: 越前野中（えちぜん鉄道 勝山永平寺線）
broader: g002653
in scheme: scheme
notation: 002653
scope note: 運営会社: えちぜん鉄道。路線名: 勝山永平寺線。鉄道区分: 普通鉄道（12）。事業者種別: 第三セクター（5）。

追分口
type: Concept
alternative label: 追分口（えちぜん鉄道 勝山永平寺線）
broader: g002654
in scheme: scheme
notation: 002654
scope note: 運営会社: えちぜん鉄道。路線名: 勝山永平寺線。鉄道区分: 普通鉄道（12）。事業者種別: 第三セクター（5）。

つくば
type: Concept
alternative label: つくば（首都圏新都市鉄道 常磐新線）
broader: g002655
in scheme: scheme
notation: 002655
scope note: 運営会社: 首都圏新都市鉄道。路線名: 常磐新線。鉄道区分: 普通鉄道（12）。事業者種別: 第三セクター（5）。

研究学園
type: Concept
alternative label: 研究学園（首都圏新都市鉄道 常磐新線）
broader: g002656
in scheme: scheme
notation: 002656
scope note: 運営会社: 首都圏新都市鉄道。路線名: 常磐新線。鉄道区分: 普通鉄道（12）。事業者種別: 第三セクター（5）。

日華化学前
type: Concept
alternative label: 日華化学前（えちぜん鉄道 三国芦原線）
broader: g002657
in scheme: scheme
notation: 002657
scope note: 運営会社: えちぜん鉄道。路線名: 三国芦原線。鉄道区分: 普通鉄道（12）。事業者種別: 第三セクター（5）。

越前新保
type: Concept
alternative label: 越前新保（えちぜん鉄道 勝山永平寺線）
broader: g002658
in scheme: scheme
notation: 002658
scope note: 運営会社: えちぜん鉄道。路線名: 勝山永平寺線。鉄道区分: 普通鉄道（12）。事業者種別: 第三セクター（5）。

山王
type: Concept
alternative label: 山王（えちぜん鉄道 勝山永平寺線）
broader: g002659
in scheme: scheme
notation: 002659
scope note: 運営会社: えちぜん鉄道。路線名: 勝山永平寺線。鉄道区分: 普通鉄道（12）。事業者種別: 第三セクター（5）。

土浦
type: Concept
alternative label: 土浦（東日本旅客鉄道 常磐線）
broader: g002660
in scheme: scheme
notation: 002660
scope note: 運営会社: 東日本旅客鉄道。路線名: 常磐線。鉄道区分: 普通鉄道JR（11）。事業者種別: JR在来線（2）。

親鼻
type: Concept
alternative label: 親鼻（秩父鉄道 秩父本線）
broader: g002661
in scheme: scheme
notation: 002661
scope note: 運営会社: 秩父鉄道。路線名: 秩父本線。鉄道区分: 普通鉄道（12）。事業者種別: 民営鉄道（4）。

まつもと町屋
type: Concept
alternative label: まつもと町屋（えちぜん鉄道 三国芦原線）
broader: g002662
in scheme: scheme
notation: 002662
scope note: 運営会社: えちぜん鉄道。路線名: 三国芦原線。鉄道区分: 普通鉄道（12）。事業者種別: 第三セクター（5）。

鹿島灘
type: Concept
alternative label: 鹿島灘（鹿島臨海鉄道 大洗鹿島線）
broader: g002663
in scheme: scheme
notation: 002663
scope note: 運営会社: 鹿島臨海鉄道。路線名: 大洗鹿島線。鉄道区分: 普通鉄道（12）。事業者種別: 第三セクター（5）。

小舟渡
type: Concept
alternative label: 小舟渡（えちぜん鉄道 勝山永平寺線）
broader: g002664
in scheme: scheme
notation: 002664
scope note: 運営会社: えちぜん鉄道。路線名: 勝山永平寺線。鉄道区分: 普通鉄道（12）。事業者種別: 第三セクター（5）。

竹沢
type: Concept
alternative label: 竹沢（東日本旅客鉄道 八高線）
broader: g002665
in scheme: scheme
notation: 002665
scope note: 運営会社: 東日本旅客鉄道。路線名: 八高線。鉄道区分: 普通鉄道JR（11）。事業者種別: JR在来線（2）。

東武竹沢
type: Concept
alternative label: 東武竹沢（東武鉄道 東上本線）
broader: g002666
in scheme: scheme
notation: 002666
scope note: 運営会社: 東武鉄道。路線名: 東上本線。鉄道区分: 普通鉄道（12）。事業者種別: 民営鉄道（4）。

越前開発
type: Concept
alternative label: 越前開発（えちぜん鉄道 勝山永平寺線）
broader: g002667
in scheme: scheme
notation: 002667
scope note: 運営会社: えちぜん鉄道。路線名: 勝山永平寺線。鉄道区分: 普通鉄道（12）。事業者種別: 第三セクター（5）。

西別院
type: Concept
alternative label: 西別院（えちぜん鉄道 三国芦原線）
broader: g002668
in scheme: scheme
notation: 002668
scope note: 運営会社: えちぜん鉄道。路線名: 三国芦原線。鉄道区分: 普通鉄道（12）。事業者種別: 第三セクター（5）。

田原町
type: Concept
alternative label: 田原町（えちぜん鉄道 三国芦原線）
broader: g002669
in scheme: scheme
notation: 002669
scope note: 運営会社: えちぜん鉄道。路線名: 三国芦原線。鉄道区分: 普通鉄道（12）。事業者種別: 第三セクター（5）。

田原町
type: Concept
alternative label: 田原町（福井鉄道 福武線）
broader: g002669
in scheme: scheme
notation: 002670
scope note: 運営会社: 福井鉄道。路線名: 福武線。鉄道区分: 軌道（21）。事業者種別: 民営鉄道（4）。

福大前西福井
type: Concept
alternative label: 福大前西福井（えちぜん鉄道 三国芦原線）
broader: g002671
in scheme: scheme
notation: 002671
scope note: 運営会社: えちぜん鉄道。路線名: 三国芦原線。鉄道区分: 普通鉄道（12）。事業者種別: 第三セクター（5）。

幸手
type: Concept
alternative label: 幸手（東武鉄道 日光線）
broader: g002672
in scheme: scheme
notation: 002672
scope note: 運営会社: 東武鉄道。路線名: 日光線。鉄道区分: 普通鉄道（12）。事業者種別: 民営鉄道（4）。

越前竹原
type: Concept
alternative label: 越前竹原（えちぜん鉄道 勝山永平寺線）
broader: g002673
in scheme: scheme
notation: 002673
scope note: 運営会社: えちぜん鉄道。路線名: 勝山永平寺線。鉄道区分: 普通鉄道（12）。事業者種別: 第三セクター（5）。

三妻
type: Concept
alternative label: 三妻（関東鉄道 常総線）
broader: g002674
in scheme: scheme
notation: 002674
scope note: 運営会社: 関東鉄道。路線名: 常総線。鉄道区分: 普通鉄道（12）。事業者種別: 民営鉄道（4）。

発坂
type: Concept
alternative label: 発坂（えちぜん鉄道 勝山永平寺線）
broader: g002675
in scheme: scheme
notation: 002675
scope note: 運営会社: えちぜん鉄道。路線名: 勝山永平寺線。鉄道区分: 普通鉄道（12）。事業者種別: 第三セクター（5）。

下諏訪
type: Concept
alternative label: 下諏訪（東日本旅客鉄道 中央線）
broader: g002676
in scheme: scheme
notation: 002676
scope note: 運営会社: 東日本旅客鉄道。路線名: 中央線。鉄道区分: 普通鉄道JR（11）。事業者種別: JR在来線（2）。

福井口
type: Concept
alternative label: 福井口（えちぜん鉄道 三国芦原線）
broader: g002677
in scheme: scheme
notation: 002677
scope note: 運営会社: えちぜん鉄道。路線名: 三国芦原線。鉄道区分: 普通鉄道（12）。事業者種別: 第三セクター（5）。

福井口
type: Concept
alternative label: 福井口（えちぜん鉄道 勝山永平寺線）
broader: g002677
in scheme: scheme
notation: 002678
scope note: 運営会社: えちぜん鉄道。路線名: 勝山永平寺線。鉄道区分: 普通鉄道（12）。事業者種別: 第三セクター（5）。

保田
type: Concept
alternative label: 保田（えちぜん鉄道 勝山永平寺線）
broader: g002679
in scheme: scheme
notation: 002679
scope note: 運営会社: えちぜん鉄道。路線名: 勝山永平寺線。鉄道区分: 普通鉄道（12）。事業者種別: 第三セクター（5）。

仁愛女子高校
type: Concept
alternative label: 仁愛女子高校（福井鉄道 福武線）
broader: g002680
in scheme: scheme
notation: 002680
scope note: 運営会社: 福井鉄道。路線名: 福武線。鉄道区分: 軌道（21）。事業者種別: 民営鉄道（4）。

皆野
type: Concept
alternative label: 皆野（秩父鉄道 秩父本線）
broader: g002681
in scheme: scheme
notation: 002681
scope note: 運営会社: 秩父鉄道。路線名: 秩父本線。鉄道区分: 普通鉄道（12）。事業者種別: 民営鉄道（4）。

比島
type: Concept
alternative label: 比島（えちぜん鉄道 勝山永平寺線）
broader: g002682
in scheme: scheme
notation: 002682
scope note: 運営会社: えちぜん鉄道。路線名: 勝山永平寺線。鉄道区分: 普通鉄道（12）。事業者種別: 第三セクター（5）。

久喜
type: Concept
alternative label: 久喜（東日本旅客鉄道 東北線）
broader: g002683
in scheme: scheme
notation: 002683
scope note: 運営会社: 東日本旅客鉄道。路線名: 東北線。鉄道区分: 普通鉄道JR（11）。事業者種別: JR在来線（2）。

久喜
type: Concept
alternative label: 久喜（東武鉄道 伊勢崎線）
broader: g002683
in scheme: scheme
notation: 002684
scope note: 運営会社: 東武鉄道。路線名: 伊勢崎線。鉄道区分: 普通鉄道（12）。事業者種別: 民営鉄道（4）。

新福井
type: Concept
alternative label: 新福井（えちぜん鉄道 勝山永平寺線）
broader: g002685
in scheme: scheme
notation: 002685
scope note: 運営会社: えちぜん鉄道。路線名: 勝山永平寺線。鉄道区分: 普通鉄道（12）。事業者種別: 第三セクター（5）。

福井城址大名町
type: Concept
alternative label: 福井城址大名町（福井鉄道 福武線）
broader: g002686
in scheme: scheme
notation: 002686
scope note: 運営会社: 福井鉄道。路線名: 福武線。鉄道区分: 軌道（21）。事業者種別: 民営鉄道（4）。

福井駅
type: Concept
alternative label: 福井駅（福井鉄道 福武線）
broader: g002687
in scheme: scheme
notation: 002687
scope note: 運営会社: 福井鉄道。路線名: 福武線。鉄道区分: 軌道（21）。事業者種別: 民営鉄道（4）。

福井
type: Concept
alternative label: 福井（えちぜん鉄道 勝山永平寺線）
broader: g002688
in scheme: scheme
notation: 002688
scope note: 運営会社: えちぜん鉄道。路線名: 勝山永平寺線。鉄道区分: 普通鉄道（12）。事業者種別: 第三セクター（5）。

福井
type: Concept
alternative label: 福井（ハピラインふくい ハピラインふくい線）
broader: g002688
in scheme: scheme
notation: 002689
scope note: 運営会社: ハピラインふくい。路線名: ハピラインふくい線。鉄道区分: 普通鉄道（12）。事業者種別: 第三セクター（5）。

松原湖
type: Concept
alternative label: 松原湖（東日本旅客鉄道 小海線）
broader: g002690
in scheme: scheme
notation: 002690
scope note: 運営会社: 東日本旅客鉄道。路線名: 小海線。鉄道区分: 普通鉄道JR（11）。事業者種別: JR在来線（2）。

鴻巣
type: Concept
alternative label: 鴻巣（東日本旅客鉄道 高崎線）
broader: g002691
in scheme: scheme
notation: 002691
scope note: 運営会社: 東日本旅客鉄道。路線名: 高崎線。鉄道区分: 普通鉄道JR（11）。事業者種別: JR在来線（2）。

小川町
type: Concept
alternative label: 小川町（東日本旅客鉄道 八高線）
broader: g002692
in scheme: scheme
notation: 002692
scope note: 運営会社: 東日本旅客鉄道。路線名: 八高線。鉄道区分: 普通鉄道JR（11）。事業者種別: JR在来線（2）。

小川町
type: Concept
alternative label: 小川町（東武鉄道 東上本線）
broader: g002692
in scheme: scheme
notation: 002693
scope note: 運営会社: 東武鉄道。路線名: 東上本線。鉄道区分: 普通鉄道（12）。事業者種別: 民営鉄道（4）。

万博記念公園
type: Concept
alternative label: 万博記念公園（首都圏新都市鉄道 常磐新線）
broader: g002694
in scheme: scheme
notation: 002694
scope note: 運営会社: 首都圏新都市鉄道。路線名: 常磐新線。鉄道区分: 普通鉄道（12）。事業者種別: 第三セクター（5）。

足羽山公園口
type: Concept
alternative label: 足羽山公園口（福井鉄道 福武線）
broader: g002695
in scheme: scheme
notation: 002695
scope note: 運営会社: 福井鉄道。路線名: 福武線。鉄道区分: 軌道（21）。事業者種別: 民営鉄道（4）。

岡谷
type: Concept
alternative label: 岡谷（東日本旅客鉄道 中央線）
broader: g002696
in scheme: scheme
notation: 002696
scope note: 運営会社: 東日本旅客鉄道。路線名: 中央線。鉄道区分: 普通鉄道JR（11）。事業者種別: JR在来線（2）。

勝山
type: Concept
alternative label: 勝山（えちぜん鉄道 勝山永平寺線）
broader: g002697
in scheme: scheme
notation: 002697
scope note: 運営会社: えちぜん鉄道。路線名: 勝山永平寺線。鉄道区分: 普通鉄道（12）。事業者種別: 第三セクター（5）。

商工会議所前
type: Concept
alternative label: 商工会議所前（福井鉄道 福武線）
broader: g002698
in scheme: scheme
notation: 002698
scope note: 運営会社: 福井鉄道。路線名: 福武線。鉄道区分: 軌道（21）。事業者種別: 民営鉄道（4）。

久々野
type: Concept
alternative label: 久々野（東海旅客鉄道 高山線）
broader: g002699
in scheme: scheme
notation: 002699
scope note: 運営会社: 東海旅客鉄道。路線名: 高山線。鉄道区分: 普通鉄道JR（11）。事業者種別: JR在来線（2）。

杉戸高野台
type: Concept
alternative label: 杉戸高野台（東武鉄道 日光線）
broader: g002700
in scheme: scheme
notation: 002700
scope note: 運営会社: 東武鉄道。路線名: 日光線。鉄道区分: 普通鉄道（12）。事業者種別: 民営鉄道（4）。

鹿島大野
type: Concept
alternative label: 鹿島大野（鹿島臨海鉄道 大洗鹿島線）
broader: g002701
in scheme: scheme
notation: 002701
scope note: 運営会社: 鹿島臨海鉄道。路線名: 大洗鹿島線。鉄道区分: 普通鉄道（12）。事業者種別: 第三セクター（5）。

日出塩
type: Concept
alternative label: 日出塩（東海旅客鉄道 中央線）
broader: g002702
in scheme: scheme
notation: 002702
scope note: 運営会社: 東海旅客鉄道。路線名: 中央線。鉄道区分: 普通鉄道JR（11）。事業者種別: JR在来線（2）。

赤十字前
type: Concept
alternative label: 赤十字前（福井鉄道 福武線）
broader: g002703
in scheme: scheme
notation: 002703
scope note: 運営会社: 福井鉄道。路線名: 福武線。鉄道区分: 普通鉄道（12）。事業者種別: 民営鉄道（4）。

中妻
type: Concept
alternative label: 中妻（関東鉄道 常総線）
broader: g002704
in scheme: scheme
notation: 002704
scope note: 運営会社: 関東鉄道。路線名: 常総線。鉄道区分: 普通鉄道（12）。事業者種別: 民営鉄道（4）。

小野
type: Concept
alternative label: 小野（東日本旅客鉄道 中央線）
broader: g002705
in scheme: scheme
notation: 002705
scope note: 運営会社: 東日本旅客鉄道。路線名: 中央線。鉄道区分: 普通鉄道JR（11）。事業者種別: JR在来線（2）。

上諏訪
type: Concept
alternative label: 上諏訪（東日本旅客鉄道 中央線）
broader: g002706
in scheme: scheme
notation: 002706
scope note: 運営会社: 東日本旅客鉄道。路線名: 中央線。鉄道区分: 普通鉄道JR（11）。事業者種別: JR在来線（2）。

和銅黒谷
type: Concept
alternative label: 和銅黒谷（秩父鉄道 秩父本線）
broader: g002707
in scheme: scheme
notation: 002707
scope note: 運営会社: 秩父鉄道。路線名: 秩父本線。鉄道区分: 普通鉄道（12）。事業者種別: 民営鉄道（4）。

森林公園
type: Concept
alternative label: 森林公園（東武鉄道 東上本線）
broader: g002708
in scheme: scheme
notation: 002708
scope note: 運営会社: 東武鉄道。路線名: 東上本線。鉄道区分: 普通鉄道（12）。事業者種別: 民営鉄道（4）。

武蔵嵐山
type: Concept
alternative label: 武蔵嵐山（東武鉄道 東上本線）
broader: g002709
in scheme: scheme
notation: 002709
scope note: 運営会社: 東武鉄道。路線名: 東上本線。鉄道区分: 普通鉄道（12）。事業者種別: 民営鉄道（4）。

つきのわ
type: Concept
alternative label: つきのわ（東武鉄道 東上本線）
broader: g002710
in scheme: scheme
notation: 002710
scope note: 運営会社: 東武鉄道。路線名: 東上本線。鉄道区分: 普通鉄道（12）。事業者種別: 民営鉄道（4）。

海尻
type: Concept
alternative label: 海尻（東日本旅客鉄道 小海線）
broader: g002711
in scheme: scheme
notation: 002711
scope note: 運営会社: 東日本旅客鉄道。路線名: 小海線。鉄道区分: 普通鉄道JR（11）。事業者種別: JR在来線（2）。

花堂
type: Concept
alternative label: 花堂（福井鉄道 福武線）
broader: g002712
in scheme: scheme
notation: 002712
scope note: 運営会社: 福井鉄道。路線名: 福武線。鉄道区分: 普通鉄道（12）。事業者種別: 民営鉄道（4）。

和戸
type: Concept
alternative label: 和戸（東武鉄道 伊勢崎線）
broader: g002713
in scheme: scheme
notation: 002713
scope note: 運営会社: 東武鉄道。路線名: 伊勢崎線。鉄道区分: 普通鉄道（12）。事業者種別: 民営鉄道（4）。

越前花堂
type: Concept
alternative label: 越前花堂（西日本旅客鉄道 越美北線）
broader: g002714
in scheme: scheme
notation: 002714
scope note: 運営会社: 西日本旅客鉄道。路線名: 越美北線。鉄道区分: 普通鉄道JR（11）。事業者種別: JR在来線（2）。

越前花堂
type: Concept
alternative label: 越前花堂（ハピラインふくい ハピラインふくい線）
broader: g002714
in scheme: scheme
notation: 002715
scope note: 運営会社: ハピラインふくい。路線名: ハピラインふくい線。鉄道区分: 普通鉄道（12）。事業者種別: 第三セクター（5）。

新白岡
type: Concept
alternative label: 新白岡（東日本旅客鉄道 東北線）
broader: g002716
in scheme: scheme
notation: 002716
scope note: 運営会社: 東日本旅客鉄道。路線名: 東北線。鉄道区分: 普通鉄道JR（11）。事業者種別: JR在来線（2）。

東松山
type: Concept
alternative label: 東松山（東武鉄道 東上本線）
broader: g002717
in scheme: scheme
notation: 002717
scope note: 運営会社: 東武鉄道。路線名: 東上本線。鉄道区分: 普通鉄道（12）。事業者種別: 民営鉄道（4）。

ベル前
type: Concept
alternative label: ベル前（福井鉄道 福武線）
broader: g002718
in scheme: scheme
notation: 002718
scope note: 運営会社: 福井鉄道。路線名: 福武線。鉄道区分: 普通鉄道（12）。事業者種別: 民営鉄道（4）。

川岸
type: Concept
alternative label: 川岸（東日本旅客鉄道 中央線）
broader: g002719
in scheme: scheme
notation: 002719
scope note: 運営会社: 東日本旅客鉄道。路線名: 中央線。鉄道区分: 普通鉄道JR（11）。事業者種別: JR在来線（2）。

北本
type: Concept
alternative label: 北本（東日本旅客鉄道 高崎線）
broader: g002720
in scheme: scheme
notation: 002720
scope note: 運営会社: 東日本旅客鉄道。路線名: 高崎線。鉄道区分: 普通鉄道JR（11）。事業者種別: JR在来線（2）。

北水海道
type: Concept
alternative label: 北水海道（関東鉄道 常総線）
broader: g002721
in scheme: scheme
notation: 002721
scope note: 運営会社: 関東鉄道。路線名: 常総線。鉄道区分: 普通鉄道（12）。事業者種別: 民営鉄道（4）。

長者ヶ浜潮騒はまなす公園前
type: Concept
alternative label: 長者ヶ浜潮騒はまなす公園前（鹿島臨海鉄道 大洗鹿島線）
broader: g002722
in scheme: scheme
notation: 002722
scope note: 運営会社: 鹿島臨海鉄道。路線名: 大洗鹿島線。鉄道区分: 普通鉄道（12）。事業者種別: 第三セクター（5）。

荒川沖
type: Concept
alternative label: 荒川沖（東日本旅客鉄道 常磐線）
broader: g002723
in scheme: scheme
notation: 002723
scope note: 運営会社: 東日本旅客鉄道。路線名: 常磐線。鉄道区分: 普通鉄道JR（11）。事業者種別: JR在来線（2）。

みどりの
type: Concept
alternative label: みどりの（首都圏新都市鉄道 常磐新線）
broader: g002724
in scheme: scheme
notation: 002724
scope note: 運営会社: 首都圏新都市鉄道。路線名: 常磐新線。鉄道区分: 普通鉄道（12）。事業者種別: 第三セクター（5）。

江端
type: Concept
alternative label: 江端（福井鉄道 福武線）
broader: g002725
in scheme: scheme
notation: 002725
scope note: 運営会社: 福井鉄道。路線名: 福武線。鉄道区分: 普通鉄道（12）。事業者種別: 民営鉄道（4）。

六条
type: Concept
alternative label: 六条（西日本旅客鉄道 越美北線）
broader: g002726
in scheme: scheme
notation: 002726
scope note: 運営会社: 西日本旅客鉄道。路線名: 越美北線。鉄道区分: 普通鉄道JR（11）。事業者種別: JR在来線（2）。

越前高田
type: Concept
alternative label: 越前高田（西日本旅客鉄道 越美北線）
broader: g002727
in scheme: scheme
notation: 002727
scope note: 運営会社: 西日本旅客鉄道。路線名: 越美北線。鉄道区分: 普通鉄道JR（11）。事業者種別: JR在来線（2）。

東武動物公園
type: Concept
alternative label: 東武動物公園（東武鉄道 伊勢崎線）
broader: g002728
in scheme: scheme
notation: 002728
scope note: 運営会社: 東武鉄道。路線名: 伊勢崎線。鉄道区分: 普通鉄道（12）。事業者種別: 民営鉄道（4）。

東武動物公園
type: Concept
alternative label: 東武動物公園（東武鉄道 日光線）
broader: g002728
in scheme: scheme
notation: 002729
scope note: 運営会社: 東武鉄道。路線名: 日光線。鉄道区分: 普通鉄道（12）。事業者種別: 民営鉄道（4）。

清明
type: Concept
alternative label: 清明（福井鉄道 福武線）
broader: g002730
in scheme: scheme
notation: 002730
scope note: 運営会社: 福井鉄道。路線名: 福武線。鉄道区分: 普通鉄道（12）。事業者種別: 民営鉄道（4）。

佐久海ノ口
type: Concept
alternative label: 佐久海ノ口（東日本旅客鉄道 小海線）
broader: g002731
in scheme: scheme
notation: 002731
scope note: 運営会社: 東日本旅客鉄道。路線名: 小海線。鉄道区分: 普通鉄道JR（11）。事業者種別: JR在来線（2）。

足羽
type: Concept
alternative label: 足羽（西日本旅客鉄道 越美北線）
broader: g002732
in scheme: scheme
notation: 002732
scope note: 運営会社: 西日本旅客鉄道。路線名: 越美北線。鉄道区分: 普通鉄道JR（11）。事業者種別: JR在来線（2）。

市波
type: Concept
alternative label: 市波（西日本旅客鉄道 越美北線）
broader: g002733
in scheme: scheme
notation: 002733
scope note: 運営会社: 西日本旅客鉄道。路線名: 越美北線。鉄道区分: 普通鉄道JR（11）。事業者種別: JR在来線（2）。

大野原
type: Concept
alternative label: 大野原（秩父鉄道 秩父本線）
broader: g002734
in scheme: scheme
notation: 002734
scope note: 運営会社: 秩父鉄道。路線名: 秩父本線。鉄道区分: 普通鉄道（12）。事業者種別: 民営鉄道（4）。

越前東郷
type: Concept
alternative label: 越前東郷（西日本旅客鉄道 越美北線）
broader: g002735
in scheme: scheme
notation: 002735
scope note: 運営会社: 西日本旅客鉄道。路線名: 越美北線。鉄道区分: 普通鉄道JR（11）。事業者種別: JR在来線（2）。

水海道
type: Concept
alternative label: 水海道（関東鉄道 常総線）
broader: g002736
in scheme: scheme
notation: 002736
scope note: 運営会社: 関東鉄道。路線名: 常総線。鉄道区分: 普通鉄道（12）。事業者種別: 民営鉄道（4）。

白岡
type: Concept
alternative label: 白岡（東日本旅客鉄道 東北線）
broader: g002737
in scheme: scheme
notation: 002737
scope note: 運営会社: 東日本旅客鉄道。路線名: 東北線。鉄道区分: 普通鉄道JR（11）。事業者種別: JR在来線（2）。

小和清水
type: Concept
alternative label: 小和清水（西日本旅客鉄道 越美北線）
broader: g002738
in scheme: scheme
notation: 002738
scope note: 運営会社: 西日本旅客鉄道。路線名: 越美北線。鉄道区分: 普通鉄道JR（11）。事業者種別: JR在来線（2）。

荒野台
type: Concept
alternative label: 荒野台（鹿島臨海鉄道 大洗鹿島線）
broader: g002739
in scheme: scheme
notation: 002739
scope note: 運営会社: 鹿島臨海鉄道。路線名: 大洗鹿島線。鉄道区分: 普通鉄道（12）。事業者種別: 第三セクター（5）。

ハーモニーホール
type: Concept
alternative label: ハーモニーホール（福井鉄道 福武線）
broader: g002740
in scheme: scheme
notation: 002740
scope note: 運営会社: 福井鉄道。路線名: 福武線。鉄道区分: 普通鉄道（12）。事業者種別: 民営鉄道（4）。

贄川
type: Concept
alternative label: 贄川（東海旅客鉄道 中央線）
broader: g002741
in scheme: scheme
notation: 002741
scope note: 運営会社: 東海旅客鉄道。路線名: 中央線。鉄道区分: 普通鉄道JR（11）。事業者種別: JR在来線（2）。

内宿
type: Concept
alternative label: 内宿（埼玉新都市交通 伊奈線）
broader: g002742
in scheme: scheme
notation: 002742
scope note: 運営会社: 埼玉新都市交通。路線名: 伊奈線。鉄道区分: 案内軌条式鉄道（16）。事業者種別: 第三セクター（5）。

一乗谷
type: Concept
alternative label: 一乗谷（西日本旅客鉄道 越美北線）
broader: g002743
in scheme: scheme
notation: 002743
scope note: 運営会社: 西日本旅客鉄道。路線名: 越美北線。鉄道区分: 普通鉄道JR（11）。事業者種別: JR在来線（2）。

信濃川島
type: Concept
alternative label: 信濃川島（東日本旅客鉄道 中央線）
broader: g002744
in scheme: scheme
notation: 002744
scope note: 運営会社: 東日本旅客鉄道。路線名: 中央線。鉄道区分: 普通鉄道JR（11）。事業者種別: JR在来線（2）。

大土呂
type: Concept
alternative label: 大土呂（ハピラインふくい ハピラインふくい線）
broader: g002745
in scheme: scheme
notation: 002745
scope note: 運営会社: ハピラインふくい。路線名: ハピラインふくい線。鉄道区分: 普通鉄道（12）。事業者種別: 第三セクター（5）。

ひたち野うしく
type: Concept
alternative label: ひたち野うしく（東日本旅客鉄道 常磐線）
broader: g002746
in scheme: scheme
notation: 002746
scope note: 運営会社: 東日本旅客鉄道。路線名: 常磐線。鉄道区分: 普通鉄道JR（11）。事業者種別: JR在来線（2）。

羽貫
type: Concept
alternative label: 羽貫（埼玉新都市交通 伊奈線）
broader: g002747
in scheme: scheme
notation: 002747
scope note: 運営会社: 埼玉新都市交通。路線名: 伊奈線。鉄道区分: 案内軌条式鉄道（16）。事業者種別: 第三セクター（5）。

浅水
type: Concept
alternative label: 浅水（福井鉄道 福武線）
broader: g002748
in scheme: scheme
notation: 002748
scope note: 運営会社: 福井鉄道。路線名: 福武線。鉄道区分: 普通鉄道（12）。事業者種別: 民営鉄道（4）。

越前薬師
type: Concept
alternative label: 越前薬師（西日本旅客鉄道 越美北線）
broader: g002749
in scheme: scheme
notation: 002749
scope note: 運営会社: 西日本旅客鉄道。路線名: 越美北線。鉄道区分: 普通鉄道JR（11）。事業者種別: JR在来線（2）。

姫宮
type: Concept
alternative label: 姫宮（東武鉄道 伊勢崎線）
broader: g002750
in scheme: scheme
notation: 002750
scope note: 運営会社: 東武鉄道。路線名: 伊勢崎線。鉄道区分: 普通鉄道（12）。事業者種別: 民営鉄道（4）。

佐久広瀬
type: Concept
alternative label: 佐久広瀬（東日本旅客鉄道 小海線）
broader: g002751
in scheme: scheme
notation: 002751
scope note: 運営会社: 東日本旅客鉄道。路線名: 小海線。鉄道区分: 普通鉄道JR（11）。事業者種別: JR在来線（2）。

明覚
type: Concept
alternative label: 明覚（東日本旅客鉄道 八高線）
broader: g002752
in scheme: scheme
notation: 002752
scope note: 運営会社: 東日本旅客鉄道。路線名: 八高線。鉄道区分: 普通鉄道JR（11）。事業者種別: JR在来線（2）。

高坂
type: Concept
alternative label: 高坂（東武鉄道 東上本線）
broader: g002753
in scheme: scheme
notation: 002753
scope note: 運営会社: 東武鉄道。路線名: 東上本線。鉄道区分: 普通鉄道（12）。事業者種別: 民営鉄道（4）。

渚
type: Concept
alternative label: 渚（東海旅客鉄道 高山線）
broader: g002754
in scheme: scheme
notation: 002754
scope note: 運営会社: 東海旅客鉄道。路線名: 高山線。鉄道区分: 普通鉄道JR（11）。事業者種別: JR在来線（2）。

越前大宮
type: Concept
alternative label: 越前大宮（西日本旅客鉄道 越美北線）
broader: g002755
in scheme: scheme
notation: 002755
scope note: 運営会社: 西日本旅客鉄道。路線名: 越美北線。鉄道区分: 普通鉄道JR（11）。事業者種別: JR在来線（2）。

伊奈中央
type: Concept
alternative label: 伊奈中央（埼玉新都市交通 伊奈線）
broader: g002756
in scheme: scheme
notation: 002756
scope note: 運営会社: 埼玉新都市交通。路線名: 伊奈線。鉄道区分: 案内軌条式鉄道（16）。事業者種別: 第三セクター（5）。

泰澄の里
type: Concept
alternative label: 泰澄の里（福井鉄道 福武線）
broader: g002757
in scheme: scheme
notation: 002757
scope note: 運営会社: 福井鉄道。路線名: 福武線。鉄道区分: 普通鉄道（12）。事業者種別: 民営鉄道（4）。

秩父
type: Concept
alternative label: 秩父（秩父鉄道 秩父本線）
broader: g002758
in scheme: scheme
notation: 002758
scope note: 運営会社: 秩父鉄道。路線名: 秩父本線。鉄道区分: 普通鉄道（12）。事業者種別: 民営鉄道（4）。

牛ケ原
type: Concept
alternative label: 牛ケ原（西日本旅客鉄道 越美北線）
broader: g002759
in scheme: scheme
notation: 002759
scope note: 運営会社: 西日本旅客鉄道。路線名: 越美北線。鉄道区分: 普通鉄道JR（11）。事業者種別: JR在来線（2）。

美山
type: Concept
alternative label: 美山（西日本旅客鉄道 越美北線）
broader: g002760
in scheme: scheme
notation: 002760
scope note: 運営会社: 西日本旅客鉄道。路線名: 越美北線。鉄道区分: 普通鉄道JR（11）。事業者種別: JR在来線（2）。

桶川
type: Concept
alternative label: 桶川（東日本旅客鉄道 高崎線）
broader: g002761
in scheme: scheme
notation: 002761
scope note: 運営会社: 東日本旅客鉄道。路線名: 高崎線。鉄道区分: 普通鉄道JR（11）。事業者種別: JR在来線（2）。

北大野
type: Concept
alternative label: 北大野（西日本旅客鉄道 越美北線）
broader: g002762
in scheme: scheme
notation: 002762
scope note: 運営会社: 西日本旅客鉄道。路線名: 越美北線。鉄道区分: 普通鉄道JR（11）。事業者種別: JR在来線（2）。

計石
type: Concept
alternative label: 計石（西日本旅客鉄道 越美北線）
broader: g002763
in scheme: scheme
notation: 002763
scope note: 運営会社: 西日本旅客鉄道。路線名: 越美北線。鉄道区分: 普通鉄道JR（11）。事業者種別: JR在来線（2）。

茅野
type: Concept
alternative label: 茅野（東日本旅客鉄道 中央線）
broader: g002764
in scheme: scheme
notation: 002764
scope note: 運営会社: 東日本旅客鉄道。路線名: 中央線。鉄道区分: 普通鉄道JR（11）。事業者種別: JR在来線（2）。

みらい平
type: Concept
alternative label: みらい平（首都圏新都市鉄道 常磐新線）
broader: g002765
in scheme: scheme
notation: 002765
scope note: 運営会社: 首都圏新都市鉄道。路線名: 常磐新線。鉄道区分: 普通鉄道（12）。事業者種別: 第三セクター（5）。

鹿島サッカースタジアム
type: Concept
alternative label: 鹿島サッカースタジアム（東日本旅客鉄道 鹿島線）
broader: g002766
in scheme: scheme
notation: 002766
scope note: 運営会社: 東日本旅客鉄道。路線名: 鹿島線。鉄道区分: 普通鉄道JR（11）。事業者種別: JR在来線（2）。

鹿島サッカースタジアム
type: Concept
alternative label: 鹿島サッカースタジアム（鹿島臨海鉄道 大洗鹿島線）
broader: g002766
in scheme: scheme
notation: 002767
scope note: 運営会社: 鹿島臨海鉄道。路線名: 大洗鹿島線。鉄道区分: 普通鉄道（12）。事業者種別: 第三セクター（5）。

御花畑
type: Concept
alternative label: 御花畑（秩父鉄道 秩父本線）
broader: g002768
in scheme: scheme
notation: 002768
scope note: 運営会社: 秩父鉄道。路線名: 秩父本線。鉄道区分: 普通鉄道（12）。事業者種別: 民営鉄道（4）。

越前富田
type: Concept
alternative label: 越前富田（西日本旅客鉄道 越美北線）
broader: g002769
in scheme: scheme
notation: 002769
scope note: 運営会社: 西日本旅客鉄道。路線名: 越美北線。鉄道区分: 普通鉄道JR（11）。事業者種別: JR在来線（2）。

志久
type: Concept
alternative label: 志久（埼玉新都市交通 伊奈線）
broader: g002770
in scheme: scheme
notation: 002770
scope note: 運営会社: 埼玉新都市交通。路線名: 伊奈線。鉄道区分: 案内軌条式鉄道（16）。事業者種別: 第三セクター（5）。

西武秩父
type: Concept
alternative label: 西武秩父（西武鉄道 西武秩父線）
broader: g002771
in scheme: scheme
notation: 002771
scope note: 運営会社: 西武鉄道。路線名: 西武秩父線。鉄道区分: 普通鉄道（12）。事業者種別: 民営鉄道（4）。

北春日部
type: Concept
alternative label: 北春日部（東武鉄道 伊勢崎線）
broader: g002772
in scheme: scheme
notation: 002772
scope note: 運営会社: 東武鉄道。路線名: 伊勢崎線。鉄道区分: 普通鉄道（12）。事業者種別: 民営鉄道（4）。

三十八社
type: Concept
alternative label: 三十八社（福井鉄道 福武線）
broader: g002773
in scheme: scheme
notation: 002773
scope note: 運営会社: 福井鉄道。路線名: 福武線。鉄道区分: 普通鉄道（12）。事業者種別: 民営鉄道（4）。

越前田野
type: Concept
alternative label: 越前田野（西日本旅客鉄道 越美北線）
broader: g002774
in scheme: scheme
notation: 002774
scope note: 運営会社: 西日本旅客鉄道。路線名: 越美北線。鉄道区分: 普通鉄道JR（11）。事業者種別: JR在来線（2）。

北上尾
type: Concept
alternative label: 北上尾（東日本旅客鉄道 高崎線）
broader: g002775
in scheme: scheme
notation: 002775
scope note: 運営会社: 東日本旅客鉄道。路線名: 高崎線。鉄道区分: 普通鉄道JR（11）。事業者種別: JR在来線（2）。

辰野
type: Concept
alternative label: 辰野（東日本旅客鉄道 中央線）
broader: g002776
in scheme: scheme
notation: 002776
scope note: 運営会社: 東日本旅客鉄道。路線名: 中央線。鉄道区分: 普通鉄道JR（11）。事業者種別: JR在来線（2）。

辰野
type: Concept
alternative label: 辰野（東海旅客鉄道 飯田線）
broader: g002776
in scheme: scheme
notation: 002777
scope note: 運営会社: 東海旅客鉄道。路線名: 飯田線。鉄道区分: 普通鉄道JR（11）。事業者種別: JR在来線（2）。

横瀬
type: Concept
alternative label: 横瀬（西武鉄道 西武秩父線）
broader: g002778
in scheme: scheme
notation: 002778
scope note: 運営会社: 西武鉄道。路線名: 西武秩父線。鉄道区分: 普通鉄道（12）。事業者種別: 民営鉄道（4）。

越前大野
type: Concept
alternative label: 越前大野（西日本旅客鉄道 越美北線）
broader: g002779
in scheme: scheme
notation: 002779
scope note: 運営会社: 西日本旅客鉄道。路線名: 越美北線。鉄道区分: 普通鉄道JR（11）。事業者種別: JR在来線（2）。

鳥羽中
type: Concept
alternative label: 鳥羽中（福井鉄道 福武線）
broader: g002780
in scheme: scheme
notation: 002780
scope note: 運営会社: 福井鉄道。路線名: 福武線。鉄道区分: 普通鉄道（12）。事業者種別: 民営鉄道（4）。

蓮田
type: Concept
alternative label: 蓮田（東日本旅客鉄道 東北線）
broader: g002781
in scheme: scheme
notation: 002781
scope note: 運営会社: 東日本旅客鉄道。路線名: 東北線。鉄道区分: 普通鉄道JR（11）。事業者種別: JR在来線（2）。

小絹
type: Concept
alternative label: 小絹（関東鉄道 常総線）
broader: g002782
in scheme: scheme
notation: 002782
scope note: 運営会社: 関東鉄道。路線名: 常総線。鉄道区分: 普通鉄道（12）。事業者種別: 民営鉄道（4）。

南桜井
type: Concept
alternative label: 南桜井（東武鉄道 野田線）
broader: g002783
in scheme: scheme
notation: 002783
scope note: 運営会社: 東武鉄道。路線名: 野田線。鉄道区分: 普通鉄道（12）。事業者種別: 民営鉄道（4）。

藤の牛島
type: Concept
alternative label: 藤の牛島（東武鉄道 野田線）
broader: g002784
in scheme: scheme
notation: 002784
scope note: 運営会社: 東武鉄道。路線名: 野田線。鉄道区分: 普通鉄道（12）。事業者種別: 民営鉄道（4）。

春日部
type: Concept
alternative label: 春日部（東武鉄道 伊勢崎線）
broader: g002785
in scheme: scheme
notation: 002785
scope note: 運営会社: 東武鉄道。路線名: 伊勢崎線。鉄道区分: 普通鉄道（12）。事業者種別: 民営鉄道（4）。

春日部
type: Concept
alternative label: 春日部（東武鉄道 野田線）
broader: g002785
in scheme: scheme
notation: 002786
scope note: 運営会社: 東武鉄道。路線名: 野田線。鉄道区分: 普通鉄道（12）。事業者種別: 民営鉄道（4）。

丸山
type: Concept
alternative label: 丸山（埼玉新都市交通 伊奈線）
broader: g002787
in scheme: scheme
notation: 002787
scope note: 運営会社: 埼玉新都市交通。路線名: 伊奈線。鉄道区分: 案内軌条式鉄道（16）。事業者種別: 第三セクター（5）。

川間
type: Concept
alternative label: 川間（東武鉄道 野田線）
broader: g002788
in scheme: scheme
notation: 002788
scope note: 運営会社: 東武鉄道。路線名: 野田線。鉄道区分: 普通鉄道（12）。事業者種別: 民営鉄道（4）。

木曽平沢
type: Concept
alternative label: 木曽平沢（東海旅客鉄道 中央線）
broader: g002789
in scheme: scheme
notation: 002789
scope note: 運営会社: 東海旅客鉄道。路線名: 中央線。鉄道区分: 普通鉄道JR（11）。事業者種別: JR在来線（2）。

八木崎
type: Concept
alternative label: 八木崎（東武鉄道 野田線）
broader: g002790
in scheme: scheme
notation: 002790
scope note: 運営会社: 東武鉄道。路線名: 野田線。鉄道区分: 普通鉄道（12）。事業者種別: 民営鉄道（4）。

芦ヶ久保
type: Concept
alternative label: 芦ヶ久保（西武鉄道 西武秩父線）
broader: g002791
in scheme: scheme
notation: 002791
scope note: 運営会社: 西武鉄道。路線名: 西武秩父線。鉄道区分: 普通鉄道（12）。事業者種別: 民営鉄道（4）。

宮木
type: Concept
alternative label: 宮木（東海旅客鉄道 飯田線）
broader: g002792
in scheme: scheme
notation: 002792
scope note: 運営会社: 東海旅客鉄道。路線名: 飯田線。鉄道区分: 普通鉄道JR（11）。事業者種別: JR在来線（2）。

信濃川上
type: Concept
alternative label: 信濃川上（東日本旅客鉄道 小海線）
broader: g002793
in scheme: scheme
notation: 002793
scope note: 運営会社: 東日本旅客鉄道。路線名: 小海線。鉄道区分: 普通鉄道JR（11）。事業者種別: JR在来線（2）。

牛久
type: Concept
alternative label: 牛久（東日本旅客鉄道 常磐線）
broader: g002794
in scheme: scheme
notation: 002794
scope note: 運営会社: 東日本旅客鉄道。路線名: 常磐線。鉄道区分: 普通鉄道JR（11）。事業者種別: JR在来線（2）。

下唯野
type: Concept
alternative label: 下唯野（西日本旅客鉄道 越美北線）
broader: g002795
in scheme: scheme
notation: 002795
scope note: 運営会社: 西日本旅客鉄道。路線名: 越美北線。鉄道区分: 普通鉄道JR（11）。事業者種別: JR在来線（2）。

上尾
type: Concept
alternative label: 上尾（東日本旅客鉄道 高崎線）
broader: g002796
in scheme: scheme
notation: 002796
scope note: 運営会社: 東日本旅客鉄道。路線名: 高崎線。鉄道区分: 普通鉄道JR（11）。事業者種別: JR在来線（2）。

神明
type: Concept
alternative label: 神明（福井鉄道 福武線）
broader: g002797
in scheme: scheme
notation: 002797
scope note: 運営会社: 福井鉄道。路線名: 福武線。鉄道区分: 普通鉄道（12）。事業者種別: 民営鉄道（4）。

柿ケ島
type: Concept
alternative label: 柿ケ島（西日本旅客鉄道 越美北線）
broader: g002798
in scheme: scheme
notation: 002798
scope note: 運営会社: 西日本旅客鉄道。路線名: 越美北線。鉄道区分: 普通鉄道JR（11）。事業者種別: JR在来線（2）。

影森
type: Concept
alternative label: 影森（秩父鉄道 秩父本線）
broader: g002799
in scheme: scheme
notation: 002799
scope note: 運営会社: 秩父鉄道。路線名: 秩父本線。鉄道区分: 普通鉄道（12）。事業者種別: 民営鉄道（4）。

北坂戸
type: Concept
alternative label: 北坂戸（東武鉄道 東上本線）
broader: g002800
in scheme: scheme
notation: 002800
scope note: 運営会社: 東武鉄道。路線名: 東上本線。鉄道区分: 普通鉄道（12）。事業者種別: 民営鉄道（4）。

北鯖江
type: Concept
alternative label: 北鯖江（ハピラインふくい ハピラインふくい線）
broader: g002801
in scheme: scheme
notation: 002801
scope note: 運営会社: ハピラインふくい。路線名: ハピラインふくい線。鉄道区分: 普通鉄道（12）。事業者種別: 第三セクター（5）。

沼南
type: Concept
alternative label: 沼南（埼玉新都市交通 伊奈線）
broader: g002802
in scheme: scheme
notation: 002802
scope note: 運営会社: 埼玉新都市交通。路線名: 伊奈線。鉄道区分: 案内軌条式鉄道（16）。事業者種別: 第三セクター（5）。

七光台
type: Concept
alternative label: 七光台（東武鉄道 野田線）
broader: g002803
in scheme: scheme
notation: 002803
scope note: 運営会社: 東武鉄道。路線名: 野田線。鉄道区分: 普通鉄道（12）。事業者種別: 民営鉄道（4）。

鹿島神宮
type: Concept
alternative label: 鹿島神宮（東日本旅客鉄道 鹿島線）
broader: g002804
in scheme: scheme
notation: 002804
scope note: 運営会社: 東日本旅客鉄道。路線名: 鹿島線。鉄道区分: 普通鉄道JR（11）。事業者種別: JR在来線（2）。

奈良井
type: Concept
alternative label: 奈良井（東海旅客鉄道 中央線）
broader: g002805
in scheme: scheme
notation: 002805
scope note: 運営会社: 東海旅客鉄道。路線名: 中央線。鉄道区分: 普通鉄道JR（11）。事業者種別: JR在来線（2）。

伊那新町
type: Concept
alternative label: 伊那新町（東海旅客鉄道 飯田線）
broader: g002806
in scheme: scheme
notation: 002806
scope note: 運営会社: 東海旅客鉄道。路線名: 飯田線。鉄道区分: 普通鉄道JR（11）。事業者種別: JR在来線（2）。

豊春
type: Concept
alternative label: 豊春（東武鉄道 野田線）
broader: g002807
in scheme: scheme
notation: 002807
scope note: 運営会社: 東武鉄道。路線名: 野田線。鉄道区分: 普通鉄道（12）。事業者種別: 民営鉄道（4）。

勝原
type: Concept
alternative label: 勝原（西日本旅客鉄道 越美北線）
broader: g002808
in scheme: scheme
notation: 002808
scope note: 運営会社: 西日本旅客鉄道。路線名: 越美北線。鉄道区分: 普通鉄道JR（11）。事業者種別: JR在来線（2）。

新守谷
type: Concept
alternative label: 新守谷（関東鉄道 常総線）
broader: g002809
in scheme: scheme
notation: 002809
scope note: 運営会社: 関東鉄道。路線名: 常総線。鉄道区分: 普通鉄道（12）。事業者種別: 民営鉄道（4）。

一ノ割
type: Concept
alternative label: 一ノ割（東武鉄道 伊勢崎線）
broader: g002810
in scheme: scheme
notation: 002810
scope note: 運営会社: 東武鉄道。路線名: 伊勢崎線。鉄道区分: 普通鉄道（12）。事業者種別: 民営鉄道（4）。

浦山口
type: Concept
alternative label: 浦山口（秩父鉄道 秩父本線）
broader: g002811
in scheme: scheme
notation: 002811
scope note: 運営会社: 秩父鉄道。路線名: 秩父本線。鉄道区分: 普通鉄道（12）。事業者種別: 民営鉄道（4）。

原市
type: Concept
alternative label: 原市（埼玉新都市交通 伊奈線）
broader: g002812
in scheme: scheme
notation: 002812
scope note: 運営会社: 埼玉新都市交通。路線名: 伊奈線。鉄道区分: 案内軌条式鉄道（16）。事業者種別: 第三セクター（5）。

東岩槻
type: Concept
alternative label: 東岩槻（東武鉄道 野田線）
broader: g002813
in scheme: scheme
notation: 002813
scope note: 運営会社: 東武鉄道。路線名: 野田線。鉄道区分: 普通鉄道（12）。事業者種別: 民営鉄道（4）。

越生
type: Concept
alternative label: 越生（東日本旅客鉄道 八高線）
broader: g002814
in scheme: scheme
notation: 002814
scope note: 運営会社: 東日本旅客鉄道。路線名: 八高線。鉄道区分: 普通鉄道JR（11）。事業者種別: JR在来線（2）。

越生
type: Concept
alternative label: 越生（東武鉄道 越生線）
broader: g002814
in scheme: scheme
notation: 002815
scope note: 運営会社: 東武鉄道。路線名: 越生線。鉄道区分: 普通鉄道（12）。事業者種別: 民営鉄道（4）。

水落
type: Concept
alternative label: 水落（福井鉄道 福武線）
broader: g002816
in scheme: scheme
notation: 002816
scope note: 運営会社: 福井鉄道。路線名: 福武線。鉄道区分: 普通鉄道（12）。事業者種別: 民営鉄道（4）。

三峰口
type: Concept
alternative label: 三峰口（秩父鉄道 秩父本線）
broader: g002817
in scheme: scheme
notation: 002817
scope note: 運営会社: 秩父鉄道。路線名: 秩父本線。鉄道区分: 普通鉄道（12）。事業者種別: 民営鉄道（4）。

白久
type: Concept
alternative label: 白久（秩父鉄道 秩父本線）
broader: g002818
in scheme: scheme
notation: 002818
scope note: 運営会社: 秩父鉄道。路線名: 秩父本線。鉄道区分: 普通鉄道（12）。事業者種別: 民営鉄道（4）。

清水公園
type: Concept
alternative label: 清水公園（東武鉄道 野田線）
broader: g002819
in scheme: scheme
notation: 002819
scope note: 運営会社: 東武鉄道。路線名: 野田線。鉄道区分: 普通鉄道（12）。事業者種別: 民営鉄道（4）。

武州中川
type: Concept
alternative label: 武州中川（秩父鉄道 秩父本線）
broader: g002820
in scheme: scheme
notation: 002820
scope note: 運営会社: 秩父鉄道。路線名: 秩父本線。鉄道区分: 普通鉄道（12）。事業者種別: 民営鉄道（4）。

延方
type: Concept
alternative label: 延方（東日本旅客鉄道 鹿島線）
broader: g002821
in scheme: scheme
notation: 002821
scope note: 運営会社: 東日本旅客鉄道。路線名: 鹿島線。鉄道区分: 普通鉄道JR（11）。事業者種別: JR在来線（2）。

坂戸
type: Concept
alternative label: 坂戸（東武鉄道 東上本線）
broader: g002822
in scheme: scheme
notation: 002822
scope note: 運営会社: 東武鉄道。路線名: 東上本線。鉄道区分: 普通鉄道（12）。事業者種別: 民営鉄道（4）。

坂戸
type: Concept
alternative label: 坂戸（東武鉄道 越生線）
broader: g002822
in scheme: scheme
notation: 002823
scope note: 運営会社: 東武鉄道。路線名: 越生線。鉄道区分: 普通鉄道（12）。事業者種別: 民営鉄道（4）。

吉野原
type: Concept
alternative label: 吉野原（埼玉新都市交通 伊奈線）
broader: g002824
in scheme: scheme
notation: 002824
scope note: 運営会社: 埼玉新都市交通。路線名: 伊奈線。鉄道区分: 案内軌条式鉄道（16）。事業者種別: 第三セクター（5）。

野辺山
type: Concept
alternative label: 野辺山（東日本旅客鉄道 小海線）
broader: g002825
in scheme: scheme
notation: 002825
scope note: 運営会社: 東日本旅客鉄道。路線名: 小海線。鉄道区分: 普通鉄道JR（11）。事業者種別: JR在来線（2）。

武州日野
type: Concept
alternative label: 武州日野（秩父鉄道 秩父本線）
broader: g002826
in scheme: scheme
notation: 002826
scope note: 運営会社: 秩父鉄道。路線名: 秩父本線。鉄道区分: 普通鉄道（12）。事業者種別: 民営鉄道（4）。

羽場
type: Concept
alternative label: 羽場（東海旅客鉄道 飯田線）
broader: g002827
in scheme: scheme
notation: 002827
scope note: 運営会社: 東海旅客鉄道。路線名: 飯田線。鉄道区分: 普通鉄道JR（11）。事業者種別: JR在来線（2）。

西山公園
type: Concept
alternative label: 西山公園（福井鉄道 福武線）
broader: g002828
in scheme: scheme
notation: 002828
scope note: 運営会社: 福井鉄道。路線名: 福武線。鉄道区分: 普通鉄道（12）。事業者種別: 民営鉄道（4）。

武州唐沢
type: Concept
alternative label: 武州唐沢（東武鉄道 越生線）
broader: g002829
in scheme: scheme
notation: 002829
scope note: 運営会社: 東武鉄道。路線名: 越生線。鉄道区分: 普通鉄道（12）。事業者種別: 民営鉄道（4）。

守谷
type: Concept
alternative label: 守谷（関東鉄道 常総線）
broader: g002830
in scheme: scheme
notation: 002830
scope note: 運営会社: 関東鉄道。路線名: 常総線。鉄道区分: 普通鉄道（12）。事業者種別: 民営鉄道（4）。

飛騨小坂
type: Concept
alternative label: 飛騨小坂（東海旅客鉄道 高山線）
broader: g002831
in scheme: scheme
notation: 002831
scope note: 運営会社: 東海旅客鉄道。路線名: 高山線。鉄道区分: 普通鉄道JR（11）。事業者種別: JR在来線（2）。

愛宕
type: Concept
alternative label: 愛宕（東武鉄道 野田線）
broader: g002832
in scheme: scheme
notation: 002832
scope note: 運営会社: 東武鉄道。路線名: 野田線。鉄道区分: 普通鉄道（12）。事業者種別: 民営鉄道（4）。

岩槻
type: Concept
alternative label: 岩槻（東武鉄道 野田線）
broader: g002833
in scheme: scheme
notation: 002833
scope note: 運営会社: 東武鉄道。路線名: 野田線。鉄道区分: 普通鉄道（12）。事業者種別: 民営鉄道（4）。

守谷
type: Concept
alternative label: 守谷（首都圏新都市鉄道 常磐新線）
broader: g002830
in scheme: scheme
notation: 002834
scope note: 運営会社: 首都圏新都市鉄道。路線名: 常磐新線。鉄道区分: 普通鉄道（12）。事業者種別: 第三セクター（5）。

今羽
type: Concept
alternative label: 今羽（埼玉新都市交通 伊奈線）
broader: g002835
in scheme: scheme
notation: 002835
scope note: 運営会社: 埼玉新都市交通。路線名: 伊奈線。鉄道区分: 案内軌条式鉄道（16）。事業者種別: 第三セクター（5）。

武里
type: Concept
alternative label: 武里（東武鉄道 伊勢崎線）
broader: g002836
in scheme: scheme
notation: 002836
scope note: 運営会社: 東武鉄道。路線名: 伊勢崎線。鉄道区分: 普通鉄道（12）。事業者種別: 民営鉄道（4）。

若葉
type: Concept
alternative label: 若葉（東武鉄道 東上本線）
broader: g002837
in scheme: scheme
notation: 002837
scope note: 運営会社: 東武鉄道。路線名: 東上本線。鉄道区分: 普通鉄道（12）。事業者種別: 民営鉄道（4）。

東大宮
type: Concept
alternative label: 東大宮（東日本旅客鉄道 東北線）
broader: g002838
in scheme: scheme
notation: 002838
scope note: 運営会社: 東日本旅客鉄道。路線名: 東北線。鉄道区分: 普通鉄道JR（11）。事業者種別: JR在来線（2）。

東毛呂
type: Concept
alternative label: 東毛呂（東武鉄道 越生線）
broader: g002839
in scheme: scheme
notation: 002839
scope note: 運営会社: 東武鉄道。路線名: 越生線。鉄道区分: 普通鉄道（12）。事業者種別: 民営鉄道（4）。

西鯖江
type: Concept
alternative label: 西鯖江（福井鉄道 福武線）
broader: g002840
in scheme: scheme
notation: 002840
scope note: 運営会社: 福井鉄道。路線名: 福武線。鉄道区分: 普通鉄道（12）。事業者種別: 民営鉄道（4）。

野田市
type: Concept
alternative label: 野田市（東武鉄道 野田線）
broader: g002841
in scheme: scheme
notation: 002841
scope note: 運営会社: 東武鉄道。路線名: 野田線。鉄道区分: 普通鉄道（12）。事業者種別: 民営鉄道（4）。

鯖江
type: Concept
alternative label: 鯖江（ハピラインふくい ハピラインふくい線）
broader: g002842
in scheme: scheme
notation: 002842
scope note: 運営会社: ハピラインふくい。路線名: ハピラインふくい線。鉄道区分: 普通鉄道（12）。事業者種別: 第三セクター（5）。

青柳
type: Concept
alternative label: 青柳（東日本旅客鉄道 中央線）
broader: g002843
in scheme: scheme
notation: 002843
scope note: 運営会社: 東日本旅客鉄道。路線名: 中央線。鉄道区分: 普通鉄道JR（11）。事業者種別: JR在来線（2）。

東宮原
type: Concept
alternative label: 東宮原（埼玉新都市交通 伊奈線）
broader: g002844
in scheme: scheme
notation: 002844
scope note: 運営会社: 埼玉新都市交通。路線名: 伊奈線。鉄道区分: 案内軌条式鉄道（16）。事業者種別: 第三セクター（5）。

武州長瀬
type: Concept
alternative label: 武州長瀬（東武鉄道 越生線）
broader: g002845
in scheme: scheme
notation: 002845
scope note: 運営会社: 東武鉄道。路線名: 越生線。鉄道区分: 普通鉄道（12）。事業者種別: 民営鉄道（4）。

毛呂
type: Concept
alternative label: 毛呂（東日本旅客鉄道 八高線）
broader: g002846
in scheme: scheme
notation: 002846
scope note: 運営会社: 東日本旅客鉄道。路線名: 八高線。鉄道区分: 普通鉄道JR（11）。事業者種別: JR在来線（2）。

宮原
type: Concept
alternative label: 宮原（東日本旅客鉄道 高崎線）
broader: g002847
in scheme: scheme
notation: 002847
scope note: 運営会社: 東日本旅客鉄道。路線名: 高崎線。鉄道区分: 普通鉄道JR（11）。事業者種別: JR在来線（2）。

一本松
type: Concept
alternative label: 一本松（東武鉄道 越生線）
broader: g002848
in scheme: scheme
notation: 002848
scope note: 運営会社: 東武鉄道。路線名: 越生線。鉄道区分: 普通鉄道（12）。事業者種別: 民営鉄道（4）。

正丸
type: Concept
alternative label: 正丸（西武鉄道 西武秩父線）
broader: g002849
in scheme: scheme
notation: 002849
scope note: 運営会社: 西武鉄道。路線名: 西武秩父線。鉄道区分: 普通鉄道（12）。事業者種別: 民営鉄道（4）。

川角
type: Concept
alternative label: 川角（東武鉄道 越生線）
broader: g002850
in scheme: scheme
notation: 002850
scope note: 運営会社: 東武鉄道。路線名: 越生線。鉄道区分: 普通鉄道（12）。事業者種別: 民営鉄道（4）。

潮来
type: Concept
alternative label: 潮来（東日本旅客鉄道 鹿島線）
broader: g002851
in scheme: scheme
notation: 002851
scope note: 運営会社: 東日本旅客鉄道。路線名: 鹿島線。鉄道区分: 普通鉄道JR（11）。事業者種別: JR在来線（2）。

鶴ヶ島
type: Concept
alternative label: 鶴ヶ島（東武鉄道 東上本線）
broader: g002852
in scheme: scheme
notation: 002852
scope note: 運営会社: 東武鉄道。路線名: 東上本線。鉄道区分: 普通鉄道（12）。事業者種別: 民営鉄道（4）。

サンドーム西
type: Concept
alternative label: サンドーム西（福井鉄道 福武線）
broader: g002853
in scheme: scheme
notation: 002853
scope note: 運営会社: 福井鉄道。路線名: 福武線。鉄道区分: 普通鉄道（12）。事業者種別: 民営鉄道（4）。

七里
type: Concept
alternative label: 七里（東武鉄道 野田線）
broader: g002854
in scheme: scheme
notation: 002854
scope note: 運営会社: 東武鉄道。路線名: 野田線。鉄道区分: 普通鉄道（12）。事業者種別: 民営鉄道（4）。

沢
type: Concept
alternative label: 沢（東海旅客鉄道 飯田線）
broader: g002855
in scheme: scheme
notation: 002855
scope note: 運営会社: 東海旅客鉄道。路線名: 飯田線。鉄道区分: 普通鉄道JR（11）。事業者種別: JR在来線（2）。

せんげん台
type: Concept
alternative label: せんげん台（東武鉄道 伊勢崎線）
broader: g002856
in scheme: scheme
notation: 002856
scope note: 運営会社: 東武鉄道。路線名: 伊勢崎線。鉄道区分: 普通鉄道（12）。事業者種別: 民営鉄道（4）。

加茂宮
type: Concept
alternative label: 加茂宮（埼玉新都市交通 伊奈線）
broader: g002857
in scheme: scheme
notation: 002857
scope note: 運営会社: 埼玉新都市交通。路線名: 伊奈線。鉄道区分: 案内軌条式鉄道（16）。事業者種別: 第三セクター（5）。

南守谷
type: Concept
alternative label: 南守谷（関東鉄道 常総線）
broader: g002858
in scheme: scheme
notation: 002858
scope note: 運営会社: 関東鉄道。路線名: 常総線。鉄道区分: 普通鉄道（12）。事業者種別: 民営鉄道（4）。

土呂
type: Concept
alternative label: 土呂（東日本旅客鉄道 東北線）
broader: g002859
in scheme: scheme
notation: 002859
scope note: 運営会社: 東日本旅客鉄道。路線名: 東北線。鉄道区分: 普通鉄道JR（11）。事業者種別: JR在来線（2）。

西大家
type: Concept
alternative label: 西大家（東武鉄道 越生線）
broader: g002860
in scheme: scheme
notation: 002860
scope note: 運営会社: 東武鉄道。路線名: 越生線。鉄道区分: 普通鉄道（12）。事業者種別: 民営鉄道（4）。

梅郷
type: Concept
alternative label: 梅郷（東武鉄道 野田線）
broader: g002861
in scheme: scheme
notation: 002861
scope note: 運営会社: 東武鉄道。路線名: 野田線。鉄道区分: 普通鉄道（12）。事業者種別: 民営鉄道（4）。

日進
type: Concept
alternative label: 日進（東日本旅客鉄道 川越線）
broader: g002862
in scheme: scheme
notation: 002862
scope note: 運営会社: 東日本旅客鉄道。路線名: 川越線。鉄道区分: 普通鉄道JR（11）。事業者種別: JR在来線（2）。

すずらんの里
type: Concept
alternative label: すずらんの里（東日本旅客鉄道 中央線）
broader: g002863
in scheme: scheme
notation: 002863
scope note: 運営会社: 東日本旅客鉄道。路線名: 中央線。鉄道区分: 普通鉄道JR（11）。事業者種別: JR在来線（2）。

北濃
type: Concept
alternative label: 北濃（長良川鉄道 越美南線）
broader: g002864
in scheme: scheme
notation: 002864
scope note: 運営会社: 長良川鉄道。路線名: 越美南線。鉄道区分: 普通鉄道（12）。事業者種別: 第三セクター（5）。

藪原
type: Concept
alternative label: 藪原（東海旅客鉄道 中央線）
broader: g002865
in scheme: scheme
notation: 002865
scope note: 運営会社: 東海旅客鉄道。路線名: 中央線。鉄道区分: 普通鉄道JR（11）。事業者種別: JR在来線（2）。

龍ケ崎市
type: Concept
alternative label: 龍ケ崎市（東日本旅客鉄道 常磐線）
broader: g002866
in scheme: scheme
notation: 002866
scope note: 運営会社: 東日本旅客鉄道。路線名: 常磐線。鉄道区分: 普通鉄道JR（11）。事業者種別: JR在来線（2）。

佐貫
type: Concept
alternative label: 佐貫（関東鉄道 竜ヶ崎線）
broader: g002867
in scheme: scheme
notation: 002867
scope note: 運営会社: 関東鉄道。路線名: 竜ヶ崎線。鉄道区分: 普通鉄道（12）。事業者種別: 民営鉄道（4）。

戸頭
type: Concept
alternative label: 戸頭（関東鉄道 常総線）
broader: g002868
in scheme: scheme
notation: 002868
scope note: 運営会社: 関東鉄道。路線名: 常総線。鉄道区分: 普通鉄道（12）。事業者種別: 民営鉄道（4）。

大和田
type: Concept
alternative label: 大和田（東武鉄道 野田線）
broader: g002869
in scheme: scheme
notation: 002869
scope note: 運営会社: 東武鉄道。路線名: 野田線。鉄道区分: 普通鉄道（12）。事業者種別: 民営鉄道（4）。

飛騨宮田
type: Concept
alternative label: 飛騨宮田（東海旅客鉄道 高山線）
broader: g002870
in scheme: scheme
notation: 002870
scope note: 運営会社: 東海旅客鉄道。路線名: 高山線。鉄道区分: 普通鉄道JR（11）。事業者種別: JR在来線（2）。

西吾野
type: Concept
alternative label: 西吾野（西武鉄道 西武秩父線）
broader: g002871
in scheme: scheme
notation: 002871
scope note: 運営会社: 西武鉄道。路線名: 西武秩父線。鉄道区分: 普通鉄道（12）。事業者種別: 民営鉄道（4）。

稲戸井
type: Concept
alternative label: 稲戸井（関東鉄道 常総線）
broader: g002872
in scheme: scheme
notation: 002872
scope note: 運営会社: 関東鉄道。路線名: 常総線。鉄道区分: 普通鉄道（12）。事業者種別: 民営鉄道（4）。

家久
type: Concept
alternative label: 家久（福井鉄道 福武線）
broader: g002873
in scheme: scheme
notation: 002873
scope note: 運営会社: 福井鉄道。路線名: 福武線。鉄道区分: 普通鉄道（12）。事業者種別: 民営鉄道（4）。

霞ヶ関
type: Concept
alternative label: 霞ヶ関（東武鉄道 東上本線）
broader: g002874
in scheme: scheme
notation: 002874
scope note: 運営会社: 東武鉄道。路線名: 東上本線。鉄道区分: 普通鉄道（12）。事業者種別: 民営鉄道（4）。

大袋
type: Concept
alternative label: 大袋（東武鉄道 伊勢崎線）
broader: g002875
in scheme: scheme
notation: 002875
scope note: 運営会社: 東武鉄道。路線名: 伊勢崎線。鉄道区分: 普通鉄道（12）。事業者種別: 民営鉄道（4）。

大宮公園
type: Concept
alternative label: 大宮公園（東武鉄道 野田線）
broader: g002876
in scheme: scheme
notation: 002876
scope note: 運営会社: 東武鉄道。路線名: 野田線。鉄道区分: 普通鉄道（12）。事業者種別: 民営鉄道（4）。

西大宮
type: Concept
alternative label: 西大宮（東日本旅客鉄道 川越線）
broader: g002877
in scheme: scheme
notation: 002877
scope note: 運営会社: 東日本旅客鉄道。路線名: 川越線。鉄道区分: 普通鉄道JR（11）。事業者種別: JR在来線（2）。

ゆめみ野
type: Concept
alternative label: ゆめみ野（関東鉄道 常総線）
broader: g002878
in scheme: scheme
notation: 002878
scope note: 運営会社: 関東鉄道。路線名: 常総線。鉄道区分: 普通鉄道（12）。事業者種別: 民営鉄道（4）。

藤代
type: Concept
alternative label: 藤代（東日本旅客鉄道 常磐線）
broader: g002879
in scheme: scheme
notation: 002879
scope note: 運営会社: 東日本旅客鉄道。路線名: 常磐線。鉄道区分: 普通鉄道JR（11）。事業者種別: JR在来線（2）。

越前下山
type: Concept
alternative label: 越前下山（西日本旅客鉄道 越美北線）
broader: g002880
in scheme: scheme
notation: 002880
scope note: 運営会社: 西日本旅客鉄道。路線名: 越美北線。鉄道区分: 普通鉄道JR（11）。事業者種別: JR在来線（2）。

鉄道博物館
type: Concept
alternative label: 鉄道博物館（埼玉新都市交通 伊奈線）
broader: g002881
in scheme: scheme
notation: 002881
scope note: 運営会社: 埼玉新都市交通。路線名: 伊奈線。鉄道区分: 案内軌条式鉄道（16）。事業者種別: 第三セクター（5）。

白山長滝
type: Concept
alternative label: 白山長滝（長良川鉄道 越美南線）
broader: g002882
in scheme: scheme
notation: 002882
scope note: 運営会社: 長良川鉄道。路線名: 越美南線。鉄道区分: 普通鉄道（12）。事業者種別: 第三セクター（5）。

スポーツ公園
type: Concept
alternative label: スポーツ公園（福井鉄道 福武線）
broader: g002883
in scheme: scheme
notation: 002883
scope note: 運営会社: 福井鉄道。路線名: 福武線。鉄道区分: 普通鉄道（12）。事業者種別: 民営鉄道（4）。

清里
type: Concept
alternative label: 清里（東日本旅客鉄道 小海線）
broader: g002884
in scheme: scheme
notation: 002884
scope note: 運営会社: 東日本旅客鉄道。路線名: 小海線。鉄道区分: 普通鉄道JR（11）。事業者種別: JR在来線（2）。

西川越
type: Concept
alternative label: 西川越（東日本旅客鉄道 川越線）
broader: g002885
in scheme: scheme
notation: 002885
scope note: 運営会社: 東日本旅客鉄道。路線名: 川越線。鉄道区分: 普通鉄道JR（11）。事業者種別: JR在来線（2）。

入地
type: Concept
alternative label: 入地（関東鉄道 竜ヶ崎線）
broader: g002886
in scheme: scheme
notation: 002886
scope note: 運営会社: 関東鉄道。路線名: 竜ヶ崎線。鉄道区分: 普通鉄道（12）。事業者種別: 民営鉄道（4）。

北大宮
type: Concept
alternative label: 北大宮（東武鉄道 野田線）
broader: g002887
in scheme: scheme
notation: 002887
scope note: 運営会社: 東武鉄道。路線名: 野田線。鉄道区分: 普通鉄道（12）。事業者種別: 民営鉄道（4）。

新取手
type: Concept
alternative label: 新取手（関東鉄道 常総線）
broader: g002888
in scheme: scheme
notation: 002888
scope note: 運営会社: 関東鉄道。路線名: 常総線。鉄道区分: 普通鉄道（12）。事業者種別: 民営鉄道（4）。

的場
type: Concept
alternative label: 的場（東日本旅客鉄道 川越線）
broader: g002889
in scheme: scheme
notation: 002889
scope note: 運営会社: 東日本旅客鉄道。路線名: 川越線。鉄道区分: 普通鉄道JR（11）。事業者種別: JR在来線（2）。

十二橋
type: Concept
alternative label: 十二橋（東日本旅客鉄道 鹿島線）
broader: g002890
in scheme: scheme
notation: 002890
scope note: 運営会社: 東日本旅客鉄道。路線名: 鹿島線。鉄道区分: 普通鉄道JR（11）。事業者種別: JR在来線（2）。

指扇
type: Concept
alternative label: 指扇（東日本旅客鉄道 川越線）
broader: g002891
in scheme: scheme
notation: 002891
scope note: 運営会社: 東日本旅客鉄道。路線名: 川越線。鉄道区分: 普通鉄道JR（11）。事業者種別: JR在来線（2）。

運河
type: Concept
alternative label: 運河（東武鉄道 野田線）
broader: g002892
in scheme: scheme
notation: 002892
scope note: 運営会社: 東武鉄道。路線名: 野田線。鉄道区分: 普通鉄道（12）。事業者種別: 民営鉄道（4）。

川越市
type: Concept
alternative label: 川越市（東武鉄道 東上本線）
broader: g002893
in scheme: scheme
notation: 002893
scope note: 運営会社: 東武鉄道。路線名: 東上本線。鉄道区分: 普通鉄道（12）。事業者種別: 民営鉄道（4）。

伊那松島
type: Concept
alternative label: 伊那松島（東海旅客鉄道 飯田線）
broader: g002894
in scheme: scheme
notation: 002894
scope note: 運営会社: 東海旅客鉄道。路線名: 飯田線。鉄道区分: 普通鉄道JR（11）。事業者種別: JR在来線（2）。

本川越
type: Concept
alternative label: 本川越（西武鉄道 新宿線）
broader: g002895
in scheme: scheme
notation: 002895
scope note: 運営会社: 西武鉄道。路線名: 新宿線。鉄道区分: 普通鉄道（12）。事業者種別: 民営鉄道（4）。

白鳥高原
type: Concept
alternative label: 白鳥高原（長良川鉄道 越美南線）
broader: g002896
in scheme: scheme
notation: 002896
scope note: 運営会社: 長良川鉄道。路線名: 越美南線。鉄道区分: 普通鉄道（12）。事業者種別: 第三セクター（5）。

富士見
type: Concept
alternative label: 富士見（東日本旅客鉄道 中央線）
broader: g002897
in scheme: scheme
notation: 002897
scope note: 運営会社: 東日本旅客鉄道。路線名: 中央線。鉄道区分: 普通鉄道JR（11）。事業者種別: JR在来線（2）。

寺原
type: Concept
alternative label: 寺原（関東鉄道 常総線）
broader: g002898
in scheme: scheme
notation: 002898
scope note: 運営会社: 関東鉄道。路線名: 常総線。鉄道区分: 普通鉄道（12）。事業者種別: 民営鉄道（4）。

上呂
type: Concept
alternative label: 上呂（東海旅客鉄道 高山線）
broader: g002899
in scheme: scheme
notation: 002899
scope note: 運営会社: 東海旅客鉄道。路線名: 高山線。鉄道区分: 普通鉄道JR（11）。事業者種別: JR在来線（2）。

柏たなか
type: Concept
alternative label: 柏たなか（首都圏新都市鉄道 常磐新線）
broader: g002900
in scheme: scheme
notation: 002900
scope note: 運営会社: 首都圏新都市鉄道。路線名: 常磐新線。鉄道区分: 普通鉄道（12）。事業者種別: 第三セクター（5）。

北府
type: Concept
alternative label: 北府（福井鉄道 福武線）
broader: g002901
in scheme: scheme
notation: 002901
scope note: 運営会社: 福井鉄道。路線名: 福武線。鉄道区分: 普通鉄道（12）。事業者種別: 民営鉄道（4）。

西取手
type: Concept
alternative label: 西取手（関東鉄道 常総線）
broader: g002902
in scheme: scheme
notation: 002902
scope note: 運営会社: 関東鉄道。路線名: 常総線。鉄道区分: 普通鉄道（12）。事業者種別: 民営鉄道（4）。

竜ヶ崎
type: Concept
alternative label: 竜ヶ崎（関東鉄道 竜ヶ崎線）
broader: g002903
in scheme: scheme
notation: 002903
scope note: 運営会社: 関東鉄道。路線名: 竜ヶ崎線。鉄道区分: 普通鉄道（12）。事業者種別: 民営鉄道（4）。

吾野
type: Concept
alternative label: 吾野（西武鉄道 西武秩父線）
broader: g002904
in scheme: scheme
notation: 002904
scope note: 運営会社: 西武鉄道。路線名: 西武秩父線。鉄道区分: 普通鉄道（12）。事業者種別: 民営鉄道（4）。

吾野
type: Concept
alternative label: 吾野（西武鉄道 池袋線）
broader: g002904
in scheme: scheme
notation: 002905
scope note: 運営会社: 西武鉄道。路線名: 池袋線。鉄道区分: 普通鉄道（12）。事業者種別: 民営鉄道（4）。

大宮
type: Concept
alternative label: 大宮（埼玉新都市交通 伊奈線）
broader: g002914
in scheme: scheme
notation: 002906
scope note: 運営会社: 埼玉新都市交通。路線名: 伊奈線。鉄道区分: 案内軌条式鉄道（16）。事業者種別: 第三セクター（5）。

大宮
type: Concept
alternative label: 大宮（東武鉄道 野田線）
broader: g002914
in scheme: scheme
notation: 002907
scope note: 運営会社: 東武鉄道。路線名: 野田線。鉄道区分: 普通鉄道（12）。事業者種別: 民営鉄道（4）。

笠幡
type: Concept
alternative label: 笠幡（東日本旅客鉄道 川越線）
broader: g002908
in scheme: scheme
notation: 002908
scope note: 運営会社: 東日本旅客鉄道。路線名: 川越線。鉄道区分: 普通鉄道JR（11）。事業者種別: JR在来線（2）。

川越
type: Concept
alternative label: 川越（東武鉄道 東上本線）
broader: g002909
in scheme: scheme
notation: 002909
scope note: 運営会社: 東武鉄道。路線名: 東上本線。鉄道区分: 普通鉄道（12）。事業者種別: 民営鉄道（4）。

川越
type: Concept
alternative label: 川越（東日本旅客鉄道 川越線）
broader: g002909
in scheme: scheme
notation: 002910
scope note: 運営会社: 東日本旅客鉄道。路線名: 川越線。鉄道区分: 普通鉄道JR（11）。事業者種別: JR在来線（2）。

たけふ新
type: Concept
alternative label: たけふ新（福井鉄道 福武線）
broader: g002911
in scheme: scheme
notation: 002911
scope note: 運営会社: 福井鉄道。路線名: 福武線。鉄道区分: 普通鉄道（12）。事業者種別: 民営鉄道（4）。

大宮
type: Concept
alternative label: 大宮（東日本旅客鉄道 東北線）
broader: g002914
in scheme: scheme
notation: 002912
scope note: 運営会社: 東日本旅客鉄道。路線名: 東北線。鉄道区分: 普通鉄道JR（11）。事業者種別: JR在来線（2）。

大宮
type: Concept
alternative label: 大宮（東日本旅客鉄道 高崎線）
broader: g002914
in scheme: scheme
notation: 002913
scope note: 運営会社: 東日本旅客鉄道。路線名: 高崎線。鉄道区分: 普通鉄道JR（11）。事業者種別: JR在来線（2）。

大宮
type: Concept
alternative label: 大宮（東日本旅客鉄道 上越新幹線）
broader: g002914
in scheme: scheme
notation: 002914
scope note: 運営会社: 東日本旅客鉄道。路線名: 上越新幹線。鉄道区分: 普通鉄道JR（11）。事業者種別: JRの新幹線（1）。

大宮
type: Concept
alternative label: 大宮（東日本旅客鉄道 東北新幹線）
broader: g002914
in scheme: scheme
notation: 002915
scope note: 運営会社: 東日本旅客鉄道。路線名: 東北新幹線。鉄道区分: 普通鉄道JR（11）。事業者種別: JRの新幹線（1）。

大宮
type: Concept
alternative label: 大宮（東日本旅客鉄道 川越線）
broader: g002914
in scheme: scheme
notation: 002916
scope note: 運営会社: 東日本旅客鉄道。路線名: 川越線。鉄道区分: 普通鉄道JR（11）。事業者種別: JR在来線（2）。

九頭竜湖
type: Concept
alternative label: 九頭竜湖（西日本旅客鉄道 越美北線）
broader: g002917
in scheme: scheme
notation: 002917
scope note: 運営会社: 西日本旅客鉄道。路線名: 越美北線。鉄道区分: 普通鉄道JR（11）。事業者種別: JR在来線（2）。

武生
type: Concept
alternative label: 武生（ハピラインふくい ハピラインふくい線）
broader: g002918
in scheme: scheme
notation: 002918
scope note: 運営会社: ハピラインふくい。路線名: ハピラインふくい線。鉄道区分: 普通鉄道（12）。事業者種別: 第三セクター（5）。

南古谷
type: Concept
alternative label: 南古谷（東日本旅客鉄道 川越線）
broader: g002919
in scheme: scheme
notation: 002919
scope note: 運営会社: 東日本旅客鉄道。路線名: 川越線。鉄道区分: 普通鉄道JR（11）。事業者種別: JR在来線（2）。

北越谷
type: Concept
alternative label: 北越谷（東武鉄道 伊勢崎線）
broader: g002920
in scheme: scheme
notation: 002920
scope note: 運営会社: 東武鉄道。路線名: 伊勢崎線。鉄道区分: 普通鉄道（12）。事業者種別: 民営鉄道（4）。

武蔵高萩
type: Concept
alternative label: 武蔵高萩（東日本旅客鉄道 川越線）
broader: g002921
in scheme: scheme
notation: 002921
scope note: 運営会社: 東日本旅客鉄道。路線名: 川越線。鉄道区分: 普通鉄道JR（11）。事業者種別: JR在来線（2）。

木ノ下
type: Concept
alternative label: 木ノ下（東海旅客鉄道 飯田線）
broader: g002922
in scheme: scheme
notation: 002922
scope note: 運営会社: 東海旅客鉄道。路線名: 飯田線。鉄道区分: 普通鉄道JR（11）。事業者種別: JR在来線（2）。

香取
type: Concept
alternative label: 香取（東日本旅客鉄道 鹿島線）
broader: g002923
in scheme: scheme
notation: 002923
scope note: 運営会社: 東日本旅客鉄道。路線名: 鹿島線。鉄道区分: 普通鉄道JR（11）。事業者種別: JR在来線（2）。

香取
type: Concept
alternative label: 香取（東日本旅客鉄道 成田線）
broader: g002923
in scheme: scheme
notation: 002924
scope note: 運営会社: 東日本旅客鉄道。路線名: 成田線。鉄道区分: 普通鉄道JR（11）。事業者種別: JR在来線（2）。

取手
type: Concept
alternative label: 取手（関東鉄道 常総線）
broader: g002925
in scheme: scheme
notation: 002925
scope note: 運営会社: 関東鉄道。路線名: 常総線。鉄道区分: 普通鉄道（12）。事業者種別: 民営鉄道（4）。

江戸川台
type: Concept
alternative label: 江戸川台（東武鉄道 野田線）
broader: g002926
in scheme: scheme
notation: 002926
scope note: 運営会社: 東武鉄道。路線名: 野田線。鉄道区分: 普通鉄道（12）。事業者種別: 民営鉄道（4）。

高麗川
type: Concept
alternative label: 高麗川（東日本旅客鉄道 川越線）
broader: g002927
in scheme: scheme
notation: 002927
scope note: 運営会社: 東日本旅客鉄道。路線名: 川越線。鉄道区分: 普通鉄道JR（11）。事業者種別: JR在来線（2）。

高麗川
type: Concept
alternative label: 高麗川（東日本旅客鉄道 八高線）
broader: g002927
in scheme: scheme
notation: 002928
scope note: 運営会社: 東日本旅客鉄道。路線名: 八高線。鉄道区分: 普通鉄道JR（11）。事業者種別: JR在来線（2）。

甲斐大泉
type: Concept
alternative label: 甲斐大泉（東日本旅客鉄道 小海線）
broader: g002929
in scheme: scheme
notation: 002929
scope note: 運営会社: 東日本旅客鉄道。路線名: 小海線。鉄道区分: 普通鉄道JR（11）。事業者種別: JR在来線（2）。

取手
type: Concept
alternative label: 取手（東日本旅客鉄道 常磐線）
broader: g002925
in scheme: scheme
notation: 002930
scope note: 運営会社: 東日本旅客鉄道。路線名: 常磐線。鉄道区分: 普通鉄道JR（11）。事業者種別: JR在来線（2）。

佐原
type: Concept
alternative label: 佐原（東日本旅客鉄道 成田線）
broader: g002931
in scheme: scheme
notation: 002931
scope note: 運営会社: 東日本旅客鉄道。路線名: 成田線。鉄道区分: 普通鉄道JR（11）。事業者種別: JR在来線（2）。

下総神崎
type: Concept
alternative label: 下総神崎（東日本旅客鉄道 成田線）
broader: g002932
in scheme: scheme
notation: 002932
scope note: 運営会社: 東日本旅客鉄道。路線名: 成田線。鉄道区分: 普通鉄道JR（11）。事業者種別: JR在来線（2）。

浦和美園
type: Concept
alternative label: 浦和美園（埼玉高速鉄道 埼玉高速鉄道線）
broader: g002933
in scheme: scheme
notation: 002933
scope note: 運営会社: 埼玉高速鉄道。路線名: 埼玉高速鉄道線。鉄道区分: 普通鉄道（12）。事業者種別: 第三セクター（5）。

さいたま新都心
type: Concept
alternative label: さいたま新都心（東日本旅客鉄道 東北線）
broader: g002934
in scheme: scheme
notation: 002934
scope note: 運営会社: 東日本旅客鉄道。路線名: 東北線。鉄道区分: 普通鉄道JR（11）。事業者種別: JR在来線（2）。

柏の葉キャンパス
type: Concept
alternative label: 柏の葉キャンパス（首都圏新都市鉄道 常磐新線）
broader: g002935
in scheme: scheme
notation: 002935
scope note: 運営会社: 首都圏新都市鉄道。路線名: 常磐新線。鉄道区分: 普通鉄道（12）。事業者種別: 第三セクター（5）。

東吾野
type: Concept
alternative label: 東吾野（西武鉄道 池袋線）
broader: g002936
in scheme: scheme
notation: 002936
scope note: 運営会社: 西武鉄道。路線名: 池袋線。鉄道区分: 普通鉄道（12）。事業者種別: 民営鉄道（4）。

新河岸
type: Concept
alternative label: 新河岸（東武鉄道 東上本線）
broader: g002937
in scheme: scheme
notation: 002937
scope note: 運営会社: 東武鉄道。路線名: 東上本線。鉄道区分: 普通鉄道（12）。事業者種別: 民営鉄道（4）。

北与野
type: Concept
alternative label: 北与野（東日本旅客鉄道 東北線）
broader: g002938
in scheme: scheme
notation: 002938
scope note: 運営会社: 東日本旅客鉄道。路線名: 東北線。鉄道区分: 普通鉄道JR（11）。事業者種別: JR在来線（2）。

大戸
type: Concept
alternative label: 大戸（東日本旅客鉄道 成田線）
broader: g002939
in scheme: scheme
notation: 002939
scope note: 運営会社: 東日本旅客鉄道。路線名: 成田線。鉄道区分: 普通鉄道JR（11）。事業者種別: JR在来線（2）。

南大塚
type: Concept
alternative label: 南大塚（西武鉄道 新宿線）
broader: g002940
in scheme: scheme
notation: 002940
scope note: 運営会社: 西武鉄道。路線名: 新宿線。鉄道区分: 普通鉄道（12）。事業者種別: 民営鉄道（4）。

宮ノ越
type: Concept
alternative label: 宮ノ越（東海旅客鉄道 中央線）
broader: g002941
in scheme: scheme
notation: 002941
scope note: 運営会社: 東海旅客鉄道。路線名: 中央線。鉄道区分: 普通鉄道JR（11）。事業者種別: JR在来線（2）。

越谷
type: Concept
alternative label: 越谷（東武鉄道 伊勢崎線）
broader: g002942
in scheme: scheme
notation: 002942
scope note: 運営会社: 東武鉄道。路線名: 伊勢崎線。鉄道区分: 普通鉄道（12）。事業者種別: 民営鉄道（4）。

水郷
type: Concept
alternative label: 水郷（東日本旅客鉄道 成田線）
broader: g002943
in scheme: scheme
notation: 002943
scope note: 運営会社: 東日本旅客鉄道。路線名: 成田線。鉄道区分: 普通鉄道JR（11）。事業者種別: JR在来線（2）。

美濃白鳥
type: Concept
alternative label: 美濃白鳥（長良川鉄道 越美南線）
broader: g002944
in scheme: scheme
notation: 002944
scope note: 運営会社: 長良川鉄道。路線名: 越美南線。鉄道区分: 普通鉄道（12）。事業者種別: 第三セクター（5）。

武蔵横手
type: Concept
alternative label: 武蔵横手（西武鉄道 池袋線）
broader: g002945
in scheme: scheme
notation: 002945
scope note: 運営会社: 西武鉄道。路線名: 池袋線。鉄道区分: 普通鉄道（12）。事業者種別: 民営鉄道（4）。

信濃境
type: Concept
alternative label: 信濃境（東日本旅客鉄道 中央線）
broader: g002946
in scheme: scheme
notation: 002946
scope note: 運営会社: 東日本旅客鉄道。路線名: 中央線。鉄道区分: 普通鉄道JR（11）。事業者種別: JR在来線（2）。

与野
type: Concept
alternative label: 与野（東日本旅客鉄道 東北線）
broader: g002947
in scheme: scheme
notation: 002947
scope note: 運営会社: 東日本旅客鉄道。路線名: 東北線。鉄道区分: 普通鉄道JR（11）。事業者種別: JR在来線（2）。

与野
type: Concept
alternative label: 与野（東日本旅客鉄道 武蔵野線）
broader: g002947
in scheme: scheme
notation: 002948
scope note: 運営会社: 東日本旅客鉄道。路線名: 武蔵野線。鉄道区分: 普通鉄道JR（11）。事業者種別: JR在来線（2）。

初石
type: Concept
alternative label: 初石（東武鉄道 野田線）
broader: g002949
in scheme: scheme
notation: 002949
scope note: 運営会社: 東武鉄道。路線名: 野田線。鉄道区分: 普通鉄道（12）。事業者種別: 民営鉄道（4）。

高麗
type: Concept
alternative label: 高麗（西武鉄道 池袋線）
broader: g002950
in scheme: scheme
notation: 002950
scope note: 運営会社: 西武鉄道。路線名: 池袋線。鉄道区分: 普通鉄道（12）。事業者種別: 民営鉄道（4）。

与野本町
type: Concept
alternative label: 与野本町（東日本旅客鉄道 東北線）
broader: g002951
in scheme: scheme
notation: 002951
scope note: 運営会社: 東日本旅客鉄道。路線名: 東北線。鉄道区分: 普通鉄道JR（11）。事業者種別: JR在来線（2）。

甲斐小泉
type: Concept
alternative label: 甲斐小泉（東日本旅客鉄道 小海線）
broader: g002952
in scheme: scheme
notation: 002952
scope note: 運営会社: 東日本旅客鉄道。路線名: 小海線。鉄道区分: 普通鉄道JR（11）。事業者種別: JR在来線（2）。

北殿
type: Concept
alternative label: 北殿（東海旅客鉄道 飯田線）
broader: g002953
in scheme: scheme
notation: 002953
scope note: 運営会社: 東海旅客鉄道。路線名: 飯田線。鉄道区分: 普通鉄道JR（11）。事業者種別: JR在来線（2）。

滑河
type: Concept
alternative label: 滑河（東日本旅客鉄道 成田線）
broader: g002954
in scheme: scheme
notation: 002954
scope note: 運営会社: 東日本旅客鉄道。路線名: 成田線。鉄道区分: 普通鉄道JR（11）。事業者種別: JR在来線（2）。

吉川
type: Concept
alternative label: 吉川（東日本旅客鉄道 武蔵野線）
broader: g002955
in scheme: scheme
notation: 002955
scope note: 運営会社: 東日本旅客鉄道。路線名: 武蔵野線。鉄道区分: 普通鉄道JR（11）。事業者種別: JR在来線（2）。

東川口
type: Concept
alternative label: 東川口（埼玉高速鉄道 埼玉高速鉄道線）
broader: g002956
in scheme: scheme
notation: 002956
scope note: 運営会社: 埼玉高速鉄道。路線名: 埼玉高速鉄道線。鉄道区分: 普通鉄道（12）。事業者種別: 第三セクター（5）。

越谷レイクタウン
type: Concept
alternative label: 越谷レイクタウン（東日本旅客鉄道 武蔵野線）
broader: g002957
in scheme: scheme
notation: 002957
scope note: 運営会社: 東日本旅客鉄道。路線名: 武蔵野線。鉄道区分: 普通鉄道JR（11）。事業者種別: JR在来線（2）。

南越谷
type: Concept
alternative label: 南越谷（東日本旅客鉄道 武蔵野線）
broader: g002958
in scheme: scheme
notation: 002958
scope note: 運営会社: 東日本旅客鉄道。路線名: 武蔵野線。鉄道区分: 普通鉄道JR（11）。事業者種別: JR在来線（2）。

北柏
type: Concept
alternative label: 北柏（東日本旅客鉄道 常磐線）
broader: g002959
in scheme: scheme
notation: 002959
scope note: 運営会社: 東日本旅客鉄道。路線名: 常磐線。鉄道区分: 普通鉄道JR（11）。事業者種別: JR在来線（2）。

新越谷
type: Concept
alternative label: 新越谷（東武鉄道 伊勢崎線）
broader: g002960
in scheme: scheme
notation: 002960
scope note: 運営会社: 東武鉄道。路線名: 伊勢崎線。鉄道区分: 普通鉄道（12）。事業者種別: 民営鉄道（4）。

東川口
type: Concept
alternative label: 東川口（東日本旅客鉄道 武蔵野線）
broader: g002956
in scheme: scheme
notation: 002961
scope note: 運営会社: 東日本旅客鉄道。路線名: 武蔵野線。鉄道区分: 普通鉄道JR（11）。事業者種別: JR在来線（2）。

飛騨萩原
type: Concept
alternative label: 飛騨萩原（東海旅客鉄道 高山線）
broader: g002962
in scheme: scheme
notation: 002962
scope note: 運営会社: 東海旅客鉄道。路線名: 高山線。鉄道区分: 普通鉄道JR（11）。事業者種別: JR在来線（2）。

新狭山
type: Concept
alternative label: 新狭山（西武鉄道 新宿線）
broader: g002963
in scheme: scheme
notation: 002963
scope note: 運営会社: 西武鉄道。路線名: 新宿線。鉄道区分: 普通鉄道（12）。事業者種別: 民営鉄道（4）。

上福岡
type: Concept
alternative label: 上福岡（東武鉄道 東上本線）
broader: g002964
in scheme: scheme
notation: 002964
scope note: 運営会社: 東武鉄道。路線名: 東上本線。鉄道区分: 普通鉄道（12）。事業者種別: 民営鉄道（4）。

我孫子
type: Concept
alternative label: 我孫子（東日本旅客鉄道 常磐線）
broader: g002965
in scheme: scheme
notation: 002965
scope note: 運営会社: 東日本旅客鉄道。路線名: 常磐線。鉄道区分: 普通鉄道JR（11）。事業者種別: JR在来線（2）。

我孫子
type: Concept
alternative label: 我孫子（東日本旅客鉄道 成田線）
broader: g002965
in scheme: scheme
notation: 002966
scope note: 運営会社: 東日本旅客鉄道。路線名: 成田線。鉄道区分: 普通鉄道JR（11）。事業者種別: JR在来線（2）。

天王台
type: Concept
alternative label: 天王台（東日本旅客鉄道 常磐線）
broader: g002967
in scheme: scheme
notation: 002967
scope note: 運営会社: 東日本旅客鉄道。路線名: 常磐線。鉄道区分: 普通鉄道JR（11）。事業者種別: JR在来線（2）。

北浦和
type: Concept
alternative label: 北浦和（東日本旅客鉄道 東北線）
broader: g002968
in scheme: scheme
notation: 002968
scope note: 運営会社: 東日本旅客鉄道。路線名: 東北線。鉄道区分: 普通鉄道JR（11）。事業者種別: JR在来線（2）。

流山おおたかの森
type: Concept
alternative label: 流山おおたかの森（東武鉄道 野田線）
broader: g002969
in scheme: scheme
notation: 002969
scope note: 運営会社: 東武鉄道。路線名: 野田線。鉄道区分: 普通鉄道（12）。事業者種別: 民営鉄道（4）。

流山おおたかの森
type: Concept
alternative label: 流山おおたかの森（首都圏新都市鉄道 常磐新線）
broader: g002969
in scheme: scheme
notation: 002970
scope note: 運営会社: 首都圏新都市鉄道。路線名: 常磐新線。鉄道区分: 普通鉄道（12）。事業者種別: 第三セクター（5）。

原野
type: Concept
alternative label: 原野（東海旅客鉄道 中央線）
broader: g002971
in scheme: scheme
notation: 002971
scope note: 運営会社: 東海旅客鉄道。路線名: 中央線。鉄道区分: 普通鉄道JR（11）。事業者種別: JR在来線（2）。

東我孫子
type: Concept
alternative label: 東我孫子（東日本旅客鉄道 成田線）
broader: g002972
in scheme: scheme
notation: 002972
scope note: 運営会社: 東日本旅客鉄道。路線名: 成田線。鉄道区分: 普通鉄道JR（11）。事業者種別: JR在来線（2）。

大島
type: Concept
alternative label: 大島（長良川鉄道 越美南線）
broader: g002973
in scheme: scheme
notation: 002973
scope note: 運営会社: 長良川鉄道。路線名: 越美南線。鉄道区分: 普通鉄道（12）。事業者種別: 第三セクター（5）。

吉川美南
type: Concept
alternative label: 吉川美南（東日本旅客鉄道 武蔵野線）
broader: g002974
in scheme: scheme
notation: 002974
scope note: 運営会社: 東日本旅客鉄道。路線名: 武蔵野線。鉄道区分: 普通鉄道JR（11）。事業者種別: JR在来線（2）。

南与野
type: Concept
alternative label: 南与野（東日本旅客鉄道 東北線）
broader: g002975
in scheme: scheme
notation: 002975
scope note: 運営会社: 東日本旅客鉄道。路線名: 東北線。鉄道区分: 普通鉄道JR（11）。事業者種別: JR在来線（2）。

湖北
type: Concept
alternative label: 湖北（東日本旅客鉄道 成田線）
broader: g002976
in scheme: scheme
notation: 002976
scope note: 運営会社: 東日本旅客鉄道。路線名: 成田線。鉄道区分: 普通鉄道JR（11）。事業者種別: JR在来線（2）。

蒲生
type: Concept
alternative label: 蒲生（東武鉄道 伊勢崎線）
broader: g002977
in scheme: scheme
notation: 002977
scope note: 運営会社: 東武鉄道。路線名: 伊勢崎線。鉄道区分: 普通鉄道（12）。事業者種別: 民営鉄道（4）。

豊四季
type: Concept
alternative label: 豊四季（東武鉄道 野田線）
broader: g002978
in scheme: scheme
notation: 002978
scope note: 運営会社: 東武鉄道。路線名: 野田線。鉄道区分: 普通鉄道（12）。事業者種別: 民営鉄道（4）。

王子保
type: Concept
alternative label: 王子保（ハピラインふくい ハピラインふくい線）
broader: g002979
in scheme: scheme
notation: 002979
scope note: 運営会社: ハピラインふくい。路線名: ハピラインふくい線。鉄道区分: 普通鉄道（12）。事業者種別: 第三セクター（5）。

東浦和
type: Concept
alternative label: 東浦和（東日本旅客鉄道 武蔵野線）
broader: g002980
in scheme: scheme
notation: 002980
scope note: 運営会社: 東日本旅客鉄道。路線名: 武蔵野線。鉄道区分: 普通鉄道JR（11）。事業者種別: JR在来線（2）。

小淵沢
type: Concept
alternative label: 小淵沢（東日本旅客鉄道 小海線）
broader: g002981
in scheme: scheme
notation: 002981
scope note: 運営会社: 東日本旅客鉄道。路線名: 小海線。鉄道区分: 普通鉄道JR（11）。事業者種別: JR在来線（2）。

小淵沢
type: Concept
alternative label: 小淵沢（東日本旅客鉄道 中央線）
broader: g002981
in scheme: scheme
notation: 002982
scope note: 運営会社: 東日本旅客鉄道。路線名: 中央線。鉄道区分: 普通鉄道JR（11）。事業者種別: JR在来線（2）。

新木
type: Concept
alternative label: 新木（東日本旅客鉄道 成田線）
broader: g002983
in scheme: scheme
notation: 002983
scope note: 運営会社: 東日本旅客鉄道。路線名: 成田線。鉄道区分: 普通鉄道JR（11）。事業者種別: JR在来線（2）。

柏
type: Concept
alternative label: 柏（東日本旅客鉄道 常磐線）
broader: g002984
in scheme: scheme
notation: 002984
scope note: 運営会社: 東日本旅客鉄道。路線名: 常磐線。鉄道区分: 普通鉄道JR（11）。事業者種別: JR在来線（2）。

柏
type: Concept
alternative label: 柏（東武鉄道 野田線）
broader: g002984
in scheme: scheme
notation: 002985
scope note: 運営会社: 東武鉄道。路線名: 野田線。鉄道区分: 普通鉄道（12）。事業者種別: 民営鉄道（4）。

田畑
type: Concept
alternative label: 田畑（東海旅客鉄道 飯田線）
broader: g002986
in scheme: scheme
notation: 002986
scope note: 運営会社: 東海旅客鉄道。路線名: 飯田線。鉄道区分: 普通鉄道JR（11）。事業者種別: JR在来線（2）。

ふじみ野
type: Concept
alternative label: ふじみ野（東武鉄道 東上本線）
broader: g002987
in scheme: scheme
notation: 002987
scope note: 運営会社: 東武鉄道。路線名: 東上本線。鉄道区分: 普通鉄道（12）。事業者種別: 民営鉄道（4）。

戸塚安行
type: Concept
alternative label: 戸塚安行（埼玉高速鉄道 埼玉高速鉄道線）
broader: g002988
in scheme: scheme
notation: 002988
scope note: 運営会社: 埼玉高速鉄道。路線名: 埼玉高速鉄道線。鉄道区分: 普通鉄道（12）。事業者種別: 第三セクター（5）。

浦和
type: Concept
alternative label: 浦和（東日本旅客鉄道 東北線）
broader: g002989
in scheme: scheme
notation: 002989
scope note: 運営会社: 東日本旅客鉄道。路線名: 東北線。鉄道区分: 普通鉄道JR（11）。事業者種別: JR在来線（2）。

新三郷
type: Concept
alternative label: 新三郷（東日本旅客鉄道 武蔵野線）
broader: g002990
in scheme: scheme
notation: 002990
scope note: 運営会社: 東日本旅客鉄道。路線名: 武蔵野線。鉄道区分: 普通鉄道JR（11）。事業者種別: JR在来線（2）。

狭山市
type: Concept
alternative label: 狭山市（西武鉄道 新宿線）
broader: g002991
in scheme: scheme
notation: 002991
scope note: 運営会社: 西武鉄道。路線名: 新宿線。鉄道区分: 普通鉄道（12）。事業者種別: 民営鉄道（4）。

流山
type: Concept
alternative label: 流山（流鉄 流山線）
broader: g002992
in scheme: scheme
notation: 002992
scope note: 運営会社: 流鉄。路線名: 流山線。鉄道区分: 普通鉄道（12）。事業者種別: 民営鉄道（4）。

流山セントラルパーク
type: Concept
alternative label: 流山セントラルパーク（首都圏新都市鉄道 常磐新線）
broader: g002993
in scheme: scheme
notation: 002993
scope note: 運営会社: 首都圏新都市鉄道。路線名: 常磐新線。鉄道区分: 普通鉄道（12）。事業者種別: 第三セクター（5）。

新田
type: Concept
alternative label: 新田（東武鉄道 伊勢崎線）
broader: g002994
in scheme: scheme
notation: 002994
scope note: 運営会社: 東武鉄道。路線名: 伊勢崎線。鉄道区分: 普通鉄道（12）。事業者種別: 民営鉄道（4）。

中浦和
type: Concept
alternative label: 中浦和（東日本旅客鉄道 東北線）
broader: g002995
in scheme: scheme
notation: 002995
scope note: 運営会社: 東日本旅客鉄道。路線名: 東北線。鉄道区分: 普通鉄道JR（11）。事業者種別: JR在来線（2）。

大中
type: Concept
alternative label: 大中（長良川鉄道 越美南線）
broader: g002996
in scheme: scheme
notation: 002996
scope note: 運営会社: 長良川鉄道。路線名: 越美南線。鉄道区分: 普通鉄道（12）。事業者種別: 第三セクター（5）。

東飯能
type: Concept
alternative label: 東飯能（東日本旅客鉄道 八高線）
broader: g002997
in scheme: scheme
notation: 002997
scope note: 運営会社: 東日本旅客鉄道。路線名: 八高線。鉄道区分: 普通鉄道JR（11）。事業者種別: JR在来線（2）。

東飯能
type: Concept
alternative label: 東飯能（西武鉄道 池袋線）
broader: g002997
in scheme: scheme
notation: 002998
scope note: 運営会社: 西武鉄道。路線名: 池袋線。鉄道区分: 普通鉄道（12）。事業者種別: 民営鉄道（4）。

飯能
type: Concept
alternative label: 飯能（西武鉄道 池袋線）
broader: g002999
in scheme: scheme
notation: 002999
scope note: 運営会社: 西武鉄道。路線名: 池袋線。鉄道区分: 普通鉄道（12）。事業者種別: 民営鉄道（4）。

平和台
type: Concept
alternative label: 平和台（流鉄 流山線）
broader: g003000
in scheme: scheme
notation: 003000
scope note: 運営会社: 流鉄。路線名: 流山線。鉄道区分: 普通鉄道（12）。事業者種別: 民営鉄道（4）。

小見川
type: Concept
alternative label: 小見川（東日本旅客鉄道 成田線）
broader: g003001
in scheme: scheme
notation: 003001
scope note: 運営会社: 東日本旅客鉄道。路線名: 成田線。鉄道区分: 普通鉄道JR（11）。事業者種別: JR在来線（2）。

布佐
type: Concept
alternative label: 布佐（東日本旅客鉄道 成田線）
broader: g003002
in scheme: scheme
notation: 003002
scope note: 運営会社: 東日本旅客鉄道。路線名: 成田線。鉄道区分: 普通鉄道JR（11）。事業者種別: JR在来線（2）。

禅昌寺
type: Concept
alternative label: 禅昌寺（東海旅客鉄道 高山線）
broader: g003003
in scheme: scheme
notation: 003003
scope note: 運営会社: 東海旅客鉄道。路線名: 高山線。鉄道区分: 普通鉄道JR（11）。事業者種別: JR在来線（2）。

南浦和
type: Concept
alternative label: 南浦和（東日本旅客鉄道 東北線）
broader: g003004
in scheme: scheme
notation: 003004
scope note: 運営会社: 東日本旅客鉄道。路線名: 東北線。鉄道区分: 普通鉄道JR（11）。事業者種別: JR在来線（2）。

南浦和
type: Concept
alternative label: 南浦和（東日本旅客鉄道 武蔵野線）
broader: g003004
in scheme: scheme
notation: 003005
scope note: 運営会社: 東日本旅客鉄道。路線名: 武蔵野線。鉄道区分: 普通鉄道JR（11）。事業者種別: JR在来線（2）。

武蔵浦和
type: Concept
alternative label: 武蔵浦和（東日本旅客鉄道 武蔵野線）
broader: g003006
in scheme: scheme
notation: 003006
scope note: 運営会社: 東日本旅客鉄道。路線名: 武蔵野線。鉄道区分: 普通鉄道JR（11）。事業者種別: JR在来線（2）。

鶴瀬
type: Concept
alternative label: 鶴瀬（東武鉄道 東上本線）
broader: g003007
in scheme: scheme
notation: 003007
scope note: 運営会社: 東武鉄道。路線名: 東上本線。鉄道区分: 普通鉄道（12）。事業者種別: 民営鉄道（4）。

武蔵浦和
type: Concept
alternative label: 武蔵浦和（東日本旅客鉄道 東北線）
broader: g003006
in scheme: scheme
notation: 003008
scope note: 運営会社: 東日本旅客鉄道。路線名: 東北線。鉄道区分: 普通鉄道JR（11）。事業者種別: JR在来線（2）。

伊那北
type: Concept
alternative label: 伊那北（東海旅客鉄道 飯田線）
broader: g003009
in scheme: scheme
notation: 003009
scope note: 運営会社: 東海旅客鉄道。路線名: 飯田線。鉄道区分: 普通鉄道JR（11）。事業者種別: JR在来線（2）。

三郷
type: Concept
alternative label: 三郷（東日本旅客鉄道 武蔵野線）
broader: g003010
in scheme: scheme
notation: 003010
scope note: 運営会社: 東日本旅客鉄道。路線名: 武蔵野線。鉄道区分: 普通鉄道JR（11）。事業者種別: JR在来線（2）。

稲荷山公園
type: Concept
alternative label: 稲荷山公園（西武鉄道 池袋線）
broader: g003011
in scheme: scheme
notation: 003011
scope note: 運営会社: 西武鉄道。路線名: 池袋線。鉄道区分: 普通鉄道（12）。事業者種別: 民営鉄道（4）。

南柏
type: Concept
alternative label: 南柏（東日本旅客鉄道 常磐線）
broader: g003012
in scheme: scheme
notation: 003012
scope note: 運営会社: 東日本旅客鉄道。路線名: 常磐線。鉄道区分: 普通鉄道JR（11）。事業者種別: JR在来線（2）。

上万場
type: Concept
alternative label: 上万場（長良川鉄道 越美南線）
broader: g003013
in scheme: scheme
notation: 003013
scope note: 運営会社: 長良川鉄道。路線名: 越美南線。鉄道区分: 普通鉄道（12）。事業者種別: 第三セクター（5）。

西浦和
type: Concept
alternative label: 西浦和（東日本旅客鉄道 武蔵野線）
broader: g003014
in scheme: scheme
notation: 003014
scope note: 運営会社: 東日本旅客鉄道。路線名: 武蔵野線。鉄道区分: 普通鉄道JR（11）。事業者種別: JR在来線（2）。

木曽福島
type: Concept
alternative label: 木曽福島（東海旅客鉄道 中央線）
broader: g003015
in scheme: scheme
notation: 003015
scope note: 運営会社: 東海旅客鉄道。路線名: 中央線。鉄道区分: 普通鉄道JR（11）。事業者種別: JR在来線（2）。

獨協大学前
type: Concept
alternative label: 獨協大学前（東武鉄道 伊勢崎線）
broader: g003016
in scheme: scheme
notation: 003016
scope note: 運営会社: 東武鉄道。路線名: 伊勢崎線。鉄道区分: 普通鉄道（12）。事業者種別: 民営鉄道（4）。

新井宿
type: Concept
alternative label: 新井宿（埼玉高速鉄道 埼玉高速鉄道線）
broader: g003017
in scheme: scheme
notation: 003017
scope note: 運営会社: 埼玉高速鉄道。路線名: 埼玉高速鉄道線。鉄道区分: 普通鉄道（12）。事業者種別: 第三セクター（5）。

入間市
type: Concept
alternative label: 入間市（西武鉄道 池袋線）
broader: g003018
in scheme: scheme
notation: 003018
scope note: 運営会社: 西武鉄道。路線名: 池袋線。鉄道区分: 普通鉄道（12）。事業者種別: 民営鉄道（4）。

鰭ヶ崎
type: Concept
alternative label: 鰭ヶ崎（流鉄 流山線）
broader: g003019
in scheme: scheme
notation: 003019
scope note: 運営会社: 流鉄。路線名: 流山線。鉄道区分: 普通鉄道（12）。事業者種別: 民営鉄道（4）。

元加治
type: Concept
alternative label: 元加治（西武鉄道 池袋線）
broader: g003020
in scheme: scheme
notation: 003020
scope note: 運営会社: 西武鉄道。路線名: 池袋線。鉄道区分: 普通鉄道（12）。事業者種別: 民営鉄道（4）。

笹川
type: Concept
alternative label: 笹川（東日本旅客鉄道 成田線）
broader: g003021
in scheme: scheme
notation: 003021
scope note: 運営会社: 東日本旅客鉄道。路線名: 成田線。鉄道区分: 普通鉄道JR（11）。事業者種別: JR在来線（2）。

木下
type: Concept
alternative label: 木下（東日本旅客鉄道 成田線）
broader: g003022
in scheme: scheme
notation: 003022
scope note: 運営会社: 東日本旅客鉄道。路線名: 成田線。鉄道区分: 普通鉄道JR（11）。事業者種別: JR在来線（2）。

伊那市
type: Concept
alternative label: 伊那市（東海旅客鉄道 飯田線）
broader: g003023
in scheme: scheme
notation: 003023
scope note: 運営会社: 東海旅客鉄道。路線名: 飯田線。鉄道区分: 普通鉄道JR（11）。事業者種別: JR在来線（2）。

南流山
type: Concept
alternative label: 南流山（首都圏新都市鉄道 常磐新線）
broader: g003024
in scheme: scheme
notation: 003024
scope note: 運営会社: 首都圏新都市鉄道。路線名: 常磐新線。鉄道区分: 普通鉄道（12）。事業者種別: 第三セクター（5）。

みずほ台
type: Concept
alternative label: みずほ台（東武鉄道 東上本線）
broader: g003025
in scheme: scheme
notation: 003025
scope note: 運営会社: 東武鉄道。路線名: 東上本線。鉄道区分: 普通鉄道（12）。事業者種別: 民営鉄道（4）。

新柏
type: Concept
alternative label: 新柏（東武鉄道 野田線）
broader: g003026
in scheme: scheme
notation: 003026
scope note: 運営会社: 東武鉄道。路線名: 野田線。鉄道区分: 普通鉄道（12）。事業者種別: 民営鉄道（4）。

南流山
type: Concept
alternative label: 南流山（東日本旅客鉄道 武蔵野線）
broader: g003024
in scheme: scheme
notation: 003027
scope note: 運営会社: 東日本旅客鉄道。路線名: 武蔵野線。鉄道区分: 普通鉄道JR（11）。事業者種別: JR在来線（2）。

仏子
type: Concept
alternative label: 仏子（西武鉄道 池袋線）
broader: g003028
in scheme: scheme
notation: 003028
scope note: 運営会社: 西武鉄道。路線名: 池袋線。鉄道区分: 普通鉄道（12）。事業者種別: 民営鉄道（4）。

小金城趾
type: Concept
alternative label: 小金城趾（流鉄 流山線）
broader: g003029
in scheme: scheme
notation: 003029
scope note: 運営会社: 流鉄。路線名: 流山線。鉄道区分: 普通鉄道（12）。事業者種別: 民営鉄道（4）。

安食
type: Concept
alternative label: 安食（東日本旅客鉄道 成田線）
broader: g003030
in scheme: scheme
notation: 003030
scope note: 運営会社: 東日本旅客鉄道。路線名: 成田線。鉄道区分: 普通鉄道JR（11）。事業者種別: JR在来線（2）。

万場
type: Concept
alternative label: 万場（長良川鉄道 越美南線）
broader: g003031
in scheme: scheme
notation: 003031
scope note: 運営会社: 長良川鉄道。路線名: 越美南線。鉄道区分: 普通鉄道（12）。事業者種別: 第三セクター（5）。

北小金
type: Concept
alternative label: 北小金（東日本旅客鉄道 常磐線）
broader: g003032
in scheme: scheme
notation: 003032
scope note: 運営会社: 東日本旅客鉄道。路線名: 常磐線。鉄道区分: 普通鉄道JR（11）。事業者種別: JR在来線（2）。

入曽
type: Concept
alternative label: 入曽（西武鉄道 新宿線）
broader: g003033
in scheme: scheme
notation: 003033
scope note: 運営会社: 西武鉄道。路線名: 新宿線。鉄道区分: 普通鉄道（12）。事業者種別: 民営鉄道（4）。

久住
type: Concept
alternative label: 久住（東日本旅客鉄道 成田線）
broader: g003034
in scheme: scheme
notation: 003034
scope note: 運営会社: 東日本旅客鉄道。路線名: 成田線。鉄道区分: 普通鉄道JR（11）。事業者種別: JR在来線（2）。

南条
type: Concept
alternative label: 南条（ハピラインふくい ハピラインふくい線）
broader: g003035
in scheme: scheme
notation: 003035
scope note: 運営会社: ハピラインふくい。路線名: ハピラインふくい線。鉄道区分: 普通鉄道（12）。事業者種別: 第三セクター（5）。

鳩ヶ谷
type: Concept
alternative label: 鳩ヶ谷（埼玉高速鉄道 埼玉高速鉄道線）
broader: g003036
in scheme: scheme
notation: 003036
scope note: 運営会社: 埼玉高速鉄道。路線名: 埼玉高速鉄道線。鉄道区分: 普通鉄道（12）。事業者種別: 第三セクター（5）。

小林
type: Concept
alternative label: 小林（東日本旅客鉄道 成田線）
broader: g003037
in scheme: scheme
notation: 003037
scope note: 運営会社: 東日本旅客鉄道。路線名: 成田線。鉄道区分: 普通鉄道JR（11）。事業者種別: JR在来線（2）。

柳瀬川
type: Concept
alternative label: 柳瀬川（東武鉄道 東上本線）
broader: g003038
in scheme: scheme
notation: 003038
scope note: 運営会社: 東武鉄道。路線名: 東上本線。鉄道区分: 普通鉄道（12）。事業者種別: 民営鉄道（4）。

増尾
type: Concept
alternative label: 増尾（東武鉄道 野田線）
broader: g003039
in scheme: scheme
notation: 003039
scope note: 運営会社: 東武鉄道。路線名: 野田線。鉄道区分: 普通鉄道（12）。事業者種別: 民営鉄道（4）。

草加
type: Concept
alternative label: 草加（東武鉄道 伊勢崎線）
broader: g003040
in scheme: scheme
notation: 003040
scope note: 運営会社: 東武鉄道。路線名: 伊勢崎線。鉄道区分: 普通鉄道（12）。事業者種別: 民営鉄道（4）。

蕨
type: Concept
alternative label: 蕨（東日本旅客鉄道 東北線）
broader: g003041
in scheme: scheme
notation: 003041
scope note: 運営会社: 東日本旅客鉄道。路線名: 東北線。鉄道区分: 普通鉄道JR（11）。事業者種別: JR在来線（2）。

長坂
type: Concept
alternative label: 長坂（東日本旅客鉄道 中央線）
broader: g003042
in scheme: scheme
notation: 003042
scope note: 運営会社: 東日本旅客鉄道。路線名: 中央線。鉄道区分: 普通鉄道JR（11）。事業者種別: JR在来線（2）。

幸谷
type: Concept
alternative label: 幸谷（流鉄 流山線）
broader: g003043
in scheme: scheme
notation: 003043
scope note: 運営会社: 流鉄。路線名: 流山線。鉄道区分: 普通鉄道（12）。事業者種別: 民営鉄道（4）。

北戸田
type: Concept
alternative label: 北戸田（東日本旅客鉄道 東北線）
broader: g003044
in scheme: scheme
notation: 003044
scope note: 運営会社: 東日本旅客鉄道。路線名: 東北線。鉄道区分: 普通鉄道JR（11）。事業者種別: JR在来線（2）。

新松戸
type: Concept
alternative label: 新松戸（東日本旅客鉄道 武蔵野線）
broader: g003045
in scheme: scheme
notation: 003045
scope note: 運営会社: 東日本旅客鉄道。路線名: 武蔵野線。鉄道区分: 普通鉄道JR（11）。事業者種別: JR在来線（2）。

新松戸
type: Concept
alternative label: 新松戸（東日本旅客鉄道 常磐線）
broader: g003045
in scheme: scheme
notation: 003046
scope note: 運営会社: 東日本旅客鉄道。路線名: 常磐線。鉄道区分: 普通鉄道JR（11）。事業者種別: JR在来線（2）。

三郷中央
type: Concept
alternative label: 三郷中央（首都圏新都市鉄道 常磐新線）
broader: g003047
in scheme: scheme
notation: 003047
scope note: 運営会社: 首都圏新都市鉄道。路線名: 常磐新線。鉄道区分: 普通鉄道（12）。事業者種別: 第三セクター（5）。

逆井
type: Concept
alternative label: 逆井（東武鉄道 野田線）
broader: g003048
in scheme: scheme
notation: 003048
scope note: 運営会社: 東武鉄道。路線名: 野田線。鉄道区分: 普通鉄道（12）。事業者種別: 民営鉄道（4）。

志木
type: Concept
alternative label: 志木（東武鉄道 東上本線）
broader: g003049
in scheme: scheme
notation: 003049
scope note: 運営会社: 東武鉄道。路線名: 東上本線。鉄道区分: 普通鉄道（12）。事業者種別: 民営鉄道（4）。

武蔵藤沢
type: Concept
alternative label: 武蔵藤沢（西武鉄道 池袋線）
broader: g003050
in scheme: scheme
notation: 003050
scope note: 運営会社: 西武鉄道。路線名: 池袋線。鉄道区分: 普通鉄道（12）。事業者種別: 民営鉄道（4）。

下総橘
type: Concept
alternative label: 下総橘（東日本旅客鉄道 成田線）
broader: g003051
in scheme: scheme
notation: 003051
scope note: 運営会社: 東日本旅客鉄道。路線名: 成田線。鉄道区分: 普通鉄道JR（11）。事業者種別: JR在来線（2）。

戸田
type: Concept
alternative label: 戸田（東日本旅客鉄道 東北線）
broader: g003052
in scheme: scheme
notation: 003052
scope note: 運営会社: 東日本旅客鉄道。路線名: 東北線。鉄道区分: 普通鉄道JR（11）。事業者種別: JR在来線（2）。

古里
type: Concept
alternative label: 古里（東日本旅客鉄道 青梅線）
broader: g003053
in scheme: scheme
notation: 003053
scope note: 運営会社: 東日本旅客鉄道。路線名: 青梅線。鉄道区分: 普通鉄道JR（11）。事業者種別: JR在来線（2）。

南鳩ヶ谷
type: Concept
alternative label: 南鳩ヶ谷（埼玉高速鉄道 埼玉高速鉄道線）
broader: g003054
in scheme: scheme
notation: 003054
scope note: 運営会社: 埼玉高速鉄道。路線名: 埼玉高速鉄道線。鉄道区分: 普通鉄道（12）。事業者種別: 第三セクター（5）。

西川口
type: Concept
alternative label: 西川口（東日本旅客鉄道 東北線）
broader: g003055
in scheme: scheme
notation: 003055
scope note: 運営会社: 東日本旅客鉄道。路線名: 東北線。鉄道区分: 普通鉄道JR（11）。事業者種別: JR在来線（2）。

北朝霞
type: Concept
alternative label: 北朝霞（東日本旅客鉄道 武蔵野線）
broader: g003056
in scheme: scheme
notation: 003056
scope note: 運営会社: 東日本旅客鉄道。路線名: 武蔵野線。鉄道区分: 普通鉄道JR（11）。事業者種別: JR在来線（2）。

郡上大和
type: Concept
alternative label: 郡上大和（長良川鉄道 越美南線）
broader: g003057
in scheme: scheme
notation: 003057
scope note: 運営会社: 長良川鉄道。路線名: 越美南線。鉄道区分: 普通鉄道（12）。事業者種別: 第三セクター（5）。

鳩ノ巣
type: Concept
alternative label: 鳩ノ巣（東日本旅客鉄道 青梅線）
broader: g003058
in scheme: scheme
notation: 003058
scope note: 運営会社: 東日本旅客鉄道。路線名: 青梅線。鉄道区分: 普通鉄道JR（11）。事業者種別: JR在来線（2）。

谷塚
type: Concept
alternative label: 谷塚（東武鉄道 伊勢崎線）
broader: g003059
in scheme: scheme
notation: 003059
scope note: 運営会社: 東武鉄道。路線名: 伊勢崎線。鉄道区分: 普通鉄道（12）。事業者種別: 民営鉄道（4）。

見沼代親水公園
type: Concept
alternative label: 見沼代親水公園（東京都 日暮里・舎人ライナー）
broader: g003060
in scheme: scheme
notation: 003060
scope note: 運営会社: 東京都。路線名: 日暮里・舎人ライナー。鉄道区分: 案内軌条式（24）。事業者種別: 公営鉄道（3）。

朝霞台
type: Concept
alternative label: 朝霞台（東武鉄道 東上本線）
broader: g003061
in scheme: scheme
notation: 003061
scope note: 運営会社: 東武鉄道。路線名: 東上本線。鉄道区分: 普通鉄道（12）。事業者種別: 民営鉄道（4）。

川井
type: Concept
alternative label: 川井（東日本旅客鉄道 青梅線）
broader: g003062
in scheme: scheme
notation: 003062
scope note: 運営会社: 東日本旅客鉄道。路線名: 青梅線。鉄道区分: 普通鉄道JR（11）。事業者種別: JR在来線（2）。

下島
type: Concept
alternative label: 下島（東海旅客鉄道 飯田線）
broader: g003063
in scheme: scheme
notation: 003063
scope note: 運営会社: 東海旅客鉄道。路線名: 飯田線。鉄道区分: 普通鉄道JR（11）。事業者種別: JR在来線（2）。

馬橋
type: Concept
alternative label: 馬橋（流鉄 流山線）
broader: g003064
in scheme: scheme
notation: 003064
scope note: 運営会社: 流鉄。路線名: 流山線。鉄道区分: 普通鉄道（12）。事業者種別: 民営鉄道（4）。

白丸
type: Concept
alternative label: 白丸（東日本旅客鉄道 青梅線）
broader: g003065
in scheme: scheme
notation: 003065
scope note: 運営会社: 東日本旅客鉄道。路線名: 青梅線。鉄道区分: 普通鉄道JR（11）。事業者種別: JR在来線（2）。

馬橋
type: Concept
alternative label: 馬橋（東日本旅客鉄道 常磐線）
broader: g003064
in scheme: scheme
notation: 003066
scope note: 運営会社: 東日本旅客鉄道。路線名: 常磐線。鉄道区分: 普通鉄道JR（11）。事業者種別: JR在来線（2）。

金子
type: Concept
alternative label: 金子（東日本旅客鉄道 八高線）
broader: g003067
in scheme: scheme
notation: 003067
scope note: 運営会社: 東日本旅客鉄道。路線名: 八高線。鉄道区分: 普通鉄道JR（11）。事業者種別: JR在来線（2）。

狭山ヶ丘
type: Concept
alternative label: 狭山ヶ丘（西武鉄道 池袋線）
broader: g003068
in scheme: scheme
notation: 003068
scope note: 運営会社: 西武鉄道。路線名: 池袋線。鉄道区分: 普通鉄道（12）。事業者種別: 民営鉄道（4）。

奥多摩
type: Concept
alternative label: 奥多摩（東日本旅客鉄道 青梅線）
broader: g003069
in scheme: scheme
notation: 003069
scope note: 運営会社: 東日本旅客鉄道。路線名: 青梅線。鉄道区分: 普通鉄道JR（11）。事業者種別: JR在来線（2）。

高柳
type: Concept
alternative label: 高柳（東武鉄道 野田線）
broader: g003070
in scheme: scheme
notation: 003070
scope note: 運営会社: 東武鉄道。路線名: 野田線。鉄道区分: 普通鉄道（12）。事業者種別: 民営鉄道（4）。

下総松崎
type: Concept
alternative label: 下総松崎（東日本旅客鉄道 成田線）
broader: g003071
in scheme: scheme
notation: 003071
scope note: 運営会社: 東日本旅客鉄道。路線名: 成田線。鉄道区分: 普通鉄道JR（11）。事業者種別: JR在来線（2）。

戸田公園
type: Concept
alternative label: 戸田公園（東日本旅客鉄道 東北線）
broader: g003072
in scheme: scheme
notation: 003072
scope note: 運営会社: 東日本旅客鉄道。路線名: 東北線。鉄道区分: 普通鉄道JR（11）。事業者種別: JR在来線（2）。

八潮
type: Concept
alternative label: 八潮（首都圏新都市鉄道 常磐新線）
broader: g003073
in scheme: scheme
notation: 003073
scope note: 運営会社: 首都圏新都市鉄道。路線名: 常磐新線。鉄道区分: 普通鉄道（12）。事業者種別: 第三セクター（5）。

軍畑
type: Concept
alternative label: 軍畑（東日本旅客鉄道 青梅線）
broader: g003074
in scheme: scheme
notation: 003074
scope note: 運営会社: 東日本旅客鉄道。路線名: 青梅線。鉄道区分: 普通鉄道JR（11）。事業者種別: JR在来線（2）。

下呂
type: Concept
alternative label: 下呂（東海旅客鉄道 高山線）
broader: g003075
in scheme: scheme
notation: 003075
scope note: 運営会社: 東海旅客鉄道。路線名: 高山線。鉄道区分: 普通鉄道JR（11）。事業者種別: JR在来線（2）。

沢井
type: Concept
alternative label: 沢井（東日本旅客鉄道 青梅線）
broader: g003076
in scheme: scheme
notation: 003076
scope note: 運営会社: 東日本旅客鉄道。路線名: 青梅線。鉄道区分: 普通鉄道JR（11）。事業者種別: JR在来線（2）。

新所沢
type: Concept
alternative label: 新所沢（西武鉄道 新宿線）
broader: g003077
in scheme: scheme
notation: 003077
scope note: 運営会社: 西武鉄道。路線名: 新宿線。鉄道区分: 普通鉄道（12）。事業者種別: 民営鉄道（4）。

舎人
type: Concept
alternative label: 舎人（東京都 日暮里・舎人ライナー）
broader: g003078
in scheme: scheme
notation: 003078
scope note: 運営会社: 東京都。路線名: 日暮里・舎人ライナー。鉄道区分: 案内軌条式（24）。事業者種別: 公営鉄道（3）。

徳永
type: Concept
alternative label: 徳永（長良川鉄道 越美南線）
broader: g003079
in scheme: scheme
notation: 003079
scope note: 運営会社: 長良川鉄道。路線名: 越美南線。鉄道区分: 普通鉄道（12）。事業者種別: 第三セクター（5）。

二俣尾
type: Concept
alternative label: 二俣尾（東日本旅客鉄道 青梅線）
broader: g003080
in scheme: scheme
notation: 003080
scope note: 運営会社: 東日本旅客鉄道。路線名: 青梅線。鉄道区分: 普通鉄道JR（11）。事業者種別: JR在来線（2）。

新座
type: Concept
alternative label: 新座（東日本旅客鉄道 武蔵野線）
broader: g003081
in scheme: scheme
notation: 003081
scope note: 運営会社: 東日本旅客鉄道。路線名: 武蔵野線。鉄道区分: 普通鉄道JR（11）。事業者種別: JR在来線（2）。

沢渡
type: Concept
alternative label: 沢渡（東海旅客鉄道 飯田線）
broader: g003082
in scheme: scheme
notation: 003082
scope note: 運営会社: 東海旅客鉄道。路線名: 飯田線。鉄道区分: 普通鉄道JR（11）。事業者種別: JR在来線（2）。

印西牧の原
type: Concept
alternative label: 印西牧の原（北総鉄道 北総線）
broader: g003083
in scheme: scheme
notation: 003083
scope note: 運営会社: 北総鉄道。路線名: 北総線。鉄道区分: 普通鉄道（12）。事業者種別: 第三セクター（5）。

湯尾
type: Concept
alternative label: 湯尾（ハピラインふくい ハピラインふくい線）
broader: g003084
in scheme: scheme
notation: 003084
scope note: 運営会社: ハピラインふくい。路線名: ハピラインふくい線。鉄道区分: 普通鉄道（12）。事業者種別: 第三セクター（5）。

常盤平
type: Concept
alternative label: 常盤平（京成電鉄 松戸線）
broader: g003085
in scheme: scheme
notation: 003085
scope note: 運営会社: 京成電鉄。路線名: 松戸線。鉄道区分: 普通鉄道（12）。事業者種別: 民営鉄道（4）。

川口
type: Concept
alternative label: 川口（東日本旅客鉄道 東北線）
broader: g003086
in scheme: scheme
notation: 003086
scope note: 運営会社: 東日本旅客鉄道。路線名: 東北線。鉄道区分: 普通鉄道JR（11）。事業者種別: JR在来線（2）。

御嶽
type: Concept
alternative label: 御嶽（東日本旅客鉄道 青梅線）
broader: g003087
in scheme: scheme
notation: 003087
scope note: 運営会社: 東日本旅客鉄道。路線名: 青梅線。鉄道区分: 普通鉄道JR（11）。事業者種別: JR在来線（2）。

小手指
type: Concept
alternative label: 小手指（西武鉄道 池袋線）
broader: g003088
in scheme: scheme
notation: 003088
scope note: 運営会社: 西武鉄道。路線名: 池袋線。鉄道区分: 普通鉄道（12）。事業者種別: 民営鉄道（4）。

北松戸
type: Concept
alternative label: 北松戸（東日本旅客鉄道 常磐線）
broader: g003089
in scheme: scheme
notation: 003089
scope note: 運営会社: 東日本旅客鉄道。路線名: 常磐線。鉄道区分: 普通鉄道JR（11）。事業者種別: JR在来線（2）。

千葉ニュータウン中央
type: Concept
alternative label: 千葉ニュータウン中央（京成電鉄 成田空港線）
broader: g003090
in scheme: scheme
notation: 003090
scope note: 運営会社: 京成電鉄。路線名: 成田空港線。鉄道区分: 普通鉄道（12）。事業者種別: 民営鉄道（4）。

千葉ニュータウン中央
type: Concept
alternative label: 千葉ニュータウン中央（北総鉄道 北総線）
broader: g003090
in scheme: scheme
notation: 003091
scope note: 運営会社: 北総鉄道。路線名: 北総線。鉄道区分: 普通鉄道（12）。事業者種別: 第三セクター（5）。

川口元郷
type: Concept
alternative label: 川口元郷（埼玉高速鉄道 埼玉高速鉄道線）
broader: g003092
in scheme: scheme
notation: 003092
scope note: 運営会社: 埼玉高速鉄道。路線名: 埼玉高速鉄道線。鉄道区分: 普通鉄道（12）。事業者種別: 第三セクター（5）。

成田湯川
type: Concept
alternative label: 成田湯川（京成電鉄 成田空港線）
broader: g003093
in scheme: scheme
notation: 003093
scope note: 運営会社: 京成電鉄。路線名: 成田空港線。鉄道区分: 普通鉄道（12）。事業者種別: 民営鉄道（4）。

航空公園
type: Concept
alternative label: 航空公園（西武鉄道 新宿線）
broader: g003094
in scheme: scheme
notation: 003094
scope note: 運営会社: 西武鉄道。路線名: 新宿線。鉄道区分: 普通鉄道（12）。事業者種別: 民営鉄道（4）。

五香
type: Concept
alternative label: 五香（京成電鉄 松戸線）
broader: g003095
in scheme: scheme
notation: 003095
scope note: 運営会社: 京成電鉄。路線名: 松戸線。鉄道区分: 普通鉄道（12）。事業者種別: 民営鉄道（4）。

石神前
type: Concept
alternative label: 石神前（東日本旅客鉄道 青梅線）
broader: g003096
in scheme: scheme
notation: 003096
scope note: 運営会社: 東日本旅客鉄道。路線名: 青梅線。鉄道区分: 普通鉄道JR（11）。事業者種別: JR在来線（2）。

朝霞
type: Concept
alternative label: 朝霞（東武鉄道 東上本線）
broader: g003097
in scheme: scheme
notation: 003097
scope note: 運営会社: 東武鉄道。路線名: 東上本線。鉄道区分: 普通鉄道（12）。事業者種別: 民営鉄道（4）。

舎人公園
type: Concept
alternative label: 舎人公園（東京都 日暮里・舎人ライナー）
broader: g003098
in scheme: scheme
notation: 003098
scope note: 運営会社: 東京都。路線名: 日暮里・舎人ライナー。鉄道区分: 案内軌条式（24）。事業者種別: 公営鉄道（3）。

滝本
type: Concept
alternative label: 滝本（御岳登山鉄道 ケーブルカー）
broader: g003099
in scheme: scheme
notation: 003099
scope note: 運営会社: 御岳登山鉄道。路線名: ケーブルカー。鉄道区分: 鋼索鉄道（13）。事業者種別: 民営鉄道（4）。

東所沢
type: Concept
alternative label: 東所沢（東日本旅客鉄道 武蔵野線）
broader: g003100
in scheme: scheme
notation: 003100
scope note: 運営会社: 東日本旅客鉄道。路線名: 武蔵野線。鉄道区分: 普通鉄道JR（11）。事業者種別: JR在来線（2）。

竹ノ塚
type: Concept
alternative label: 竹ノ塚（東武鉄道 伊勢崎線）
broader: g003101
in scheme: scheme
notation: 003101
scope note: 運営会社: 東武鉄道。路線名: 伊勢崎線。鉄道区分: 普通鉄道（12）。事業者種別: 民営鉄道（4）。

六実
type: Concept
alternative label: 六実（東武鉄道 野田線）
broader: g003102
in scheme: scheme
notation: 003102
scope note: 運営会社: 東武鉄道。路線名: 野田線。鉄道区分: 普通鉄道（12）。事業者種別: 民営鉄道（4）。

下総豊里
type: Concept
alternative label: 下総豊里（東日本旅客鉄道 成田線）
broader: g003103
in scheme: scheme
notation: 003103
scope note: 運営会社: 東日本旅客鉄道。路線名: 成田線。鉄道区分: 普通鉄道JR（11）。事業者種別: JR在来線（2）。

西高島平
type: Concept
alternative label: 西高島平（東京都 6号線三田線）
broader: g003104
in scheme: scheme
notation: 003104
scope note: 運営会社: 東京都。路線名: 6号線三田線。鉄道区分: 普通鉄道（12）。事業者種別: 公営鉄道（3）。

八柱
type: Concept
alternative label: 八柱（京成電鉄 松戸線）
broader: g003105
in scheme: scheme
notation: 003105
scope note: 運営会社: 京成電鉄。路線名: 松戸線。鉄道区分: 普通鉄道（12）。事業者種別: 民営鉄道（4）。

新八柱
type: Concept
alternative label: 新八柱（東日本旅客鉄道 武蔵野線）
broader: g003106
in scheme: scheme
notation: 003106
scope note: 運営会社: 東日本旅客鉄道。路線名: 武蔵野線。鉄道区分: 普通鉄道JR（11）。事業者種別: JR在来線（2）。

浮間舟渡
type: Concept
alternative label: 浮間舟渡（東日本旅客鉄道 東北線）
broader: g003107
in scheme: scheme
notation: 003107
scope note: 運営会社: 東日本旅客鉄道。路線名: 東北線。鉄道区分: 普通鉄道JR（11）。事業者種別: JR在来線（2）。

日野春
type: Concept
alternative label: 日野春（東日本旅客鉄道 中央線）
broader: g003108
in scheme: scheme
notation: 003108
scope note: 運営会社: 東日本旅客鉄道。路線名: 中央線。鉄道区分: 普通鉄道JR（11）。事業者種別: JR在来線（2）。

松戸新田
type: Concept
alternative label: 松戸新田（京成電鉄 松戸線）
broader: g003109
in scheme: scheme
notation: 003109
scope note: 運営会社: 京成電鉄。路線名: 松戸線。鉄道区分: 普通鉄道（12）。事業者種別: 民営鉄道（4）。

青梅
type: Concept
alternative label: 青梅（東日本旅客鉄道 青梅線）
broader: g003110
in scheme: scheme
notation: 003110
scope note: 運営会社: 東日本旅客鉄道。路線名: 青梅線。鉄道区分: 普通鉄道JR（11）。事業者種別: JR在来線（2）。

元山
type: Concept
alternative label: 元山（京成電鉄 松戸線）
broader: g003111
in scheme: scheme
notation: 003111
scope note: 運営会社: 京成電鉄。路線名: 松戸線。鉄道区分: 普通鉄道（12）。事業者種別: 民営鉄道（4）。

新高島平
type: Concept
alternative label: 新高島平（東京都 6号線三田線）
broader: g003112
in scheme: scheme
notation: 003112
scope note: 運営会社: 東京都。路線名: 6号線三田線。鉄道区分: 普通鉄道（12）。事業者種別: 公営鉄道（3）。

東青梅
type: Concept
alternative label: 東青梅（東日本旅客鉄道 青梅線）
broader: g003113
in scheme: scheme
notation: 003113
scope note: 運営会社: 東日本旅客鉄道。路線名: 青梅線。鉄道区分: 普通鉄道JR（11）。事業者種別: JR在来線（2）。

御岳山
type: Concept
alternative label: 御岳山（御岳登山鉄道 ケーブルカー）
broader: g003114
in scheme: scheme
notation: 003114
scope note: 運営会社: 御岳登山鉄道。路線名: ケーブルカー。鉄道区分: 鋼索鉄道（13）。事業者種別: 民営鉄道（4）。

上本郷
type: Concept
alternative label: 上本郷（京成電鉄 松戸線）
broader: g003115
in scheme: scheme
notation: 003115
scope note: 運営会社: 京成電鉄。路線名: 松戸線。鉄道区分: 普通鉄道（12）。事業者種別: 民営鉄道（4）。

みのり台
type: Concept
alternative label: みのり台（京成電鉄 松戸線）
broader: g003116
in scheme: scheme
notation: 003116
scope note: 運営会社: 京成電鉄。路線名: 松戸線。鉄道区分: 普通鉄道（12）。事業者種別: 民営鉄道（4）。

高島平
type: Concept
alternative label: 高島平（東京都 6号線三田線）
broader: g003117
in scheme: scheme
notation: 003117
scope note: 運営会社: 東京都。路線名: 6号線三田線。鉄道区分: 普通鉄道（12）。事業者種別: 公営鉄道（3）。

西所沢
type: Concept
alternative label: 西所沢（西武鉄道 狭山線）
broader: g003118
in scheme: scheme
notation: 003118
scope note: 運営会社: 西武鉄道。路線名: 狭山線。鉄道区分: 普通鉄道（12）。事業者種別: 民営鉄道（4）。

西所沢
type: Concept
alternative label: 西所沢（西武鉄道 池袋線）
broader: g003118
in scheme: scheme
notation: 003119
scope note: 運営会社: 西武鉄道。路線名: 池袋線。鉄道区分: 普通鉄道（12）。事業者種別: 民営鉄道（4）。

谷在家
type: Concept
alternative label: 谷在家（東京都 日暮里・舎人ライナー）
broader: g003120
in scheme: scheme
notation: 003120
scope note: 運営会社: 東京都。路線名: 日暮里・舎人ライナー。鉄道区分: 案内軌条式（24）。事業者種別: 公営鉄道（3）。

日向和田
type: Concept
alternative label: 日向和田（東日本旅客鉄道 青梅線）
broader: g003121
in scheme: scheme
notation: 003121
scope note: 運営会社: 東日本旅客鉄道。路線名: 青梅線。鉄道区分: 普通鉄道JR（11）。事業者種別: JR在来線（2）。

山田
type: Concept
alternative label: 山田（長良川鉄道 越美南線）
broader: g003122
in scheme: scheme
notation: 003122
scope note: 運営会社: 長良川鉄道。路線名: 越美南線。鉄道区分: 普通鉄道（12）。事業者種別: 第三セクター（5）。

和光市
type: Concept
alternative label: 和光市（東京地下鉄 8号線有楽町線）
broader: g003123
in scheme: scheme
notation: 003123
scope note: 運営会社: 東京地下鉄。路線名: 8号線有楽町線。鉄道区分: 普通鉄道（12）。事業者種別: 民営鉄道（4）。

和光市
type: Concept
alternative label: 和光市（東武鉄道 東上本線）
broader: g003123
in scheme: scheme
notation: 003124
scope note: 運営会社: 東武鉄道。路線名: 東上本線。鉄道区分: 普通鉄道（12）。事業者種別: 民営鉄道（4）。

印旛日本医大
type: Concept
alternative label: 印旛日本医大（京成電鉄 成田空港線）
broader: g003125
in scheme: scheme
notation: 003125
scope note: 運営会社: 京成電鉄。路線名: 成田空港線。鉄道区分: 普通鉄道（12）。事業者種別: 民営鉄道（4）。

印旛日本医大
type: Concept
alternative label: 印旛日本医大（北総鉄道 北総線）
broader: g003125
in scheme: scheme
notation: 003126
scope note: 運営会社: 北総鉄道。路線名: 北総線。鉄道区分: 普通鉄道（12）。事業者種別: 第三セクター（5）。

宮ノ平
type: Concept
alternative label: 宮ノ平（東日本旅客鉄道 青梅線）
broader: g003127
in scheme: scheme
notation: 003127
scope note: 運営会社: 東日本旅客鉄道。路線名: 青梅線。鉄道区分: 普通鉄道JR（11）。事業者種別: JR在来線（2）。

西台
type: Concept
alternative label: 西台（東京都 6号線三田線）
broader: g003128
in scheme: scheme
notation: 003128
scope note: 運営会社: 東京都。路線名: 6号線三田線。鉄道区分: 普通鉄道（12）。事業者種別: 公営鉄道（3）。

小室
type: Concept
alternative label: 小室（北総鉄道 北総線）
broader: g003129
in scheme: scheme
notation: 003129
scope note: 運営会社: 北総鉄道。路線名: 北総線。鉄道区分: 普通鉄道（12）。事業者種別: 第三セクター（5）。

北赤羽
type: Concept
alternative label: 北赤羽（東日本旅客鉄道 東北線）
broader: g003130
in scheme: scheme
notation: 003130
scope note: 運営会社: 東日本旅客鉄道。路線名: 東北線。鉄道区分: 普通鉄道JR（11）。事業者種別: JR在来線（2）。

所沢
type: Concept
alternative label: 所沢（西武鉄道 新宿線）
broader: g003131
in scheme: scheme
notation: 003131
scope note: 運営会社: 西武鉄道。路線名: 新宿線。鉄道区分: 普通鉄道（12）。事業者種別: 民営鉄道（4）。

所沢
type: Concept
alternative label: 所沢（西武鉄道 池袋線）
broader: g003131
in scheme: scheme
notation: 003132
scope note: 運営会社: 西武鉄道。路線名: 池袋線。鉄道区分: 普通鉄道（12）。事業者種別: 民営鉄道（4）。

六町
type: Concept
alternative label: 六町（首都圏新都市鉄道 常磐新線）
broader: g003133
in scheme: scheme
notation: 003133
scope note: 運営会社: 首都圏新都市鉄道。路線名: 常磐新線。鉄道区分: 普通鉄道（12）。事業者種別: 第三セクター（5）。

河辺
type: Concept
alternative label: 河辺（東日本旅客鉄道 青梅線）
broader: g003134
in scheme: scheme
notation: 003134
scope note: 運営会社: 東日本旅客鉄道。路線名: 青梅線。鉄道区分: 普通鉄道JR（11）。事業者種別: JR在来線（2）。

白井
type: Concept
alternative label: 白井（北総鉄道 北総線）
broader: g003135
in scheme: scheme
notation: 003135
scope note: 運営会社: 北総鉄道。路線名: 北総線。鉄道区分: 普通鉄道（12）。事業者種別: 第三セクター（5）。

松戸
type: Concept
alternative label: 松戸（東日本旅客鉄道 常磐線）
broader: g003136
in scheme: scheme
notation: 003136
scope note: 運営会社: 東日本旅客鉄道。路線名: 常磐線。鉄道区分: 普通鉄道JR（11）。事業者種別: JR在来線（2）。

西白井
type: Concept
alternative label: 西白井（北総鉄道 北総線）
broader: g003137
in scheme: scheme
notation: 003137
scope note: 運営会社: 北総鉄道。路線名: 北総線。鉄道区分: 普通鉄道（12）。事業者種別: 第三セクター（5）。

松戸
type: Concept
alternative label: 松戸（京成電鉄 松戸線）
broader: g003136
in scheme: scheme
notation: 003138
scope note: 運営会社: 京成電鉄。路線名: 松戸線。鉄道区分: 普通鉄道（12）。事業者種別: 民営鉄道（4）。

上松
type: Concept
alternative label: 上松（東海旅客鉄道 中央線）
broader: g003139
in scheme: scheme
notation: 003139
scope note: 運営会社: 東海旅客鉄道。路線名: 中央線。鉄道区分: 普通鉄道JR（11）。事業者種別: JR在来線（2）。

蓮根
type: Concept
alternative label: 蓮根（東京都 6号線三田線）
broader: g003140
in scheme: scheme
notation: 003140
scope note: 運営会社: 東京都。路線名: 6号線三田線。鉄道区分: 普通鉄道（12）。事業者種別: 公営鉄道（3）。

赤羽岩淵
type: Concept
alternative label: 赤羽岩淵（東京地下鉄 7号線南北線）
broader: g003141
in scheme: scheme
notation: 003141
scope note: 運営会社: 東京地下鉄。路線名: 7号線南北線。鉄道区分: 普通鉄道（12）。事業者種別: 民営鉄道（4）。

赤羽岩淵
type: Concept
alternative label: 赤羽岩淵（埼玉高速鉄道 埼玉高速鉄道線）
broader: g003141
in scheme: scheme
notation: 003142
scope note: 運営会社: 埼玉高速鉄道。路線名: 埼玉高速鉄道線。鉄道区分: 普通鉄道（12）。事業者種別: 第三セクター（5）。

くぬぎ山
type: Concept
alternative label: くぬぎ山（京成電鉄 松戸線）
broader: g003143
in scheme: scheme
notation: 003143
scope note: 運営会社: 京成電鉄。路線名: 松戸線。鉄道区分: 普通鉄道（12）。事業者種別: 民営鉄道（4）。

西新井大師西
type: Concept
alternative label: 西新井大師西（東京都 日暮里・舎人ライナー）
broader: g003144
in scheme: scheme
notation: 003144
scope note: 運営会社: 東京都。路線名: 日暮里・舎人ライナー。鉄道区分: 案内軌条式（24）。事業者種別: 公営鉄道（3）。

新鎌ヶ谷
type: Concept
alternative label: 新鎌ヶ谷（東武鉄道 野田線）
broader: g003146
in scheme: scheme
notation: 003145
scope note: 運営会社: 東武鉄道。路線名: 野田線。鉄道区分: 普通鉄道（12）。事業者種別: 民営鉄道（4）。

新鎌ヶ谷
type: Concept
alternative label: 新鎌ヶ谷（京成電鉄 成田空港線）
broader: g003146
in scheme: scheme
notation: 003146
scope note: 運営会社: 京成電鉄。路線名: 成田空港線。鉄道区分: 普通鉄道（12）。事業者種別: 民営鉄道（4）。

新鎌ヶ谷
type: Concept
alternative label: 新鎌ヶ谷（北総鉄道 北総線）
broader: g003146
in scheme: scheme
notation: 003147
scope note: 運営会社: 北総鉄道。路線名: 北総線。鉄道区分: 普通鉄道（12）。事業者種別: 第三セクター（5）。

下山口
type: Concept
alternative label: 下山口（西武鉄道 狭山線）
broader: g003148
in scheme: scheme
notation: 003148
scope note: 運営会社: 西武鉄道。路線名: 狭山線。鉄道区分: 普通鉄道（12）。事業者種別: 民営鉄道（4）。

新鎌ヶ谷
type: Concept
alternative label: 新鎌ヶ谷（京成電鉄 松戸線）
broader: g003146
in scheme: scheme
notation: 003149
scope note: 運営会社: 京成電鉄。路線名: 松戸線。鉄道区分: 普通鉄道（12）。事業者種別: 民営鉄道（4）。

大師前
type: Concept
alternative label: 大師前（東武鉄道 大師線）
broader: g003150
in scheme: scheme
notation: 003150
scope note: 運営会社: 東武鉄道。路線名: 大師線。鉄道区分: 普通鉄道（12）。事業者種別: 民営鉄道（4）。

秋津
type: Concept
alternative label: 秋津（西武鉄道 池袋線）
broader: g003151
in scheme: scheme
notation: 003151
scope note: 運営会社: 西武鉄道。路線名: 池袋線。鉄道区分: 普通鉄道（12）。事業者種別: 民営鉄道（4）。

新秋津
type: Concept
alternative label: 新秋津（東日本旅客鉄道 武蔵野線）
broader: g003152
in scheme: scheme
notation: 003152
scope note: 運営会社: 東日本旅客鉄道。路線名: 武蔵野線。鉄道区分: 普通鉄道JR（11）。事業者種別: JR在来線（2）。

志茂
type: Concept
alternative label: 志茂（東京地下鉄 7号線南北線）
broader: g003153
in scheme: scheme
notation: 003153
scope note: 運営会社: 東京地下鉄。路線名: 7号線南北線。鉄道区分: 普通鉄道（12）。事業者種別: 民営鉄道（4）。

赤木
type: Concept
alternative label: 赤木（東海旅客鉄道 飯田線）
broader: g003154
in scheme: scheme
notation: 003154
scope note: 運営会社: 東海旅客鉄道。路線名: 飯田線。鉄道区分: 普通鉄道JR（11）。事業者種別: JR在来線（2）。

赤羽
type: Concept
alternative label: 赤羽（東日本旅客鉄道 赤羽線）
broader: g003155
in scheme: scheme
notation: 003155
scope note: 運営会社: 東日本旅客鉄道。路線名: 赤羽線。鉄道区分: 普通鉄道JR（11）。事業者種別: JR在来線（2）。

成増
type: Concept
alternative label: 成増（東武鉄道 東上本線）
broader: g003156
in scheme: scheme
notation: 003156
scope note: 運営会社: 東武鉄道。路線名: 東上本線。鉄道区分: 普通鉄道（12）。事業者種別: 民営鉄道（4）。

赤羽
type: Concept
alternative label: 赤羽（東日本旅客鉄道 東北線）
broader: g003155
in scheme: scheme
notation: 003157
scope note: 運営会社: 東日本旅客鉄道。路線名: 東北線。鉄道区分: 普通鉄道JR（11）。事業者種別: JR在来線（2）。

志村三丁目
type: Concept
alternative label: 志村三丁目（東京都 6号線三田線）
broader: g003158
in scheme: scheme
notation: 003158
scope note: 運営会社: 東京都。路線名: 6号線三田線。鉄道区分: 普通鉄道（12）。事業者種別: 公営鉄道（3）。

西新井
type: Concept
alternative label: 西新井（東武鉄道 伊勢崎線）
broader: g003159
in scheme: scheme
notation: 003159
scope note: 運営会社: 東武鉄道。路線名: 伊勢崎線。鉄道区分: 普通鉄道（12）。事業者種別: 民営鉄道（4）。

西新井
type: Concept
alternative label: 西新井（東武鉄道 大師線）
broader: g003159
in scheme: scheme
notation: 003160
scope note: 運営会社: 東武鉄道。路線名: 大師線。鉄道区分: 普通鉄道（12）。事業者種別: 民営鉄道（4）。

成田
type: Concept
alternative label: 成田（東日本旅客鉄道 成田線）
broader: g003161
in scheme: scheme
notation: 003161
scope note: 運営会社: 東日本旅客鉄道。路線名: 成田線。鉄道区分: 普通鉄道JR（11）。事業者種別: JR在来線（2）。

北綾瀬
type: Concept
alternative label: 北綾瀬（東京地下鉄 9号線千代田線）
broader: g003162
in scheme: scheme
notation: 003162
scope note: 運営会社: 東京地下鉄。路線名: 9号線千代田線。鉄道区分: 普通鉄道（12）。事業者種別: 民営鉄道（4）。

地下鉄成増
type: Concept
alternative label: 地下鉄成増（東京地下鉄 8号線有楽町線）
broader: g003163
in scheme: scheme
notation: 003163
scope note: 運営会社: 東京地下鉄。路線名: 8号線有楽町線。鉄道区分: 普通鉄道（12）。事業者種別: 民営鉄道（4）。

北初富
type: Concept
alternative label: 北初富（京成電鉄 松戸線）
broader: g003164
in scheme: scheme
notation: 003164
scope note: 運営会社: 京成電鉄。路線名: 松戸線。鉄道区分: 普通鉄道（12）。事業者種別: 民営鉄道（4）。

志村坂上
type: Concept
alternative label: 志村坂上（東京都 6号線三田線）
broader: g003165
in scheme: scheme
notation: 003165
scope note: 運営会社: 東京都。路線名: 6号線三田線。鉄道区分: 普通鉄道（12）。事業者種別: 公営鉄道（3）。

京成成田
type: Concept
alternative label: 京成成田（京成電鉄 東成田線）
broader: g003166
in scheme: scheme
notation: 003166
scope note: 運営会社: 京成電鉄。路線名: 東成田線。鉄道区分: 普通鉄道（12）。事業者種別: 民営鉄道（4）。

京成成田
type: Concept
alternative label: 京成成田（京成電鉄 本線）
broader: g003166
in scheme: scheme
notation: 003167
scope note: 運営会社: 京成電鉄。路線名: 本線。鉄道区分: 普通鉄道（12）。事業者種別: 民営鉄道（4）。

小作
type: Concept
alternative label: 小作（東日本旅客鉄道 青梅線）
broader: g003168
in scheme: scheme
notation: 003168
scope note: 運営会社: 東日本旅客鉄道。路線名: 青梅線。鉄道区分: 普通鉄道JR（11）。事業者種別: JR在来線（2）。

松飛台
type: Concept
alternative label: 松飛台（北総鉄道 北総線）
broader: g003169
in scheme: scheme
notation: 003169
scope note: 運営会社: 北総鉄道。路線名: 北総線。鉄道区分: 普通鉄道（12）。事業者種別: 第三セクター（5）。

大町
type: Concept
alternative label: 大町（北総鉄道 北総線）
broader: g003170
in scheme: scheme
notation: 003170
scope note: 運営会社: 北総鉄道。路線名: 北総線。鉄道区分: 普通鉄道（12）。事業者種別: 第三セクター（5）。

江北
type: Concept
alternative label: 江北（東京都 日暮里・舎人ライナー）
broader: g003171
in scheme: scheme
notation: 003171
scope note: 運営会社: 東京都。路線名: 日暮里・舎人ライナー。鉄道区分: 案内軌条式（24）。事業者種別: 公営鉄道（3）。

今庄
type: Concept
alternative label: 今庄（ハピラインふくい ハピラインふくい線）
broader: g003172
in scheme: scheme
notation: 003172
scope note: 運営会社: ハピラインふくい。路線名: ハピラインふくい線。鉄道区分: 普通鉄道（12）。事業者種別: 第三セクター（5）。

空港第2ビル
type: Concept
alternative label: 空港第2ビル（東日本旅客鉄道 成田線）
broader: g003173
in scheme: scheme
notation: 003173
scope note: 運営会社: 東日本旅客鉄道。路線名: 成田線。鉄道区分: 普通鉄道JR（11）。事業者種別: JR在来線（2）。

空港第2ビル
type: Concept
alternative label: 空港第2ビル（京成電鉄 成田空港線）
broader: g003173
in scheme: scheme
notation: 003174
scope note: 運営会社: 京成電鉄。路線名: 成田空港線。鉄道区分: 普通鉄道（12）。事業者種別: 民営鉄道（4）。

空港第2ビル
type: Concept
alternative label: 空港第2ビル（京成電鉄 本線）
broader: g003173
in scheme: scheme
notation: 003175
scope note: 運営会社: 京成電鉄。路線名: 本線。鉄道区分: 普通鉄道（12）。事業者種別: 民営鉄道（4）。

梅島
type: Concept
alternative label: 梅島（東武鉄道 伊勢崎線）
broader: g003176
in scheme: scheme
notation: 003176
scope note: 運営会社: 東武鉄道。路線名: 伊勢崎線。鉄道区分: 普通鉄道（12）。事業者種別: 民営鉄道（4）。

青井
type: Concept
alternative label: 青井（首都圏新都市鉄道 常磐新線）
broader: g003177
in scheme: scheme
notation: 003177
scope note: 運営会社: 首都圏新都市鉄道。路線名: 常磐新線。鉄道区分: 普通鉄道（12）。事業者種別: 第三セクター（5）。

初富
type: Concept
alternative label: 初富（京成電鉄 松戸線）
broader: g003178
in scheme: scheme
notation: 003178
scope note: 運営会社: 京成電鉄。路線名: 松戸線。鉄道区分: 普通鉄道（12）。事業者種別: 民営鉄道（4）。

清瀬
type: Concept
alternative label: 清瀬（西武鉄道 池袋線）
broader: g003179
in scheme: scheme
notation: 003179
scope note: 運営会社: 西武鉄道。路線名: 池袋線。鉄道区分: 普通鉄道（12）。事業者種別: 民営鉄道（4）。

箱根ヶ崎
type: Concept
alternative label: 箱根ヶ崎（東日本旅客鉄道 八高線）
broader: g003180
in scheme: scheme
notation: 003180
scope note: 運営会社: 東日本旅客鉄道。路線名: 八高線。鉄道区分: 普通鉄道JR（11）。事業者種別: JR在来線（2）。

西武球場前
type: Concept
alternative label: 西武球場前（西武鉄道 狭山線）
broader: g003181
in scheme: scheme
notation: 003181
scope note: 運営会社: 西武鉄道。路線名: 狭山線。鉄道区分: 普通鉄道（12）。事業者種別: 民営鉄道（4）。

西武球場前
type: Concept
alternative label: 西武球場前（西武鉄道 山口線）
broader: g003181
in scheme: scheme
notation: 003182
scope note: 運営会社: 西武鉄道。路線名: 山口線。鉄道区分: 案内軌条式鉄道（16）。事業者種別: 民営鉄道（4）。

東松戸
type: Concept
alternative label: 東松戸（東日本旅客鉄道 武蔵野線）
broader: g003187
in scheme: scheme
notation: 003183
scope note: 運営会社: 東日本旅客鉄道。路線名: 武蔵野線。鉄道区分: 普通鉄道JR（11）。事業者種別: JR在来線（2）。

下赤塚
type: Concept
alternative label: 下赤塚（東武鉄道 東上本線）
broader: g003184
in scheme: scheme
notation: 003184
scope note: 運営会社: 東武鉄道。路線名: 東上本線。鉄道区分: 普通鉄道（12）。事業者種別: 民営鉄道（4）。

自然園前
type: Concept
alternative label: 自然園前（長良川鉄道 越美南線）
broader: g003185
in scheme: scheme
notation: 003185
scope note: 運営会社: 長良川鉄道。路線名: 越美南線。鉄道区分: 普通鉄道（12）。事業者種別: 第三セクター（5）。

地下鉄赤塚
type: Concept
alternative label: 地下鉄赤塚（東京地下鉄 8号線有楽町線）
broader: g003186
in scheme: scheme
notation: 003186
scope note: 運営会社: 東京地下鉄。路線名: 8号線有楽町線。鉄道区分: 普通鉄道（12）。事業者種別: 民営鉄道（4）。

東松戸
type: Concept
alternative label: 東松戸（京成電鉄 成田空港線）
broader: g003187
in scheme: scheme
notation: 003187
scope note: 運営会社: 京成電鉄。路線名: 成田空港線。鉄道区分: 普通鉄道（12）。事業者種別: 民営鉄道（4）。

東松戸
type: Concept
alternative label: 東松戸（北総鉄道 北総線）
broader: g003187
in scheme: scheme
notation: 003188
scope note: 運営会社: 北総鉄道。路線名: 北総線。鉄道区分: 普通鉄道（12）。事業者種別: 第三セクター（5）。

東成田
type: Concept
alternative label: 東成田（京成電鉄 東成田線）
broader: g003189
in scheme: scheme
notation: 003189
scope note: 運営会社: 京成電鉄。路線名: 東成田線。鉄道区分: 普通鉄道（12）。事業者種別: 民営鉄道（4）。

東成田
type: Concept
alternative label: 東成田（芝山鉄道 芝山鉄道線）
broader: g003189
in scheme: scheme
notation: 003190
scope note: 運営会社: 芝山鉄道。路線名: 芝山鉄道線。鉄道区分: 普通鉄道（12）。事業者種別: 第三セクター（5）。

金町
type: Concept
alternative label: 金町（東日本旅客鉄道 常磐線）
broader: g003191
in scheme: scheme
notation: 003191
scope note: 運営会社: 東日本旅客鉄道。路線名: 常磐線。鉄道区分: 普通鉄道JR（11）。事業者種別: JR在来線（2）。

西武園ゆうえんち
type: Concept
alternative label: 西武園ゆうえんち（西武鉄道 山口線）
broader: g003192
in scheme: scheme
notation: 003192
scope note: 運営会社: 西武鉄道。路線名: 山口線。鉄道区分: 案内軌条式鉄道（16）。事業者種別: 民営鉄道（4）。

本蓮沼
type: Concept
alternative label: 本蓮沼（東京都 6号線三田線）
broader: g003193
in scheme: scheme
notation: 003193
scope note: 運営会社: 東京都。路線名: 6号線三田線。鉄道区分: 普通鉄道（12）。事業者種別: 公営鉄道（3）。

東武練馬
type: Concept
alternative label: 東武練馬（東武鉄道 東上本線）
broader: g003194
in scheme: scheme
notation: 003194
scope note: 運営会社: 東武鉄道。路線名: 東上本線。鉄道区分: 普通鉄道（12）。事業者種別: 民営鉄道（4）。

京成金町
type: Concept
alternative label: 京成金町（京成電鉄 金町線）
broader: g003195
in scheme: scheme
notation: 003195
scope note: 運営会社: 京成電鉄。路線名: 金町線。鉄道区分: 普通鉄道（12）。事業者種別: 民営鉄道（4）。

高野
type: Concept
alternative label: 高野（東京都 日暮里・舎人ライナー）
broader: g003196
in scheme: scheme
notation: 003196
scope note: 運営会社: 東京都。路線名: 日暮里・舎人ライナー。鉄道区分: 案内軌条式（24）。事業者種別: 公営鉄道（3）。

西武園
type: Concept
alternative label: 西武園（西武鉄道 西武園線）
broader: g003197
in scheme: scheme
notation: 003197
scope note: 運営会社: 西武鉄道。路線名: 西武園線。鉄道区分: 普通鉄道（12）。事業者種別: 民営鉄道（4）。

宮田
type: Concept
alternative label: 宮田（東海旅客鉄道 飯田線）
broader: g003198
in scheme: scheme
notation: 003198
scope note: 運営会社: 東海旅客鉄道。路線名: 飯田線。鉄道区分: 普通鉄道JR（11）。事業者種別: JR在来線（2）。

亀有
type: Concept
alternative label: 亀有（東日本旅客鉄道 常磐線）
broader: g003199
in scheme: scheme
notation: 003199
scope note: 運営会社: 東日本旅客鉄道。路線名: 常磐線。鉄道区分: 普通鉄道JR（11）。事業者種別: JR在来線（2）。

五反野
type: Concept
alternative label: 五反野（東武鉄道 伊勢崎線）
broader: g003200
in scheme: scheme
notation: 003200
scope note: 運営会社: 東武鉄道。路線名: 伊勢崎線。鉄道区分: 普通鉄道（12）。事業者種別: 民営鉄道（4）。

多摩湖
type: Concept
alternative label: 多摩湖（西武鉄道 多摩湖線）
broader: g003201
in scheme: scheme
notation: 003201
scope note: 運営会社: 西武鉄道。路線名: 多摩湖線。鉄道区分: 普通鉄道（12）。事業者種別: 民営鉄道（4）。

多摩湖
type: Concept
alternative label: 多摩湖（西武鉄道 山口線）
broader: g003201
in scheme: scheme
notation: 003202
scope note: 運営会社: 西武鉄道。路線名: 山口線。鉄道区分: 案内軌条式鉄道（16）。事業者種別: 民営鉄道（4）。

成田空港
type: Concept
alternative label: 成田空港（東日本旅客鉄道 成田線）
broader: g003203
in scheme: scheme
notation: 003203
scope note: 運営会社: 東日本旅客鉄道。路線名: 成田線。鉄道区分: 普通鉄道JR（11）。事業者種別: JR在来線（2）。

成田空港
type: Concept
alternative label: 成田空港（京成電鉄 成田空港線）
broader: g003203
in scheme: scheme
notation: 003204
scope note: 運営会社: 京成電鉄。路線名: 成田空港線。鉄道区分: 普通鉄道（12）。事業者種別: 民営鉄道（4）。

成田空港
type: Concept
alternative label: 成田空港（京成電鉄 本線）
broader: g003203
in scheme: scheme
notation: 003205
scope note: 運営会社: 京成電鉄。路線名: 本線。鉄道区分: 普通鉄道（12）。事業者種別: 民営鉄道（4）。

秋山
type: Concept
alternative label: 秋山（北総鉄道 北総線）
broader: g003206
in scheme: scheme
notation: 003206
scope note: 運営会社: 北総鉄道。路線名: 北総線。鉄道区分: 普通鉄道（12）。事業者種別: 第三セクター（5）。

王子神谷
type: Concept
alternative label: 王子神谷（東京地下鉄 7号線南北線）
broader: g003207
in scheme: scheme
notation: 003207
scope note: 運営会社: 東京地下鉄。路線名: 7号線南北線。鉄道区分: 普通鉄道（12）。事業者種別: 民営鉄道（4）。

椎柴
type: Concept
alternative label: 椎柴（東日本旅客鉄道 成田線）
broader: g003208
in scheme: scheme
notation: 003208
scope note: 運営会社: 東日本旅客鉄道。路線名: 成田線。鉄道区分: 普通鉄道JR（11）。事業者種別: JR在来線（2）。

扇大橋
type: Concept
alternative label: 扇大橋（東京都 日暮里・舎人ライナー）
broader: g003209
in scheme: scheme
notation: 003209
scope note: 運営会社: 東京都。路線名: 日暮里・舎人ライナー。鉄道区分: 案内軌条式（24）。事業者種別: 公営鉄道（3）。

東十条
type: Concept
alternative label: 東十条（東日本旅客鉄道 東北線）
broader: g003210
in scheme: scheme
notation: 003210
scope note: 運営会社: 東日本旅客鉄道。路線名: 東北線。鉄道区分: 普通鉄道JR（11）。事業者種別: JR在来線（2）。

鎌ヶ谷
type: Concept
alternative label: 鎌ヶ谷（東武鉄道 野田線）
broader: g003211
in scheme: scheme
notation: 003211
scope note: 運営会社: 東武鉄道。路線名: 野田線。鉄道区分: 普通鉄道（12）。事業者種別: 民営鉄道（4）。

上板橋
type: Concept
alternative label: 上板橋（東武鉄道 東上本線）
broader: g003212
in scheme: scheme
notation: 003212
scope note: 運営会社: 東武鉄道。路線名: 東上本線。鉄道区分: 普通鉄道（12）。事業者種別: 民営鉄道（4）。

北国分
type: Concept
alternative label: 北国分（北総鉄道 北総線）
broader: g003213
in scheme: scheme
notation: 003213
scope note: 運営会社: 北総鉄道。路線名: 北総線。鉄道区分: 普通鉄道（12）。事業者種別: 第三セクター（5）。

綾瀬
type: Concept
alternative label: 綾瀬（東京地下鉄 9号線千代田線）
broader: g003214
in scheme: scheme
notation: 003214
scope note: 運営会社: 東京地下鉄。路線名: 9号線千代田線。鉄道区分: 普通鉄道（12）。事業者種別: 民営鉄道（4）。

綾瀬
type: Concept
alternative label: 綾瀬（東日本旅客鉄道 常磐線）
broader: g003214
in scheme: scheme
notation: 003215
scope note: 運営会社: 東日本旅客鉄道。路線名: 常磐線。鉄道区分: 普通鉄道JR（11）。事業者種別: JR在来線（2）。

板橋本町
type: Concept
alternative label: 板橋本町（東京都 6号線三田線）
broader: g003216
in scheme: scheme
notation: 003216
scope note: 運営会社: 東京都。路線名: 6号線三田線。鉄道区分: 普通鉄道（12）。事業者種別: 公営鉄道（3）。

東久留米
type: Concept
alternative label: 東久留米（西武鉄道 池袋線）
broader: g003217
in scheme: scheme
notation: 003217
scope note: 運営会社: 西武鉄道。路線名: 池袋線。鉄道区分: 普通鉄道（12）。事業者種別: 民営鉄道（4）。

十条
type: Concept
alternative label: 十条（東日本旅客鉄道 赤羽線）
broader: g003218
in scheme: scheme
notation: 003218
scope note: 運営会社: 東日本旅客鉄道。路線名: 赤羽線。鉄道区分: 普通鉄道JR（11）。事業者種別: JR在来線（2）。

公津の杜
type: Concept
alternative label: 公津の杜（京成電鉄 本線）
broader: g003219
in scheme: scheme
notation: 003219
scope note: 運営会社: 京成電鉄。路線名: 本線。鉄道区分: 普通鉄道（12）。事業者種別: 民営鉄道（4）。

東村山
type: Concept
alternative label: 東村山（西武鉄道 国分寺線）
broader: g003220
in scheme: scheme
notation: 003220
scope note: 運営会社: 西武鉄道。路線名: 国分寺線。鉄道区分: 普通鉄道（12）。事業者種別: 民営鉄道（4）。

東村山
type: Concept
alternative label: 東村山（西武鉄道 新宿線）
broader: g003220
in scheme: scheme
notation: 003221
scope note: 運営会社: 西武鉄道。路線名: 新宿線。鉄道区分: 普通鉄道（12）。事業者種別: 民営鉄道（4）。

東村山
type: Concept
alternative label: 東村山（西武鉄道 西武園線）
broader: g003220
in scheme: scheme
notation: 003222
scope note: 運営会社: 西武鉄道。路線名: 西武園線。鉄道区分: 普通鉄道（12）。事業者種別: 民営鉄道（4）。

ときわ台
type: Concept
alternative label: ときわ台（東武鉄道 東上本線）
broader: g003223
in scheme: scheme
notation: 003223
scope note: 運営会社: 東武鉄道。路線名: 東上本線。鉄道区分: 普通鉄道（12）。事業者種別: 民営鉄道（4）。

小菅
type: Concept
alternative label: 小菅（東武鉄道 伊勢崎線）
broader: g003224
in scheme: scheme
notation: 003224
scope note: 運営会社: 東武鉄道。路線名: 伊勢崎線。鉄道区分: 普通鉄道（12）。事業者種別: 民営鉄道（4）。

光が丘
type: Concept
alternative label: 光が丘（東京都 12号線大江戸線）
broader: g003225
in scheme: scheme
notation: 003225
scope note: 運営会社: 東京都。路線名: 12号線大江戸線。鉄道区分: 普通鉄道（12）。事業者種別: 公営鉄道（3）。

羽村
type: Concept
alternative label: 羽村（東日本旅客鉄道 青梅線）
broader: g003226
in scheme: scheme
notation: 003226
scope note: 運営会社: 東日本旅客鉄道。路線名: 青梅線。鉄道区分: 普通鉄道JR（11）。事業者種別: JR在来線（2）。

鎌ヶ谷大仏
type: Concept
alternative label: 鎌ヶ谷大仏（京成電鉄 松戸線）
broader: g003227
in scheme: scheme
notation: 003227
scope note: 運営会社: 京成電鉄。路線名: 松戸線。鉄道区分: 普通鉄道（12）。事業者種別: 民営鉄道（4）。

平和台
type: Concept
alternative label: 平和台（東京地下鉄 8号線有楽町線）
broader: g003228
in scheme: scheme
notation: 003228
scope note: 運営会社: 東京地下鉄。路線名: 8号線有楽町線。鉄道区分: 普通鉄道（12）。事業者種別: 民営鉄道（4）。

矢切
type: Concept
alternative label: 矢切（北総鉄道 北総線）
broader: g003229
in scheme: scheme
notation: 003229
scope note: 運営会社: 北総鉄道。路線名: 北総線。鉄道区分: 普通鉄道（12）。事業者種別: 第三セクター（5）。

南今庄
type: Concept
alternative label: 南今庄（ハピラインふくい ハピラインふくい線）
broader: g003230
in scheme: scheme
notation: 003230
scope note: 運営会社: ハピラインふくい。路線名: ハピラインふくい線。鉄道区分: 普通鉄道（12）。事業者種別: 第三セクター（5）。

武蔵大和
type: Concept
alternative label: 武蔵大和（西武鉄道 多摩湖線）
broader: g003231
in scheme: scheme
notation: 003231
scope note: 運営会社: 西武鉄道。路線名: 多摩湖線。鉄道区分: 普通鉄道（12）。事業者種別: 民営鉄道（4）。

柴又
type: Concept
alternative label: 柴又（京成電鉄 金町線）
broader: g003232
in scheme: scheme
notation: 003232
scope note: 運営会社: 京成電鉄。路線名: 金町線。鉄道区分: 普通鉄道（12）。事業者種別: 民営鉄道（4）。

中板橋
type: Concept
alternative label: 中板橋（東武鉄道 東上本線）
broader: g003233
in scheme: scheme
notation: 003233
scope note: 運営会社: 東武鉄道。路線名: 東上本線。鉄道区分: 普通鉄道（12）。事業者種別: 民営鉄道（4）。

市川大野
type: Concept
alternative label: 市川大野（東日本旅客鉄道 武蔵野線）
broader: g003234
in scheme: scheme
notation: 003234
scope note: 運営会社: 東日本旅客鉄道。路線名: 武蔵野線。鉄道区分: 普通鉄道JR（11）。事業者種別: JR在来線（2）。

足立小台
type: Concept
alternative label: 足立小台（東京都 日暮里・舎人ライナー）
broader: g003235
in scheme: scheme
notation: 003235
scope note: 運営会社: 東京都。路線名: 日暮里・舎人ライナー。鉄道区分: 案内軌条式（24）。事業者種別: 公営鉄道（3）。

王子
type: Concept
alternative label: 王子（東京地下鉄 7号線南北線）
broader: g003236
in scheme: scheme
notation: 003236
scope note: 運営会社: 東京地下鉄。路線名: 7号線南北線。鉄道区分: 普通鉄道（12）。事業者種別: 民営鉄道（4）。

芝山千代田
type: Concept
alternative label: 芝山千代田（芝山鉄道 芝山鉄道線）
broader: g003237
in scheme: scheme
notation: 003237
scope note: 運営会社: 芝山鉄道。路線名: 芝山鉄道線。鉄道区分: 普通鉄道（12）。事業者種別: 第三セクター（5）。

二和向台
type: Concept
alternative label: 二和向台（京成電鉄 松戸線）
broader: g003238
in scheme: scheme
notation: 003238
scope note: 運営会社: 京成電鉄。路線名: 松戸線。鉄道区分: 普通鉄道（12）。事業者種別: 民営鉄道（4）。

王子駅前
type: Concept
alternative label: 王子駅前（東京都 荒川線）
broader: g003239
in scheme: scheme
notation: 003239
scope note: 運営会社: 東京都。路線名: 荒川線。鉄道区分: 軌道（21）。事業者種別: 公営鉄道（3）。

宗吾参道
type: Concept
alternative label: 宗吾参道（京成電鉄 本線）
broader: g003240
in scheme: scheme
notation: 003240
scope note: 運営会社: 京成電鉄。路線名: 本線。鉄道区分: 普通鉄道（12）。事業者種別: 民営鉄道（4）。

王子
type: Concept
alternative label: 王子（東日本旅客鉄道 東北線）
broader: g003236
in scheme: scheme
notation: 003241
scope note: 運営会社: 東日本旅客鉄道。路線名: 東北線。鉄道区分: 普通鉄道JR（11）。事業者種別: JR在来線（2）。

ひばりヶ丘
type: Concept
alternative label: ひばりヶ丘（西武鉄道 池袋線）
broader: g003242
in scheme: scheme
notation: 003242
scope note: 運営会社: 西武鉄道。路線名: 池袋線。鉄道区分: 普通鉄道（12）。事業者種別: 民営鉄道（4）。

練馬春日町
type: Concept
alternative label: 練馬春日町（東京都 12号線大江戸線）
broader: g003243
in scheme: scheme
notation: 003243
scope note: 運営会社: 東京都。路線名: 12号線大江戸線。鉄道区分: 普通鉄道（12）。事業者種別: 公営鉄道（3）。

新柴又
type: Concept
alternative label: 新柴又（北総鉄道 北総線）
broader: g003244
in scheme: scheme
notation: 003244
scope note: 運営会社: 北総鉄道。路線名: 北総線。鉄道区分: 普通鉄道（12）。事業者種別: 第三セクター（5）。

板橋区役所前
type: Concept
alternative label: 板橋区役所前（東京都 6号線三田線）
broader: g003245
in scheme: scheme
notation: 003245
scope note: 運営会社: 東京都。路線名: 6号線三田線。鉄道区分: 普通鉄道（12）。事業者種別: 公営鉄道（3）。

梶原
type: Concept
alternative label: 梶原（東京都 荒川線）
broader: g003246
in scheme: scheme
notation: 003246
scope note: 運営会社: 東京都。路線名: 荒川線。鉄道区分: 軌道（21）。事業者種別: 公営鉄道（3）。

穴山
type: Concept
alternative label: 穴山（東日本旅客鉄道 中央線）
broader: g003247
in scheme: scheme
notation: 003247
scope note: 運営会社: 東日本旅客鉄道。路線名: 中央線。鉄道区分: 普通鉄道JR（11）。事業者種別: JR在来線（2）。

京成高砂
type: Concept
alternative label: 京成高砂（京成電鉄 金町線）
broader: g003248
in scheme: scheme
notation: 003248
scope note: 運営会社: 京成電鉄。路線名: 金町線。鉄道区分: 普通鉄道（12）。事業者種別: 民営鉄道（4）。

京成高砂
type: Concept
alternative label: 京成高砂（京成電鉄 成田空港線）
broader: g003248
in scheme: scheme
notation: 003249
scope note: 運営会社: 京成電鉄。路線名: 成田空港線。鉄道区分: 普通鉄道（12）。事業者種別: 民営鉄道（4）。

京成高砂
type: Concept
alternative label: 京成高砂（京成電鉄 本線）
broader: g003248
in scheme: scheme
notation: 003250
scope note: 運営会社: 京成電鉄。路線名: 本線。鉄道区分: 普通鉄道（12）。事業者種別: 民営鉄道（4）。

京成高砂
type: Concept
alternative label: 京成高砂（北総鉄道 北総線）
broader: g003248
in scheme: scheme
notation: 003251
scope note: 運営会社: 北総鉄道。路線名: 北総線。鉄道区分: 普通鉄道（12）。事業者種別: 第三セクター（5）。

荒川車庫前
type: Concept
alternative label: 荒川車庫前（東京都 荒川線）
broader: g003252
in scheme: scheme
notation: 003252
scope note: 運営会社: 東京都。路線名: 荒川線。鉄道区分: 軌道（21）。事業者種別: 公営鉄道（3）。

栄町
type: Concept
alternative label: 栄町（東京都 荒川線）
broader: g003253
in scheme: scheme
notation: 003253
scope note: 運営会社: 東京都。路線名: 荒川線。鉄道区分: 軌道（21）。事業者種別: 公営鉄道（3）。

荒川遊園地前
type: Concept
alternative label: 荒川遊園地前（東京都 荒川線）
broader: g003254
in scheme: scheme
notation: 003254
scope note: 運営会社: 東京都。路線名: 荒川線。鉄道区分: 軌道（21）。事業者種別: 公営鉄道（3）。

小台
type: Concept
alternative label: 小台（東京都 荒川線）
broader: g003255
in scheme: scheme
notation: 003255
scope note: 運営会社: 東京都。路線名: 荒川線。鉄道区分: 軌道（21）。事業者種別: 公営鉄道（3）。

飛鳥山
type: Concept
alternative label: 飛鳥山（東京都 荒川線）
broader: g003256
in scheme: scheme
notation: 003256
scope note: 運営会社: 東京都。路線名: 荒川線。鉄道区分: 軌道（21）。事業者種別: 公営鉄道（3）。

北千住
type: Concept
alternative label: 北千住（東京地下鉄 2号線日比谷線）
broader: g003260
in scheme: scheme
notation: 003257
scope note: 運営会社: 東京地下鉄。路線名: 2号線日比谷線。鉄道区分: 普通鉄道（12）。事業者種別: 民営鉄道（4）。

北千住
type: Concept
alternative label: 北千住（東武鉄道 伊勢崎線）
broader: g003260
in scheme: scheme
notation: 003258
scope note: 運営会社: 東武鉄道。路線名: 伊勢崎線。鉄道区分: 普通鉄道（12）。事業者種別: 民営鉄道（4）。

宮ノ前
type: Concept
alternative label: 宮ノ前（東京都 荒川線）
broader: g003259
in scheme: scheme
notation: 003259
scope note: 運営会社: 東京都。路線名: 荒川線。鉄道区分: 軌道（21）。事業者種別: 公営鉄道（3）。

北千住
type: Concept
alternative label: 北千住（首都圏新都市鉄道 常磐新線）
broader: g003260
in scheme: scheme
notation: 003260
scope note: 運営会社: 首都圏新都市鉄道。路線名: 常磐新線。鉄道区分: 普通鉄道（12）。事業者種別: 第三セクター（5）。

氷川台
type: Concept
alternative label: 氷川台（東京地下鉄 8号線有楽町線）
broader: g003261
in scheme: scheme
notation: 003261
scope note: 運営会社: 東京地下鉄。路線名: 8号線有楽町線。鉄道区分: 普通鉄道（12）。事業者種別: 民営鉄道（4）。

久米川
type: Concept
alternative label: 久米川（西武鉄道 新宿線）
broader: g003262
in scheme: scheme
notation: 003262
scope note: 運営会社: 西武鉄道。路線名: 新宿線。鉄道区分: 普通鉄道（12）。事業者種別: 民営鉄道（4）。

大泉学園
type: Concept
alternative label: 大泉学園（西武鉄道 池袋線）
broader: g003263
in scheme: scheme
notation: 003263
scope note: 運営会社: 西武鉄道。路線名: 池袋線。鉄道区分: 普通鉄道（12）。事業者種別: 民営鉄道（4）。

北千住
type: Concept
alternative label: 北千住（東京地下鉄 9号線千代田線）
broader: g003260
in scheme: scheme
notation: 003264
scope note: 運営会社: 東京地下鉄。路線名: 9号線千代田線。鉄道区分: 普通鉄道（12）。事業者種別: 民営鉄道（4）。

三咲
type: Concept
alternative label: 三咲（京成電鉄 松戸線）
broader: g003265
in scheme: scheme
notation: 003265
scope note: 運営会社: 京成電鉄。路線名: 松戸線。鉄道区分: 普通鉄道（12）。事業者種別: 民営鉄道（4）。

熊野前
type: Concept
alternative label: 熊野前（東京都 荒川線）
broader: g003266
in scheme: scheme
notation: 003266
scope note: 運営会社: 東京都。路線名: 荒川線。鉄道区分: 軌道（21）。事業者種別: 公営鉄道（3）。

北千住
type: Concept
alternative label: 北千住（東日本旅客鉄道 常磐線）
broader: g003260
in scheme: scheme
notation: 003267
scope note: 運営会社: 東日本旅客鉄道。路線名: 常磐線。鉄道区分: 普通鉄道JR（11）。事業者種別: JR在来線（2）。

新板橋
type: Concept
alternative label: 新板橋（東京都 6号線三田線）
broader: g003268
in scheme: scheme
notation: 003268
scope note: 運営会社: 東京都。路線名: 6号線三田線。鉄道区分: 普通鉄道（12）。事業者種別: 公営鉄道（3）。

大山
type: Concept
alternative label: 大山（東武鉄道 東上本線）
broader: g003269
in scheme: scheme
notation: 003269
scope note: 運営会社: 東武鉄道。路線名: 東上本線。鉄道区分: 普通鉄道（12）。事業者種別: 民営鉄道（4）。

熊野前
type: Concept
alternative label: 熊野前（東京都 日暮里・舎人ライナー）
broader: g003266
in scheme: scheme
notation: 003270
scope note: 運営会社: 東京都。路線名: 日暮里・舎人ライナー。鉄道区分: 案内軌条式（24）。事業者種別: 公営鉄道（3）。

保谷
type: Concept
alternative label: 保谷（西武鉄道 池袋線）
broader: g003271
in scheme: scheme
notation: 003271
scope note: 運営会社: 西武鉄道。路線名: 池袋線。鉄道区分: 普通鉄道（12）。事業者種別: 民営鉄道（4）。

大田切
type: Concept
alternative label: 大田切（東海旅客鉄道 飯田線）
broader: g003272
in scheme: scheme
notation: 003272
scope note: 運営会社: 東海旅客鉄道。路線名: 飯田線。鉄道区分: 普通鉄道JR（11）。事業者種別: JR在来線（2）。

堀切菖蒲園
type: Concept
alternative label: 堀切菖蒲園（京成電鉄 本線）
broader: g003273
in scheme: scheme
notation: 003273
scope note: 運営会社: 京成電鉄。路線名: 本線。鉄道区分: 普通鉄道（12）。事業者種別: 民営鉄道（4）。

お花茶屋
type: Concept
alternative label: お花茶屋（京成電鉄 本線）
broader: g003274
in scheme: scheme
notation: 003274
scope note: 運営会社: 京成電鉄。路線名: 本線。鉄道区分: 普通鉄道（12）。事業者種別: 民営鉄道（4）。

猿田
type: Concept
alternative label: 猿田（東日本旅客鉄道 総武線）
broader: g003275
in scheme: scheme
notation: 003275
scope note: 運営会社: 東日本旅客鉄道。路線名: 総武線。鉄道区分: 普通鉄道JR（11）。事業者種別: JR在来線（2）。

滝野川一丁目
type: Concept
alternative label: 滝野川一丁目（東京都 荒川線）
broader: g003276
in scheme: scheme
notation: 003276
scope note: 運営会社: 東京都。路線名: 荒川線。鉄道区分: 軌道（21）。事業者種別: 公営鉄道（3）。

上中里
type: Concept
alternative label: 上中里（東日本旅客鉄道 東北線）
broader: g003277
in scheme: scheme
notation: 003277
scope note: 運営会社: 東日本旅客鉄道。路線名: 東北線。鉄道区分: 普通鉄道JR（11）。事業者種別: JR在来線（2）。

尾久
type: Concept
alternative label: 尾久（東日本旅客鉄道 東北線）
broader: g003278
in scheme: scheme
notation: 003278
scope note: 運営会社: 東日本旅客鉄道。路線名: 東北線。鉄道区分: 普通鉄道JR（11）。事業者種別: JR在来線（2）。

西ヶ原
type: Concept
alternative label: 西ヶ原（東京地下鉄 7号線南北線）
broader: g003279
in scheme: scheme
notation: 003279
scope note: 運営会社: 東京地下鉄。路線名: 7号線南北線。鉄道区分: 普通鉄道（12）。事業者種別: 民営鉄道（4）。

青砥
type: Concept
alternative label: 青砥（京成電鉄 押上線）
broader: g003280
in scheme: scheme
notation: 003280
scope note: 運営会社: 京成電鉄。路線名: 押上線。鉄道区分: 普通鉄道（12）。事業者種別: 民営鉄道（4）。

青砥
type: Concept
alternative label: 青砥（京成電鉄 本線）
broader: g003280
in scheme: scheme
notation: 003281
scope note: 運営会社: 京成電鉄。路線名: 本線。鉄道区分: 普通鉄道（12）。事業者種別: 民営鉄道（4）。

東福生
type: Concept
alternative label: 東福生（東日本旅客鉄道 八高線）
broader: g003282
in scheme: scheme
notation: 003282
scope note: 運営会社: 東日本旅客鉄道。路線名: 八高線。鉄道区分: 普通鉄道JR（11）。事業者種別: JR在来線（2）。

上北台
type: Concept
alternative label: 上北台（多摩都市モノレール 多摩都市モノレール線）
broader: g003283
in scheme: scheme
notation: 003283
scope note: 運営会社: 多摩都市モノレール。路線名: 多摩都市モノレール線。鉄道区分: 跨座式モノレール（23）。事業者種別: 第三セクター（5）。

東尾久三丁目
type: Concept
alternative label: 東尾久三丁目（東京都 荒川線）
broader: g003284
in scheme: scheme
notation: 003284
scope note: 運営会社: 東京都。路線名: 荒川線。鉄道区分: 軌道（21）。事業者種別: 公営鉄道（3）。

下板橋
type: Concept
alternative label: 下板橋（東武鉄道 東上本線）
broader: g003285
in scheme: scheme
notation: 003285
scope note: 運営会社: 東武鉄道。路線名: 東上本線。鉄道区分: 普通鉄道（12）。事業者種別: 民営鉄道（4）。

板橋
type: Concept
alternative label: 板橋（東日本旅客鉄道 赤羽線）
broader: g003286
in scheme: scheme
notation: 003286
scope note: 運営会社: 東日本旅客鉄道。路線名: 赤羽線。鉄道区分: 普通鉄道JR（11）。事業者種別: JR在来線（2）。

八坂
type: Concept
alternative label: 八坂（西武鉄道 多摩湖線）
broader: g003287
in scheme: scheme
notation: 003287
scope note: 運営会社: 西武鉄道。路線名: 多摩湖線。鉄道区分: 普通鉄道（12）。事業者種別: 民営鉄道（4）。

牛田
type: Concept
alternative label: 牛田（東武鉄道 伊勢崎線）
broader: g003288
in scheme: scheme
notation: 003288
scope note: 運営会社: 東武鉄道。路線名: 伊勢崎線。鉄道区分: 普通鉄道（12）。事業者種別: 民営鉄道（4）。

西ヶ原四丁目
type: Concept
alternative label: 西ヶ原四丁目（東京都 荒川線）
broader: g003289
in scheme: scheme
notation: 003289
scope note: 運営会社: 東京都。路線名: 荒川線。鉄道区分: 軌道（21）。事業者種別: 公営鉄道（3）。

京成関屋
type: Concept
alternative label: 京成関屋（京成電鉄 本線）
broader: g003290
in scheme: scheme
notation: 003290
scope note: 運営会社: 京成電鉄。路線名: 本線。鉄道区分: 普通鉄道（12）。事業者種別: 民営鉄道（4）。

町屋二丁目
type: Concept
alternative label: 町屋二丁目（東京都 荒川線）
broader: g003291
in scheme: scheme
notation: 003291
scope note: 運営会社: 東京都。路線名: 荒川線。鉄道区分: 軌道（21）。事業者種別: 公営鉄道（3）。

石神井公園
type: Concept
alternative label: 石神井公園（西武鉄道 池袋線）
broader: g003292
in scheme: scheme
notation: 003292
scope note: 運営会社: 西武鉄道。路線名: 池袋線。鉄道区分: 普通鉄道（12）。事業者種別: 民営鉄道（4）。

西巣鴨
type: Concept
alternative label: 西巣鴨（東京都 6号線三田線）
broader: g003293
in scheme: scheme
notation: 003293
scope note: 運営会社: 東京都。路線名: 6号線三田線。鉄道区分: 普通鉄道（12）。事業者種別: 公営鉄道（3）。

小竹向原
type: Concept
alternative label: 小竹向原（東京地下鉄 13号線副都心線）
broader: g003294
in scheme: scheme
notation: 003294
scope note: 運営会社: 東京地下鉄。路線名: 13号線副都心線。鉄道区分: 普通鉄道（12）。事業者種別: 民営鉄道（4）。

小竹向原
type: Concept
alternative label: 小竹向原（東京地下鉄 8号線有楽町線）
broader: g003294
in scheme: scheme
notation: 003295
scope note: 運営会社: 東京地下鉄。路線名: 8号線有楽町線。鉄道区分: 普通鉄道（12）。事業者種別: 民営鉄道（4）。

小竹向原
type: Concept
alternative label: 小竹向原（西武鉄道 西武有楽町線）
broader: g003294
in scheme: scheme
notation: 003296
scope note: 運営会社: 西武鉄道。路線名: 西武有楽町線。鉄道区分: 普通鉄道（12）。事業者種別: 民営鉄道（4）。

堀切
type: Concept
alternative label: 堀切（東武鉄道 伊勢崎線）
broader: g003297
in scheme: scheme
notation: 003297
scope note: 運営会社: 東武鉄道。路線名: 伊勢崎線。鉄道区分: 普通鉄道（12）。事業者種別: 民営鉄道（4）。

赤土小学校前
type: Concept
alternative label: 赤土小学校前（東京都 日暮里・舎人ライナー）
broader: g003298
in scheme: scheme
notation: 003298
scope note: 運営会社: 東京都。路線名: 日暮里・舎人ライナー。鉄道区分: 案内軌条式（24）。事業者種別: 公営鉄道（3）。

町屋駅前
type: Concept
alternative label: 町屋駅前（東京都 荒川線）
broader: g003299
in scheme: scheme
notation: 003299
scope note: 運営会社: 東京都。路線名: 荒川線。鉄道区分: 軌道（21）。事業者種別: 公営鉄道（3）。

福生
type: Concept
alternative label: 福生（東日本旅客鉄道 青梅線）
broader: g003300
in scheme: scheme
notation: 003300
scope note: 運営会社: 東日本旅客鉄道。路線名: 青梅線。鉄道区分: 普通鉄道JR（11）。事業者種別: JR在来線（2）。

千住大橋
type: Concept
alternative label: 千住大橋（京成電鉄 本線）
broader: g003301
in scheme: scheme
notation: 003301
scope note: 運営会社: 京成電鉄。路線名: 本線。鉄道区分: 普通鉄道（12）。事業者種別: 民営鉄道（4）。

町屋
type: Concept
alternative label: 町屋（京成電鉄 本線）
broader: g003302
in scheme: scheme
notation: 003302
scope note: 運営会社: 京成電鉄。路線名: 本線。鉄道区分: 普通鉄道（12）。事業者種別: 民営鉄道（4）。

京成小岩
type: Concept
alternative label: 京成小岩（京成電鉄 本線）
broader: g003303
in scheme: scheme
notation: 003303
scope note: 運営会社: 京成電鉄。路線名: 本線。鉄道区分: 普通鉄道（12）。事業者種別: 民営鉄道（4）。

町屋
type: Concept
alternative label: 町屋（東京地下鉄 9号線千代田線）
broader: g003302
in scheme: scheme
notation: 003304
scope note: 運営会社: 東京地下鉄。路線名: 9号線千代田線。鉄道区分: 普通鉄道（12）。事業者種別: 民営鉄道（4）。

豊島園
type: Concept
alternative label: 豊島園（西武鉄道 豊島線）
broader: g003305
in scheme: scheme
notation: 003305
scope note: 運営会社: 西武鉄道。路線名: 豊島線。鉄道区分: 普通鉄道（12）。事業者種別: 民営鉄道（4）。

荒川七丁目
type: Concept
alternative label: 荒川七丁目（東京都 荒川線）
broader: g003306
in scheme: scheme
notation: 003306
scope note: 運営会社: 東京都。路線名: 荒川線。鉄道区分: 軌道（21）。事業者種別: 公営鉄道（3）。

馬込沢
type: Concept
alternative label: 馬込沢（東武鉄道 野田線）
broader: g003307
in scheme: scheme
notation: 003307
scope note: 運営会社: 東武鉄道。路線名: 野田線。鉄道区分: 普通鉄道（12）。事業者種別: 民営鉄道（4）。

郡上八幡
type: Concept
alternative label: 郡上八幡（長良川鉄道 越美南線）
broader: g003308
in scheme: scheme
notation: 003308
scope note: 運営会社: 長良川鉄道。路線名: 越美南線。鉄道区分: 普通鉄道（12）。事業者種別: 第三セクター（5）。

豊島園
type: Concept
alternative label: 豊島園（東京都 12号線大江戸線）
broader: g003305
in scheme: scheme
notation: 003309
scope note: 運営会社: 東京都。路線名: 12号線大江戸線。鉄道区分: 普通鉄道（12）。事業者種別: 公営鉄道（3）。

新庚申塚
type: Concept
alternative label: 新庚申塚（東京都 荒川線）
broader: g003310
in scheme: scheme
notation: 003310
scope note: 運営会社: 東京都。路線名: 荒川線。鉄道区分: 軌道（21）。事業者種別: 公営鉄道（3）。

新桜台
type: Concept
alternative label: 新桜台（西武鉄道 西武有楽町線）
broader: g003311
in scheme: scheme
notation: 003311
scope note: 運営会社: 西武鉄道。路線名: 西武有楽町線。鉄道区分: 普通鉄道（12）。事業者種別: 民営鉄道（4）。

萩山
type: Concept
alternative label: 萩山（西武鉄道 多摩湖線）
broader: g003312
in scheme: scheme
notation: 003312
scope note: 運営会社: 西武鉄道。路線名: 多摩湖線。鉄道区分: 普通鉄道（12）。事業者種別: 民営鉄道（4）。

萩山
type: Concept
alternative label: 萩山（西武鉄道 拝島線）
broader: g003312
in scheme: scheme
notation: 003313
scope note: 運営会社: 西武鉄道。路線名: 拝島線。鉄道区分: 普通鉄道（12）。事業者種別: 民営鉄道（4）。

練馬高野台
type: Concept
alternative label: 練馬高野台（西武鉄道 池袋線）
broader: g003314
in scheme: scheme
notation: 003314
scope note: 運営会社: 西武鉄道。路線名: 池袋線。鉄道区分: 普通鉄道（12）。事業者種別: 民営鉄道（4）。

北池袋
type: Concept
alternative label: 北池袋（東武鉄道 東上本線）
broader: g003315
in scheme: scheme
notation: 003315
scope note: 運営会社: 東武鉄道。路線名: 東上本線。鉄道区分: 普通鉄道（12）。事業者種別: 民営鉄道（4）。

中学校
type: Concept
alternative label: 中学校（山万 ユーカリが丘線）
broader: g003316
in scheme: scheme
notation: 003316
scope note: 運営会社: 山万。路線名: ユーカリが丘線。鉄道区分: 案内軌条式鉄道（16）。事業者種別: 民営鉄道（4）。

松岸
type: Concept
alternative label: 松岸（東日本旅客鉄道 成田線）
broader: g003317
in scheme: scheme
notation: 003317
scope note: 運営会社: 東日本旅客鉄道。路線名: 成田線。鉄道区分: 普通鉄道JR（11）。事業者種別: JR在来線（2）。

松岸
type: Concept
alternative label: 松岸（東日本旅客鉄道 総武線）
broader: g003317
in scheme: scheme
notation: 003318
scope note: 運営会社: 東日本旅客鉄道。路線名: 総武線。鉄道区分: 普通鉄道JR（11）。事業者種別: JR在来線（2）。

庚申塚
type: Concept
alternative label: 庚申塚（東京都 荒川線）
broader: g003319
in scheme: scheme
notation: 003319
scope note: 運営会社: 東京都。路線名: 荒川線。鉄道区分: 軌道（21）。事業者種別: 公営鉄道（3）。

桜街道
type: Concept
alternative label: 桜街道（多摩都市モノレール 多摩都市モノレール線）
broader: g003320
in scheme: scheme
notation: 003320
scope note: 運営会社: 多摩都市モノレール。路線名: 多摩都市モノレール線。鉄道区分: 跨座式モノレール（23）。事業者種別: 第三セクター（5）。

桜台
type: Concept
alternative label: 桜台（西武鉄道 池袋線）
broader: g003321
in scheme: scheme
notation: 003321
scope note: 運営会社: 西武鉄道。路線名: 池袋線。鉄道区分: 普通鉄道（12）。事業者種別: 民営鉄道（4）。

荒川二丁目
type: Concept
alternative label: 荒川二丁目（東京都 荒川線）
broader: g003322
in scheme: scheme
notation: 003322
scope note: 運営会社: 東京都。路線名: 荒川線。鉄道区分: 軌道（21）。事業者種別: 公営鉄道（3）。

京成立石
type: Concept
alternative label: 京成立石（京成電鉄 押上線）
broader: g003323
in scheme: scheme
notation: 003323
scope note: 運営会社: 京成電鉄。路線名: 押上線。鉄道区分: 普通鉄道（12）。事業者種別: 民営鉄道（4）。

千川
type: Concept
alternative label: 千川（東京地下鉄 13号線副都心線）
broader: g003324
in scheme: scheme
notation: 003324
scope note: 運営会社: 東京地下鉄。路線名: 13号線副都心線。鉄道区分: 普通鉄道（12）。事業者種別: 民営鉄道（4）。

千川
type: Concept
alternative label: 千川（東京地下鉄 8号線有楽町線）
broader: g003324
in scheme: scheme
notation: 003325
scope note: 運営会社: 東京地下鉄。路線名: 8号線有楽町線。鉄道区分: 普通鉄道（12）。事業者種別: 民営鉄道（4）。

女子大
type: Concept
alternative label: 女子大（山万 ユーカリが丘線）
broader: g003326
in scheme: scheme
notation: 003326
scope note: 運営会社: 山万。路線名: ユーカリが丘線。鉄道区分: 案内軌条式鉄道（16）。事業者種別: 民営鉄道（4）。

滝不動
type: Concept
alternative label: 滝不動（京成電鉄 松戸線）
broader: g003327
in scheme: scheme
notation: 003327
scope note: 運営会社: 京成電鉄。路線名: 松戸線。鉄道区分: 普通鉄道（12）。事業者種別: 民営鉄道（4）。

練馬
type: Concept
alternative label: 練馬（西武鉄道 西武有楽町線）
broader: g003328
in scheme: scheme
notation: 003328
scope note: 運営会社: 西武鉄道。路線名: 西武有楽町線。鉄道区分: 普通鉄道（12）。事業者種別: 民営鉄道（4）。

練馬
type: Concept
alternative label: 練馬（西武鉄道 池袋線）
broader: g003328
in scheme: scheme
notation: 003329
scope note: 運営会社: 西武鉄道。路線名: 池袋線。鉄道区分: 普通鉄道（12）。事業者種別: 民営鉄道（4）。

練馬
type: Concept
alternative label: 練馬（西武鉄道 豊島線）
broader: g003328
in scheme: scheme
notation: 003330
scope note: 運営会社: 西武鉄道。路線名: 豊島線。鉄道区分: 普通鉄道（12）。事業者種別: 民営鉄道（4）。

江戸川
type: Concept
alternative label: 江戸川（京成電鉄 本線）
broader: g003331
in scheme: scheme
notation: 003331
scope note: 運営会社: 京成電鉄。路線名: 本線。鉄道区分: 普通鉄道（12）。事業者種別: 民営鉄道（4）。

倉橋
type: Concept
alternative label: 倉橋（東日本旅客鉄道 総武線）
broader: g003332
in scheme: scheme
notation: 003332
scope note: 運営会社: 東日本旅客鉄道。路線名: 総武線。鉄道区分: 普通鉄道JR（11）。事業者種別: JR在来線（2）。

小川
type: Concept
alternative label: 小川（西武鉄道 国分寺線）
broader: g003333
in scheme: scheme
notation: 003333
scope note: 運営会社: 西武鉄道。路線名: 国分寺線。鉄道区分: 普通鉄道（12）。事業者種別: 民営鉄道（4）。

小川
type: Concept
alternative label: 小川（西武鉄道 拝島線）
broader: g003333
in scheme: scheme
notation: 003334
scope note: 運営会社: 西武鉄道。路線名: 拝島線。鉄道区分: 普通鉄道（12）。事業者種別: 民営鉄道（4）。

田端
type: Concept
alternative label: 田端（東日本旅客鉄道 山手線）
broader: g003335
in scheme: scheme
notation: 003335
scope note: 運営会社: 東日本旅客鉄道。路線名: 山手線。鉄道区分: 普通鉄道JR（11）。事業者種別: JR在来線（2）。

田端
type: Concept
alternative label: 田端（東日本旅客鉄道 東北線）
broader: g003335
in scheme: scheme
notation: 003336
scope note: 運営会社: 東日本旅客鉄道。路線名: 東北線。鉄道区分: 普通鉄道JR（11）。事業者種別: JR在来線（2）。

江古田
type: Concept
alternative label: 江古田（西武鉄道 池袋線）
broader: g003337
in scheme: scheme
notation: 003337
scope note: 運営会社: 西武鉄道。路線名: 池袋線。鉄道区分: 普通鉄道（12）。事業者種別: 民営鉄道（4）。

練馬
type: Concept
alternative label: 練馬（東京都 12号線大江戸線）
broader: g003328
in scheme: scheme
notation: 003338
scope note: 運営会社: 東京都。路線名: 12号線大江戸線。鉄道区分: 普通鉄道（12）。事業者種別: 公営鉄道（3）。

新三河島
type: Concept
alternative label: 新三河島（京成電鉄 本線）
broader: g003339
in scheme: scheme
notation: 003339
scope note: 運営会社: 京成電鉄。路線名: 本線。鉄道区分: 普通鉄道（12）。事業者種別: 民営鉄道（4）。

小平
type: Concept
alternative label: 小平（西武鉄道 新宿線）
broader: g003340
in scheme: scheme
notation: 003340
scope note: 運営会社: 西武鉄道。路線名: 新宿線。鉄道区分: 普通鉄道（12）。事業者種別: 民営鉄道（4）。

小平
type: Concept
alternative label: 小平（西武鉄道 拝島線）
broader: g003340
in scheme: scheme
notation: 003341
scope note: 運営会社: 西武鉄道。路線名: 拝島線。鉄道区分: 普通鉄道（12）。事業者種別: 民営鉄道（4）。

京成酒々井
type: Concept
alternative label: 京成酒々井（京成電鉄 本線）
broader: g003342
in scheme: scheme
notation: 003342
scope note: 運営会社: 京成電鉄。路線名: 本線。鉄道区分: 普通鉄道（12）。事業者種別: 民営鉄道（4）。

駒込
type: Concept
alternative label: 駒込（東日本旅客鉄道 山手線）
broader: g003343
in scheme: scheme
notation: 003343
scope note: 運営会社: 東日本旅客鉄道。路線名: 山手線。鉄道区分: 普通鉄道JR（11）。事業者種別: JR在来線（2）。

新府
type: Concept
alternative label: 新府（東日本旅客鉄道 中央線）
broader: g003344
in scheme: scheme
notation: 003344
scope note: 運営会社: 東日本旅客鉄道。路線名: 中央線。鉄道区分: 普通鉄道JR（11）。事業者種別: JR在来線（2）。

中村橋
type: Concept
alternative label: 中村橋（西武鉄道 池袋線）
broader: g003345
in scheme: scheme
notation: 003345
scope note: 運営会社: 西武鉄道。路線名: 池袋線。鉄道区分: 普通鉄道（12）。事業者種別: 民営鉄道（4）。

国府台
type: Concept
alternative label: 国府台（京成電鉄 本線）
broader: g003346
in scheme: scheme
notation: 003346
scope note: 運営会社: 京成電鉄。路線名: 本線。鉄道区分: 普通鉄道（12）。事業者種別: 民営鉄道（4）。

駒ヶ根
type: Concept
alternative label: 駒ヶ根（東海旅客鉄道 飯田線）
broader: g003347
in scheme: scheme
notation: 003347
scope note: 運営会社: 東海旅客鉄道。路線名: 飯田線。鉄道区分: 普通鉄道JR（11）。事業者種別: JR在来線（2）。

駒込
type: Concept
alternative label: 駒込（東京地下鉄 7号線南北線）
broader: g003343
in scheme: scheme
notation: 003348
scope note: 運営会社: 東京地下鉄。路線名: 7号線南北線。鉄道区分: 普通鉄道（12）。事業者種別: 民営鉄道（4）。

富士見台
type: Concept
alternative label: 富士見台（西武鉄道 池袋線）
broader: g003349
in scheme: scheme
notation: 003349
scope note: 運営会社: 西武鉄道。路線名: 池袋線。鉄道区分: 普通鉄道（12）。事業者種別: 民営鉄道（4）。

荒川区役所前
type: Concept
alternative label: 荒川区役所前（東京都 荒川線）
broader: g003350
in scheme: scheme
notation: 003350
scope note: 運営会社: 東京都。路線名: 荒川線。鉄道区分: 軌道（21）。事業者種別: 公営鉄道（3）。

巣鴨新田
type: Concept
alternative label: 巣鴨新田（東京都 荒川線）
broader: g003351
in scheme: scheme
notation: 003351
scope note: 運営会社: 東京都。路線名: 荒川線。鉄道区分: 軌道（21）。事業者種別: 公営鉄道（3）。

南千住
type: Concept
alternative label: 南千住（東日本旅客鉄道 常磐線）
broader: g003363
in scheme: scheme
notation: 003352
scope note: 運営会社: 東日本旅客鉄道。路線名: 常磐線。鉄道区分: 普通鉄道JR（11）。事業者種別: JR在来線（2）。

牛浜
type: Concept
alternative label: 牛浜（東日本旅客鉄道 青梅線）
broader: g003353
in scheme: scheme
notation: 003353
scope note: 運営会社: 東日本旅客鉄道。路線名: 青梅線。鉄道区分: 普通鉄道JR（11）。事業者種別: JR在来線（2）。

巣鴨
type: Concept
alternative label: 巣鴨（東京都 6号線三田線）
broader: g003354
in scheme: scheme
notation: 003354
scope note: 運営会社: 東京都。路線名: 6号線三田線。鉄道区分: 普通鉄道（12）。事業者種別: 公営鉄道（3）。

鐘ヶ淵
type: Concept
alternative label: 鐘ヶ淵（東武鉄道 伊勢崎線）
broader: g003355
in scheme: scheme
notation: 003355
scope note: 運営会社: 東武鉄道。路線名: 伊勢崎線。鉄道区分: 普通鉄道（12）。事業者種別: 民営鉄道（4）。

巣鴨
type: Concept
alternative label: 巣鴨（東日本旅客鉄道 山手線）
broader: g003354
in scheme: scheme
notation: 003356
scope note: 運営会社: 東日本旅客鉄道。路線名: 山手線。鉄道区分: 普通鉄道JR（11）。事業者種別: JR在来線（2）。

荒川一中前
type: Concept
alternative label: 荒川一中前（東京都 荒川線）
broader: g003357
in scheme: scheme
notation: 003357
scope note: 運営会社: 東京都。路線名: 荒川線。鉄道区分: 軌道（21）。事業者種別: 公営鉄道（3）。

西日暮里
type: Concept
alternative label: 西日暮里（東京都 日暮里・舎人ライナー）
broader: g003368
in scheme: scheme
notation: 003358
scope note: 運営会社: 東京都。路線名: 日暮里・舎人ライナー。鉄道区分: 案内軌条式（24）。事業者種別: 公営鉄道（3）。

三河島
type: Concept
alternative label: 三河島（東日本旅客鉄道 常磐線）
broader: g003359
in scheme: scheme
notation: 003359
scope note: 運営会社: 東日本旅客鉄道。路線名: 常磐線。鉄道区分: 普通鉄道JR（11）。事業者種別: JR在来線（2）。

小岩
type: Concept
alternative label: 小岩（東日本旅客鉄道 総武線）
broader: g003360
in scheme: scheme
notation: 003360
scope note: 運営会社: 東日本旅客鉄道。路線名: 総武線。鉄道区分: 普通鉄道JR（11）。事業者種別: JR在来線（2）。

要町
type: Concept
alternative label: 要町（東京地下鉄 13号線副都心線）
broader: g003361
in scheme: scheme
notation: 003361
scope note: 運営会社: 東京地下鉄。路線名: 13号線副都心線。鉄道区分: 普通鉄道（12）。事業者種別: 民営鉄道（4）。

要町
type: Concept
alternative label: 要町（東京地下鉄 8号線有楽町線）
broader: g003361
in scheme: scheme
notation: 003362
scope note: 運営会社: 東京地下鉄。路線名: 8号線有楽町線。鉄道区分: 普通鉄道（12）。事業者種別: 民営鉄道（4）。

南千住
type: Concept
alternative label: 南千住（首都圏新都市鉄道 常磐新線）
broader: g003363
in scheme: scheme
notation: 003363
scope note: 運営会社: 首都圏新都市鉄道。路線名: 常磐新線。鉄道区分: 普通鉄道（12）。事業者種別: 第三セクター（5）。

倉本
type: Concept
alternative label: 倉本（東海旅客鉄道 中央線）
broader: g003364
in scheme: scheme
notation: 003364
scope note: 運営会社: 東海旅客鉄道。路線名: 中央線。鉄道区分: 普通鉄道JR（11）。事業者種別: JR在来線（2）。

東大和市
type: Concept
alternative label: 東大和市（西武鉄道 拝島線）
broader: g003365
in scheme: scheme
notation: 003365
scope note: 運営会社: 西武鉄道。路線名: 拝島線。鉄道区分: 普通鉄道（12）。事業者種別: 民営鉄道（4）。

井野
type: Concept
alternative label: 井野（山万 ユーカリが丘線）
broader: g003366
in scheme: scheme
notation: 003366
scope note: 運営会社: 山万。路線名: ユーカリが丘線。鉄道区分: 案内軌条式鉄道（16）。事業者種別: 民営鉄道（4）。

新江古田
type: Concept
alternative label: 新江古田（東京都 12号線大江戸線）
broader: g003367
in scheme: scheme
notation: 003367
scope note: 運営会社: 東京都。路線名: 12号線大江戸線。鉄道区分: 普通鉄道（12）。事業者種別: 公営鉄道（3）。

西日暮里
type: Concept
alternative label: 西日暮里（東京地下鉄 9号線千代田線）
broader: g003368
in scheme: scheme
notation: 003368
scope note: 運営会社: 東京地下鉄。路線名: 9号線千代田線。鉄道区分: 普通鉄道（12）。事業者種別: 民営鉄道（4）。

南千住
type: Concept
alternative label: 南千住（東京地下鉄 2号線日比谷線）
broader: g003363
in scheme: scheme
notation: 003369
scope note: 運営会社: 東京地下鉄。路線名: 2号線日比谷線。鉄道区分: 普通鉄道（12）。事業者種別: 民営鉄道（4）。

三ノ輪橋
type: Concept
alternative label: 三ノ輪橋（東京都 荒川線）
broader: g003370
in scheme: scheme
notation: 003370
scope note: 運営会社: 東京都。路線名: 荒川線。鉄道区分: 軌道（21）。事業者種別: 公営鉄道（3）。

玉川上水
type: Concept
alternative label: 玉川上水（多摩都市モノレール 多摩都市モノレール線）
broader: g003371
in scheme: scheme
notation: 003371
scope note: 運営会社: 多摩都市モノレール。路線名: 多摩都市モノレール線。鉄道区分: 跨座式モノレール（23）。事業者種別: 第三セクター（5）。

武蔵五日市
type: Concept
alternative label: 武蔵五日市（東日本旅客鉄道 五日市線）
broader: g003372
in scheme: scheme
notation: 003372
scope note: 運営会社: 東日本旅客鉄道。路線名: 五日市線。鉄道区分: 普通鉄道JR（11）。事業者種別: JR在来線（2）。

西日暮里
type: Concept
alternative label: 西日暮里（東日本旅客鉄道 東北線）
broader: g003368
in scheme: scheme
notation: 003373
scope note: 運営会社: 東日本旅客鉄道。路線名: 東北線。鉄道区分: 普通鉄道JR（11）。事業者種別: JR在来線（2）。

酒々井
type: Concept
alternative label: 酒々井（東日本旅客鉄道 成田線）
broader: g003374
in scheme: scheme
notation: 003374
scope note: 運営会社: 東日本旅客鉄道。路線名: 成田線。鉄道区分: 普通鉄道JR（11）。事業者種別: JR在来線（2）。

大塚
type: Concept
alternative label: 大塚（東日本旅客鉄道 山手線）
broader: g003375
in scheme: scheme
notation: 003375
scope note: 運営会社: 東日本旅客鉄道。路線名: 山手線。鉄道区分: 普通鉄道JR（11）。事業者種別: JR在来線（2）。

四ツ木
type: Concept
alternative label: 四ツ木（京成電鉄 押上線）
broader: g003376
in scheme: scheme
notation: 003376
scope note: 運営会社: 京成電鉄。路線名: 押上線。鉄道区分: 普通鉄道（12）。事業者種別: 民営鉄道（4）。

玉川上水
type: Concept
alternative label: 玉川上水（西武鉄道 拝島線）
broader: g003371
in scheme: scheme
notation: 003377
scope note: 運営会社: 西武鉄道。路線名: 拝島線。鉄道区分: 普通鉄道（12）。事業者種別: 民営鉄道（4）。

大塚駅前
type: Concept
alternative label: 大塚駅前（東京都 荒川線）
broader: g003378
in scheme: scheme
notation: 003378
scope note: 運営会社: 東京都。路線名: 荒川線。鉄道区分: 軌道（21）。事業者種別: 公営鉄道（3）。

池袋
type: Concept
alternative label: 池袋（東京地下鉄 13号線副都心線）
broader: g003379
in scheme: scheme
notation: 003379
scope note: 運営会社: 東京地下鉄。路線名: 13号線副都心線。鉄道区分: 普通鉄道（12）。事業者種別: 民営鉄道（4）。

市川真間
type: Concept
alternative label: 市川真間（京成電鉄 本線）
broader: g003380
in scheme: scheme
notation: 003380
scope note: 運営会社: 京成電鉄。路線名: 本線。鉄道区分: 普通鉄道（12）。事業者種別: 民営鉄道（4）。

池袋
type: Concept
alternative label: 池袋（東武鉄道 東上本線）
broader: g003390
in scheme: scheme
notation: 003381
scope note: 運営会社: 東武鉄道。路線名: 東上本線。鉄道区分: 普通鉄道（12）。事業者種別: 民営鉄道（4）。

青梅街道
type: Concept
alternative label: 青梅街道（西武鉄道 多摩湖線）
broader: g003382
in scheme: scheme
notation: 003382
scope note: 運営会社: 西武鉄道。路線名: 多摩湖線。鉄道区分: 普通鉄道（12）。事業者種別: 民営鉄道（4）。

武蔵増戸
type: Concept
alternative label: 武蔵増戸（東日本旅客鉄道 五日市線）
broader: g003383
in scheme: scheme
notation: 003383
scope note: 運営会社: 東日本旅客鉄道。路線名: 五日市線。鉄道区分: 普通鉄道JR（11）。事業者種別: JR在来線（2）。

本銚子
type: Concept
alternative label: 本銚子（銚子電気鉄道 銚子電気鉄道線）
broader: g003384
in scheme: scheme
notation: 003384
scope note: 運営会社: 銚子電気鉄道。路線名: 銚子電気鉄道線。鉄道区分: 普通鉄道（12）。事業者種別: 民営鉄道（4）。

新小平
type: Concept
alternative label: 新小平（東日本旅客鉄道 武蔵野線）
broader: g003385
in scheme: scheme
notation: 003385
scope note: 運営会社: 東日本旅客鉄道。路線名: 武蔵野線。鉄道区分: 普通鉄道JR（11）。事業者種別: JR在来線（2）。

公園
type: Concept
alternative label: 公園（山万 ユーカリが丘線）
broader: g003386
in scheme: scheme
notation: 003386
scope note: 運営会社: 山万。路線名: ユーカリが丘線。鉄道区分: 案内軌条式鉄道（16）。事業者種別: 民営鉄道（4）。

船橋法典
type: Concept
alternative label: 船橋法典（東日本旅客鉄道 武蔵野線）
broader: g003387
in scheme: scheme
notation: 003387
scope note: 運営会社: 東日本旅客鉄道。路線名: 武蔵野線。鉄道区分: 普通鉄道JR（11）。事業者種別: JR在来線（2）。

高根公団
type: Concept
alternative label: 高根公団（京成電鉄 松戸線）
broader: g003388
in scheme: scheme
notation: 003388
scope note: 運営会社: 京成電鉄。路線名: 松戸線。鉄道区分: 普通鉄道（12）。事業者種別: 民営鉄道（4）。

池袋
type: Concept
alternative label: 池袋（東京地下鉄 4号線丸ノ内線）
broader: g003390
in scheme: scheme
notation: 003389
scope note: 運営会社: 東京地下鉄。路線名: 4号線丸ノ内線。鉄道区分: 普通鉄道（12）。事業者種別: 民営鉄道（4）。

池袋
type: Concept
alternative label: 池袋（東日本旅客鉄道 山手線）
broader: g003390
in scheme: scheme
notation: 003390
scope note: 運営会社: 東日本旅客鉄道。路線名: 山手線。鉄道区分: 普通鉄道JR（11）。事業者種別: JR在来線（2）。

池袋
type: Concept
alternative label: 池袋（東日本旅客鉄道 赤羽線）
broader: g003390
in scheme: scheme
notation: 003391
scope note: 運営会社: 東日本旅客鉄道。路線名: 赤羽線。鉄道区分: 普通鉄道JR（11）。事業者種別: JR在来線（2）。

京成臼井
type: Concept
alternative label: 京成臼井（京成電鉄 本線）
broader: g003392
in scheme: scheme
notation: 003392
scope note: 運営会社: 京成電鉄。路線名: 本線。鉄道区分: 普通鉄道（12）。事業者種別: 民営鉄道（4）。

東長崎
type: Concept
alternative label: 東長崎（西武鉄道 池袋線）
broader: g003393
in scheme: scheme
notation: 003393
scope note: 運営会社: 西武鉄道。路線名: 池袋線。鉄道区分: 普通鉄道（12）。事業者種別: 民営鉄道（4）。

大佐倉
type: Concept
alternative label: 大佐倉（京成電鉄 本線）
broader: g003394
in scheme: scheme
notation: 003394
scope note: 運営会社: 京成電鉄。路線名: 本線。鉄道区分: 普通鉄道（12）。事業者種別: 民営鉄道（4）。

武蔵引田
type: Concept
alternative label: 武蔵引田（東日本旅客鉄道 五日市線）
broader: g003395
in scheme: scheme
notation: 003395
scope note: 運営会社: 東日本旅客鉄道。路線名: 五日市線。鉄道区分: 普通鉄道JR（11）。事業者種別: JR在来線（2）。

飯岡
type: Concept
alternative label: 飯岡（東日本旅客鉄道 総武線）
broader: g003396
in scheme: scheme
notation: 003396
scope note: 運営会社: 東日本旅客鉄道。路線名: 総武線。鉄道区分: 普通鉄道JR（11）。事業者種別: JR在来線（2）。

銚子
type: Concept
alternative label: 銚子（東日本旅客鉄道 総武線）
broader: g003397
in scheme: scheme
notation: 003397
scope note: 運営会社: 東日本旅客鉄道。路線名: 総武線。鉄道区分: 普通鉄道JR（11）。事業者種別: JR在来線（2）。

銚子
type: Concept
alternative label: 銚子（銚子電気鉄道 銚子電気鉄道線）
broader: g003397
in scheme: scheme
notation: 003398
scope note: 運営会社: 銚子電気鉄道。路線名: 銚子電気鉄道線。鉄道区分: 普通鉄道（12）。事業者種別: 民営鉄道（4）。

三ノ輪
type: Concept
alternative label: 三ノ輪（東京地下鉄 2号線日比谷線）
broader: g003399
in scheme: scheme
notation: 003399
scope note: 運営会社: 東京地下鉄。路線名: 2号線日比谷線。鉄道区分: 普通鉄道（12）。事業者種別: 民営鉄道（4）。

池袋
type: Concept
alternative label: 池袋（東京地下鉄 8号線有楽町線）
broader: g003390
in scheme: scheme
notation: 003400
scope note: 運営会社: 東京地下鉄。路線名: 8号線有楽町線。鉄道区分: 普通鉄道（12）。事業者種別: 民営鉄道（4）。

八千代緑が丘
type: Concept
alternative label: 八千代緑が丘（東葉高速鉄道 東葉高速線）
broader: g003401
in scheme: scheme
notation: 003401
scope note: 運営会社: 東葉高速鉄道。路線名: 東葉高速線。鉄道区分: 普通鉄道（12）。事業者種別: 第三セクター（5）。

観音
type: Concept
alternative label: 観音（銚子電気鉄道 銚子電気鉄道線）
broader: g003402
in scheme: scheme
notation: 003402
scope note: 運営会社: 銚子電気鉄道。路線名: 銚子電気鉄道線。鉄道区分: 普通鉄道（12）。事業者種別: 民営鉄道（4）。

市川
type: Concept
alternative label: 市川（東日本旅客鉄道 総武線）
broader: g003403
in scheme: scheme
notation: 003403
scope note: 運営会社: 東日本旅客鉄道。路線名: 総武線。鉄道区分: 普通鉄道JR（11）。事業者種別: JR在来線（2）。

武蔵砂川
type: Concept
alternative label: 武蔵砂川（西武鉄道 拝島線）
broader: g003404
in scheme: scheme
notation: 003404
scope note: 運営会社: 西武鉄道。路線名: 拝島線。鉄道区分: 普通鉄道（12）。事業者種別: 民営鉄道（4）。

仲ノ町
type: Concept
alternative label: 仲ノ町（銚子電気鉄道 銚子電気鉄道線）
broader: g003405
in scheme: scheme
notation: 003405
scope note: 運営会社: 銚子電気鉄道。路線名: 銚子電気鉄道線。鉄道区分: 普通鉄道（12）。事業者種別: 民営鉄道（4）。

日暮里
type: Concept
alternative label: 日暮里（東京都 日暮里・舎人ライナー）
broader: g003417
in scheme: scheme
notation: 003406
scope note: 運営会社: 東京都。路線名: 日暮里・舎人ライナー。鉄道区分: 案内軌条式（24）。事業者種別: 公営鉄道（3）。

向原
type: Concept
alternative label: 向原（東京都 荒川線）
broader: g003407
in scheme: scheme
notation: 003407
scope note: 運営会社: 東京都。路線名: 荒川線。鉄道区分: 軌道（21）。事業者種別: 公営鉄道（3）。

東伏見
type: Concept
alternative label: 東伏見（西武鉄道 新宿線）
broader: g003408
in scheme: scheme
notation: 003408
scope note: 運営会社: 西武鉄道。路線名: 新宿線。鉄道区分: 普通鉄道（12）。事業者種別: 民営鉄道（4）。

西武柳沢
type: Concept
alternative label: 西武柳沢（西武鉄道 新宿線）
broader: g003409
in scheme: scheme
notation: 003409
scope note: 運営会社: 西武鉄道。路線名: 新宿線。鉄道区分: 普通鉄道（12）。事業者種別: 民営鉄道（4）。

笠上黒生
type: Concept
alternative label: 笠上黒生（銚子電気鉄道 銚子電気鉄道線）
broader: g003410
in scheme: scheme
notation: 003410
scope note: 運営会社: 銚子電気鉄道。路線名: 銚子電気鉄道線。鉄道区分: 普通鉄道（12）。事業者種別: 民営鉄道（4）。

熊川
type: Concept
alternative label: 熊川（東日本旅客鉄道 五日市線）
broader: g003411
in scheme: scheme
notation: 003411
scope note: 運営会社: 東日本旅客鉄道。路線名: 五日市線。鉄道区分: 普通鉄道JR（11）。事業者種別: JR在来線（2）。

菅野
type: Concept
alternative label: 菅野（京成電鉄 本線）
broader: g003412
in scheme: scheme
notation: 003412
scope note: 運営会社: 京成電鉄。路線名: 本線。鉄道区分: 普通鉄道（12）。事業者種別: 民営鉄道（4）。

秋川
type: Concept
alternative label: 秋川（東日本旅客鉄道 五日市線）
broader: g003413
in scheme: scheme
notation: 003413
scope note: 運営会社: 東日本旅客鉄道。路線名: 五日市線。鉄道区分: 普通鉄道JR（11）。事業者種別: JR在来線（2）。

日暮里
type: Concept
alternative label: 日暮里（京成電鉄 本線）
broader: g003417
in scheme: scheme
notation: 003414
scope note: 運営会社: 京成電鉄。路線名: 本線。鉄道区分: 普通鉄道（12）。事業者種別: 民営鉄道（4）。

千石
type: Concept
alternative label: 千石（東京都 6号線三田線）
broader: g003415
in scheme: scheme
notation: 003415
scope note: 運営会社: 東京都。路線名: 6号線三田線。鉄道区分: 普通鉄道（12）。事業者種別: 公営鉄道（3）。

八千代中央
type: Concept
alternative label: 八千代中央（東葉高速鉄道 東葉高速線）
broader: g003416
in scheme: scheme
notation: 003416
scope note: 運営会社: 東葉高速鉄道。路線名: 東葉高速線。鉄道区分: 普通鉄道（12）。事業者種別: 第三セクター（5）。

日暮里
type: Concept
alternative label: 日暮里（東日本旅客鉄道 常磐線）
broader: g003417
in scheme: scheme
notation: 003417
scope note: 運営会社: 東日本旅客鉄道。路線名: 常磐線。鉄道区分: 普通鉄道JR（11）。事業者種別: JR在来線（2）。

池袋
type: Concept
alternative label: 池袋（西武鉄道 池袋線）
broader: g003390
in scheme: scheme
notation: 003418
scope note: 運営会社: 西武鉄道。路線名: 池袋線。鉄道区分: 普通鉄道（12）。事業者種別: 民営鉄道（4）。

武蔵関
type: Concept
alternative label: 武蔵関（西武鉄道 新宿線）
broader: g003419
in scheme: scheme
notation: 003419
scope note: 運営会社: 西武鉄道。路線名: 新宿線。鉄道区分: 普通鉄道（12）。事業者種別: 民営鉄道（4）。

日暮里
type: Concept
alternative label: 日暮里（東日本旅客鉄道 東北線）
broader: g003417
in scheme: scheme
notation: 003420
scope note: 運営会社: 東日本旅客鉄道。路線名: 東北線。鉄道区分: 普通鉄道JR（11）。事業者種別: JR在来線（2）。

船橋日大前
type: Concept
alternative label: 船橋日大前（東葉高速鉄道 東葉高速線）
broader: g003421
in scheme: scheme
notation: 003421
scope note: 運営会社: 東葉高速鉄道。路線名: 東葉高速線。鉄道区分: 普通鉄道（12）。事業者種別: 第三セクター（5）。

八広
type: Concept
alternative label: 八広（京成電鉄 押上線）
broader: g003422
in scheme: scheme
notation: 003422
scope note: 運営会社: 京成電鉄。路線名: 押上線。鉄道区分: 普通鉄道（12）。事業者種別: 民営鉄道（4）。

田無
type: Concept
alternative label: 田無（西武鉄道 新宿線）
broader: g003423
in scheme: scheme
notation: 003423
scope note: 運営会社: 西武鉄道。路線名: 新宿線。鉄道区分: 普通鉄道（12）。事業者種別: 民営鉄道（4）。

小町屋
type: Concept
alternative label: 小町屋（東海旅客鉄道 飯田線）
broader: g003424
in scheme: scheme
notation: 003424
scope note: 運営会社: 東海旅客鉄道。路線名: 飯田線。鉄道区分: 普通鉄道JR（11）。事業者種別: JR在来線（2）。

高根木戸
type: Concept
alternative label: 高根木戸（京成電鉄 松戸線）
broader: g003425
in scheme: scheme
notation: 003425
scope note: 運営会社: 京成電鉄。路線名: 松戸線。鉄道区分: 普通鉄道（12）。事業者種別: 民営鉄道（4）。

椎名町
type: Concept
alternative label: 椎名町（西武鉄道 池袋線）
broader: g003426
in scheme: scheme
notation: 003426
scope note: 運営会社: 西武鉄道。路線名: 池袋線。鉄道区分: 普通鉄道（12）。事業者種別: 民営鉄道（4）。

上石神井
type: Concept
alternative label: 上石神井（西武鉄道 新宿線）
broader: g003427
in scheme: scheme
notation: 003427
scope note: 運営会社: 西武鉄道。路線名: 新宿線。鉄道区分: 普通鉄道（12）。事業者種別: 民営鉄道（4）。

西武立川
type: Concept
alternative label: 西武立川（西武鉄道 拝島線）
broader: g003428
in scheme: scheme
notation: 003428
scope note: 運営会社: 西武鉄道。路線名: 拝島線。鉄道区分: 普通鉄道（12）。事業者種別: 民営鉄道（4）。

地区センター
type: Concept
alternative label: 地区センター（山万 ユーカリが丘線）
broader: g003429
in scheme: scheme
notation: 003429
scope note: 運営会社: 山万。路線名: ユーカリが丘線。鉄道区分: 案内軌条式鉄道（16）。事業者種別: 民営鉄道（4）。

花小金井
type: Concept
alternative label: 花小金井（西武鉄道 新宿線）
broader: g003430
in scheme: scheme
notation: 003430
scope note: 運営会社: 西武鉄道。路線名: 新宿線。鉄道区分: 普通鉄道（12）。事業者種別: 民営鉄道（4）。

新大塚
type: Concept
alternative label: 新大塚（東京地下鉄 4号線丸ノ内線）
broader: g003431
in scheme: scheme
notation: 003431
scope note: 運営会社: 東京地下鉄。路線名: 4号線丸ノ内線。鉄道区分: 普通鉄道（12）。事業者種別: 民営鉄道（4）。

東池袋
type: Concept
alternative label: 東池袋（東京地下鉄 8号線有楽町線）
broader: g003432
in scheme: scheme
notation: 003432
scope note: 運営会社: 東京地下鉄。路線名: 8号線有楽町線。鉄道区分: 普通鉄道（12）。事業者種別: 民営鉄道（4）。

東秋留
type: Concept
alternative label: 東秋留（東日本旅客鉄道 五日市線）
broader: g003433
in scheme: scheme
notation: 003433
scope note: 運営会社: 東日本旅客鉄道。路線名: 五日市線。鉄道区分: 普通鉄道JR（11）。事業者種別: JR在来線（2）。

千駄木
type: Concept
alternative label: 千駄木（東京地下鉄 9号線千代田線）
broader: g003434
in scheme: scheme
notation: 003434
scope note: 運営会社: 東京地下鉄。路線名: 9号線千代田線。鉄道区分: 普通鉄道（12）。事業者種別: 民営鉄道（4）。

焼石
type: Concept
alternative label: 焼石（東海旅客鉄道 高山線）
broader: g003435
in scheme: scheme
notation: 003435
scope note: 運営会社: 東海旅客鉄道。路線名: 高山線。鉄道区分: 普通鉄道JR（11）。事業者種別: JR在来線（2）。

東池袋四丁目
type: Concept
alternative label: 東池袋四丁目（東京都 荒川線）
broader: g003436
in scheme: scheme
notation: 003436
scope note: 運営会社: 東京都。路線名: 荒川線。鉄道区分: 軌道（21）。事業者種別: 公営鉄道（3）。

上井草
type: Concept
alternative label: 上井草（西武鉄道 新宿線）
broader: g003437
in scheme: scheme
notation: 003437
scope note: 運営会社: 西武鉄道。路線名: 新宿線。鉄道区分: 普通鉄道（12）。事業者種別: 民営鉄道（4）。

京成佐倉
type: Concept
alternative label: 京成佐倉（京成電鉄 本線）
broader: g003438
in scheme: scheme
notation: 003438
scope note: 運営会社: 京成電鉄。路線名: 本線。鉄道区分: 普通鉄道（12）。事業者種別: 民営鉄道（4）。

西海鹿島
type: Concept
alternative label: 西海鹿島（銚子電気鉄道 銚子電気鉄道線）
broader: g003439
in scheme: scheme
notation: 003439
scope note: 運営会社: 銚子電気鉄道。路線名: 銚子電気鉄道線。鉄道区分: 普通鉄道（12）。事業者種別: 民営鉄道（4）。

井荻
type: Concept
alternative label: 井荻（西武鉄道 新宿線）
broader: g003440
in scheme: scheme
notation: 003440
scope note: 運営会社: 西武鉄道。路線名: 新宿線。鉄道区分: 普通鉄道（12）。事業者種別: 民営鉄道（4）。

本駒込
type: Concept
alternative label: 本駒込（東京地下鉄 7号線南北線）
broader: g003441
in scheme: scheme
notation: 003441
scope note: 運営会社: 東京地下鉄。路線名: 7号線南北線。鉄道区分: 普通鉄道（12）。事業者種別: 民営鉄道（4）。

東向島
type: Concept
alternative label: 東向島（東武鉄道 伊勢崎線）
broader: g003442
in scheme: scheme
notation: 003442
scope note: 運営会社: 東武鉄道。路線名: 伊勢崎線。鉄道区分: 普通鉄道（12）。事業者種別: 民営鉄道（4）。

都電雑司ヶ谷
type: Concept
alternative label: 都電雑司ヶ谷（東京都 荒川線）
broader: g003443
in scheme: scheme
notation: 003443
scope note: 運営会社: 東京都。路線名: 荒川線。鉄道区分: 軌道（21）。事業者種別: 公営鉄道（3）。

下井草
type: Concept
alternative label: 下井草（西武鉄道 新宿線）
broader: g003444
in scheme: scheme
notation: 003444
scope note: 運営会社: 西武鉄道。路線名: 新宿線。鉄道区分: 普通鉄道（12）。事業者種別: 民営鉄道（4）。

京成八幡
type: Concept
alternative label: 京成八幡（京成電鉄 本線）
broader: g003445
in scheme: scheme
notation: 003445
scope note: 運営会社: 京成電鉄。路線名: 本線。鉄道区分: 普通鉄道（12）。事業者種別: 民営鉄道（4）。

村上
type: Concept
alternative label: 村上（東葉高速鉄道 東葉高速線）
broader: g003446
in scheme: scheme
notation: 003446
scope note: 運営会社: 東葉高速鉄道。路線名: 東葉高速線。鉄道区分: 普通鉄道（12）。事業者種別: 第三セクター（5）。

砂川七番
type: Concept
alternative label: 砂川七番（多摩都市モノレール 多摩都市モノレール線）
broader: g003447
in scheme: scheme
notation: 003447
scope note: 運営会社: 多摩都市モノレール。路線名: 多摩都市モノレール線。鉄道区分: 跨座式モノレール（23）。事業者種別: 第三セクター（5）。

落合南長崎
type: Concept
alternative label: 落合南長崎（東京都 12号線大江戸線）
broader: g003448
in scheme: scheme
notation: 003448
scope note: 運営会社: 東京都。路線名: 12号線大江戸線。鉄道区分: 普通鉄道（12）。事業者種別: 公営鉄道（3）。

本八幡
type: Concept
alternative label: 本八幡（東京都 10号線新宿線）
broader: g003449
in scheme: scheme
notation: 003449
scope note: 運営会社: 東京都。路線名: 10号線新宿線。鉄道区分: 普通鉄道（12）。事業者種別: 公営鉄道（3）。

鷹の台
type: Concept
alternative label: 鷹の台（西武鉄道 国分寺線）
broader: g003450
in scheme: scheme
notation: 003450
scope note: 運営会社: 西武鉄道。路線名: 国分寺線。鉄道区分: 普通鉄道（12）。事業者種別: 民営鉄道（4）。

鷺ノ宮
type: Concept
alternative label: 鷺ノ宮（西武鉄道 新宿線）
broader: g003451
in scheme: scheme
notation: 003451
scope note: 運営会社: 西武鉄道。路線名: 新宿線。鉄道区分: 普通鉄道（12）。事業者種別: 民営鉄道（4）。

ユーカリが丘
type: Concept
alternative label: ユーカリが丘（山万 ユーカリが丘線）
broader: g003452
in scheme: scheme
notation: 003452
scope note: 運営会社: 山万。路線名: ユーカリが丘線。鉄道区分: 案内軌条式鉄道（16）。事業者種別: 民営鉄道（4）。

都立家政
type: Concept
alternative label: 都立家政（西武鉄道 新宿線）
broader: g003453
in scheme: scheme
notation: 003453
scope note: 運営会社: 西武鉄道。路線名: 新宿線。鉄道区分: 普通鉄道（12）。事業者種別: 民営鉄道（4）。

塚田
type: Concept
alternative label: 塚田（東武鉄道 野田線）
broader: g003454
in scheme: scheme
notation: 003454
scope note: 運営会社: 東武鉄道。路線名: 野田線。鉄道区分: 普通鉄道（12）。事業者種別: 民営鉄道（4）。

一橋学園
type: Concept
alternative label: 一橋学園（西武鉄道 多摩湖線）
broader: g003455
in scheme: scheme
notation: 003455
scope note: 運営会社: 西武鉄道。路線名: 多摩湖線。鉄道区分: 普通鉄道（12）。事業者種別: 民営鉄道（4）。

海鹿島
type: Concept
alternative label: 海鹿島（銚子電気鉄道 銚子電気鉄道線）
broader: g003456
in scheme: scheme
notation: 003456
scope note: 運営会社: 銚子電気鉄道。路線名: 銚子電気鉄道線。鉄道区分: 普通鉄道（12）。事業者種別: 民営鉄道（4）。

旭
type: Concept
alternative label: 旭（東日本旅客鉄道 総武線）
broader: g003457
in scheme: scheme
notation: 003457
scope note: 運営会社: 東日本旅客鉄道。路線名: 総武線。鉄道区分: 普通鉄道JR（11）。事業者種別: JR在来線（2）。

ユーカリが丘
type: Concept
alternative label: ユーカリが丘（京成電鉄 本線）
broader: g003452
in scheme: scheme
notation: 003458
scope note: 運営会社: 京成電鉄。路線名: 本線。鉄道区分: 普通鉄道（12）。事業者種別: 民営鉄道（4）。

北習志野
type: Concept
alternative label: 北習志野（東葉高速鉄道 東葉高速線）
broader: g003459
in scheme: scheme
notation: 003459
scope note: 運営会社: 東葉高速鉄道。路線名: 東葉高速線。鉄道区分: 普通鉄道（12）。事業者種別: 第三セクター（5）。

鶯谷
type: Concept
alternative label: 鶯谷（東日本旅客鉄道 東北線）
broader: g003460
in scheme: scheme
notation: 003460
scope note: 運営会社: 東日本旅客鉄道。路線名: 東北線。鉄道区分: 普通鉄道JR（11）。事業者種別: JR在来線（2）。

白山
type: Concept
alternative label: 白山（東京都 6号線三田線）
broader: g003461
in scheme: scheme
notation: 003461
scope note: 運営会社: 東京都。路線名: 6号線三田線。鉄道区分: 普通鉄道（12）。事業者種別: 公営鉄道（3）。

拝島
type: Concept
alternative label: 拝島（東日本旅客鉄道 八高線）
broader: g003462
in scheme: scheme
notation: 003462
scope note: 運営会社: 東日本旅客鉄道。路線名: 八高線。鉄道区分: 普通鉄道JR（11）。事業者種別: JR在来線（2）。

北習志野
type: Concept
alternative label: 北習志野（京成電鉄 松戸線）
broader: g003459
in scheme: scheme
notation: 003463
scope note: 運営会社: 京成電鉄。路線名: 松戸線。鉄道区分: 普通鉄道（12）。事業者種別: 民営鉄道（4）。

拝島
type: Concept
alternative label: 拝島（東日本旅客鉄道 五日市線）
broader: g003462
in scheme: scheme
notation: 003464
scope note: 運営会社: 東日本旅客鉄道。路線名: 五日市線。鉄道区分: 普通鉄道JR（11）。事業者種別: JR在来線（2）。

拝島
type: Concept
alternative label: 拝島（東日本旅客鉄道 青梅線）
broader: g003462
in scheme: scheme
notation: 003465
scope note: 運営会社: 東日本旅客鉄道。路線名: 青梅線。鉄道区分: 普通鉄道JR（11）。事業者種別: JR在来線（2）。

拝島
type: Concept
alternative label: 拝島（西武鉄道 拝島線）
broader: g003462
in scheme: scheme
notation: 003466
scope note: 運営会社: 西武鉄道。路線名: 拝島線。鉄道区分: 普通鉄道（12）。事業者種別: 民営鉄道（4）。

本八幡
type: Concept
alternative label: 本八幡（東日本旅客鉄道 総武線）
broader: g003449
in scheme: scheme
notation: 003467
scope note: 運営会社: 東日本旅客鉄道。路線名: 総武線。鉄道区分: 普通鉄道JR（11）。事業者種別: JR在来線（2）。

鬼子母神前
type: Concept
alternative label: 鬼子母神前（東京都 荒川線）
broader: g003468
in scheme: scheme
notation: 003468
scope note: 運営会社: 東京都。路線名: 荒川線。鉄道区分: 軌道（21）。事業者種別: 公営鉄道（3）。

入谷
type: Concept
alternative label: 入谷（東京地下鉄 2号線日比谷線）
broader: g003469
in scheme: scheme
notation: 003469
scope note: 運営会社: 東京地下鉄。路線名: 2号線日比谷線。鉄道区分: 普通鉄道（12）。事業者種別: 民営鉄道（4）。

目白
type: Concept
alternative label: 目白（東日本旅客鉄道 山手線）
broader: g003470
in scheme: scheme
notation: 003470
scope note: 運営会社: 東日本旅客鉄道。路線名: 山手線。鉄道区分: 普通鉄道JR（11）。事業者種別: JR在来線（2）。

雑司が谷
type: Concept
alternative label: 雑司が谷（東京地下鉄 13号線副都心線）
broader: g003471
in scheme: scheme
notation: 003471
scope note: 運営会社: 東京地下鉄。路線名: 13号線副都心線。鉄道区分: 普通鉄道（12）。事業者種別: 民営鉄道（4）。

鬼越
type: Concept
alternative label: 鬼越（京成電鉄 本線）
broader: g003472
in scheme: scheme
notation: 003472
scope note: 運営会社: 京成電鉄。路線名: 本線。鉄道区分: 普通鉄道（12）。事業者種別: 民営鉄道（4）。

野方
type: Concept
alternative label: 野方（西武鉄道 新宿線）
broader: g003473
in scheme: scheme
notation: 003473
scope note: 運営会社: 西武鉄道。路線名: 新宿線。鉄道区分: 普通鉄道（12）。事業者種別: 民営鉄道（4）。

護国寺
type: Concept
alternative label: 護国寺（東京地下鉄 8号線有楽町線）
broader: g003474
in scheme: scheme
notation: 003474
scope note: 運営会社: 東京地下鉄。路線名: 8号線有楽町線。鉄道区分: 普通鉄道（12）。事業者種別: 民営鉄道（4）。

沼袋
type: Concept
alternative label: 沼袋（西武鉄道 新宿線）
broader: g003475
in scheme: scheme
notation: 003475
scope note: 運営会社: 西武鉄道。路線名: 新宿線。鉄道区分: 普通鉄道（12）。事業者種別: 民営鉄道（4）。

泉体育館
type: Concept
alternative label: 泉体育館（多摩都市モノレール 多摩都市モノレール線）
broader: g003476
in scheme: scheme
notation: 003476
scope note: 運営会社: 多摩都市モノレール。路線名: 多摩都市モノレール線。鉄道区分: 跨座式モノレール（23）。事業者種別: 第三セクター（5）。

京成曳舟
type: Concept
alternative label: 京成曳舟（京成電鉄 押上線）
broader: g003477
in scheme: scheme
notation: 003477
scope note: 運営会社: 京成電鉄。路線名: 押上線。鉄道区分: 普通鉄道（12）。事業者種別: 民営鉄道（4）。

干潟
type: Concept
alternative label: 干潟（東日本旅客鉄道 総武線）
broader: g003478
in scheme: scheme
notation: 003478
scope note: 運営会社: 東日本旅客鉄道。路線名: 総武線。鉄道区分: 普通鉄道JR（11）。事業者種別: JR在来線（2）。

曳舟
type: Concept
alternative label: 曳舟（東武鉄道 伊勢崎線）
broader: g003479
in scheme: scheme
notation: 003479
scope note: 運営会社: 東武鉄道。路線名: 伊勢崎線。鉄道区分: 普通鉄道（12）。事業者種別: 民営鉄道（4）。

曳舟
type: Concept
alternative label: 曳舟（東武鉄道 亀戸線）
broader: g003479
in scheme: scheme
notation: 003480
scope note: 運営会社: 東武鉄道。路線名: 亀戸線。鉄道区分: 普通鉄道（12）。事業者種別: 民営鉄道（4）。

東大前
type: Concept
alternative label: 東大前（東京地下鉄 7号線南北線）
broader: g003481
in scheme: scheme
notation: 003481
scope note: 運営会社: 東京地下鉄。路線名: 7号線南北線。鉄道区分: 普通鉄道（12）。事業者種別: 民営鉄道（4）。

志津
type: Concept
alternative label: 志津（京成電鉄 本線）
broader: g003482
in scheme: scheme
notation: 003482
scope note: 運営会社: 京成電鉄。路線名: 本線。鉄道区分: 普通鉄道（12）。事業者種別: 民営鉄道（4）。

根津
type: Concept
alternative label: 根津（東京地下鉄 9号線千代田線）
broader: g003483
in scheme: scheme
notation: 003483
scope note: 運営会社: 東京地下鉄。路線名: 9号線千代田線。鉄道区分: 普通鉄道（12）。事業者種別: 民営鉄道（4）。

茗荷谷
type: Concept
alternative label: 茗荷谷（東京地下鉄 4号線丸ノ内線）
broader: g003484
in scheme: scheme
notation: 003484
scope note: 運営会社: 東京地下鉄。路線名: 4号線丸ノ内線。鉄道区分: 普通鉄道（12）。事業者種別: 民営鉄道（4）。

京成中山
type: Concept
alternative label: 京成中山（京成電鉄 本線）
broader: g003485
in scheme: scheme
notation: 003485
scope note: 運営会社: 京成電鉄。路線名: 本線。鉄道区分: 普通鉄道（12）。事業者種別: 民営鉄道（4）。

新小岩
type: Concept
alternative label: 新小岩（東日本旅客鉄道 総武線）
broader: g003486
in scheme: scheme
notation: 003486
scope note: 運営会社: 東日本旅客鉄道。路線名: 総武線。鉄道区分: 普通鉄道JR（11）。事業者種別: JR在来線（2）。

東葉勝田台
type: Concept
alternative label: 東葉勝田台（東葉高速鉄道 東葉高速線）
broader: g003487
in scheme: scheme
notation: 003487
scope note: 運営会社: 東葉高速鉄道。路線名: 東葉高速線。鉄道区分: 普通鉄道（12）。事業者種別: 第三セクター（5）。

新井薬師前
type: Concept
alternative label: 新井薬師前（西武鉄道 新宿線）
broader: g003489
in scheme: scheme
notation: 003489
scope note: 運営会社: 西武鉄道。路線名: 新宿線。鉄道区分: 普通鉄道（12）。事業者種別: 民営鉄道（4）。

学習院下
type: Concept
alternative label: 学習院下（東京都 荒川線）
broader: g003490
in scheme: scheme
notation: 003490
scope note: 運営会社: 東京都。路線名: 荒川線。鉄道区分: 軌道（21）。事業者種別: 公営鉄道（3）。

下落合
type: Concept
alternative label: 下落合（西武鉄道 新宿線）
broader: g003491
in scheme: scheme
notation: 003491
scope note: 運営会社: 西武鉄道。路線名: 新宿線。鉄道区分: 普通鉄道（12）。事業者種別: 民営鉄道（4）。

勝田台
type: Concept
alternative label: 勝田台（京成電鉄 本線）
broader: g003492
in scheme: scheme
notation: 003492
scope note: 運営会社: 京成電鉄。路線名: 本線。鉄道区分: 普通鉄道（12）。事業者種別: 民営鉄道（4）。

習志野
type: Concept
alternative label: 習志野（京成電鉄 松戸線）
broader: g003493
in scheme: scheme
notation: 003493
scope note: 運営会社: 京成電鉄。路線名: 松戸線。鉄道区分: 普通鉄道（12）。事業者種別: 民営鉄道（4）。

相生
type: Concept
alternative label: 相生（長良川鉄道 越美南線）
broader: g003494
in scheme: scheme
notation: 003494
scope note: 運営会社: 長良川鉄道。路線名: 越美南線。鉄道区分: 普通鉄道（12）。事業者種別: 第三セクター（5）。

中井
type: Concept
alternative label: 中井（西武鉄道 新宿線）
broader: g003495
in scheme: scheme
notation: 003495
scope note: 運営会社: 西武鉄道。路線名: 新宿線。鉄道区分: 普通鉄道（12）。事業者種別: 民営鉄道（4）。

東中山
type: Concept
alternative label: 東中山（京成電鉄 本線）
broader: g003496
in scheme: scheme
notation: 003496
scope note: 運営会社: 京成電鉄。路線名: 本線。鉄道区分: 普通鉄道（12）。事業者種別: 民営鉄道（4）。

下総中山
type: Concept
alternative label: 下総中山（東日本旅客鉄道 総武線）
broader: g003498
in scheme: scheme
notation: 003498
scope note: 運営会社: 東日本旅客鉄道。路線名: 総武線。鉄道区分: 普通鉄道JR（11）。事業者種別: JR在来線（2）。

立飛
type: Concept
alternative label: 立飛（多摩都市モノレール 多摩都市モノレール線）
broader: g003499
in scheme: scheme
notation: 003499
scope note: 運営会社: 多摩都市モノレール。路線名: 多摩都市モノレール線。鉄道区分: 跨座式モノレール（23）。事業者種別: 第三セクター（5）。

君ヶ浜
type: Concept
alternative label: 君ヶ浜（銚子電気鉄道 銚子電気鉄道線）
broader: g003500
in scheme: scheme
notation: 003500
scope note: 運営会社: 銚子電気鉄道。路線名: 銚子電気鉄道線。鉄道区分: 普通鉄道（12）。事業者種別: 民営鉄道（4）。

飯山満
type: Concept
alternative label: 飯山満（東葉高速鉄道 東葉高速線）
broader: g003501
in scheme: scheme
notation: 003501
scope note: 運営会社: 東葉高速鉄道。路線名: 東葉高速線。鉄道区分: 普通鉄道（12）。事業者種別: 第三セクター（5）。

浅草
type: Concept
alternative label: 浅草（首都圏新都市鉄道 常磐新線）
broader: g003502
in scheme: scheme
notation: 003502
scope note: 運営会社: 首都圏新都市鉄道。路線名: 常磐新線。鉄道区分: 普通鉄道（12）。事業者種別: 第三セクター（5）。

中井
type: Concept
alternative label: 中井（東京都 12号線大江戸線）
broader: g003495
in scheme: scheme
notation: 003503
scope note: 運営会社: 東京都。路線名: 12号線大江戸線。鉄道区分: 普通鉄道（12）。事業者種別: 公営鉄道（3）。

上野
type: Concept
alternative label: 上野（東日本旅客鉄道 東北線）
broader: g003505
in scheme: scheme
notation: 003504
scope note: 運営会社: 東日本旅客鉄道。路線名: 東北線。鉄道区分: 普通鉄道JR（11）。事業者種別: JR在来線（2）。

上野
type: Concept
alternative label: 上野（東日本旅客鉄道 東北新幹線）
broader: g003505
in scheme: scheme
notation: 003505
scope note: 運営会社: 東日本旅客鉄道。路線名: 東北新幹線。鉄道区分: 普通鉄道JR（11）。事業者種別: JRの新幹線（1）。

高田馬場
type: Concept
alternative label: 高田馬場（東京地下鉄 5号線東西線）
broader: g003508
in scheme: scheme
notation: 003506
scope note: 運営会社: 東京地下鉄。路線名: 5号線東西線。鉄道区分: 普通鉄道（12）。事業者種別: 民営鉄道（4）。

昭島
type: Concept
alternative label: 昭島（東日本旅客鉄道 青梅線）
broader: g003507
in scheme: scheme
notation: 003507
scope note: 運営会社: 東日本旅客鉄道。路線名: 青梅線。鉄道区分: 普通鉄道JR（11）。事業者種別: JR在来線（2）。

高田馬場
type: Concept
alternative label: 高田馬場（東日本旅客鉄道 山手線）
broader: g003508
in scheme: scheme
notation: 003508
scope note: 運営会社: 東日本旅客鉄道。路線名: 山手線。鉄道区分: 普通鉄道JR（11）。事業者種別: JR在来線（2）。

面影橋
type: Concept
alternative label: 面影橋（東京都 荒川線）
broader: g003509
in scheme: scheme
notation: 003509
scope note: 運営会社: 東京都。路線名: 荒川線。鉄道区分: 軌道（21）。事業者種別: 公営鉄道（3）。

高田馬場
type: Concept
alternative label: 高田馬場（西武鉄道 新宿線）
broader: g003508
in scheme: scheme
notation: 003510
scope note: 運営会社: 西武鉄道。路線名: 新宿線。鉄道区分: 普通鉄道（12）。事業者種別: 民営鉄道（4）。

京成大和田
type: Concept
alternative label: 京成大和田（京成電鉄 本線）
broader: g003511
in scheme: scheme
notation: 003511
scope note: 運営会社: 京成電鉄。路線名: 本線。鉄道区分: 普通鉄道（12）。事業者種別: 民営鉄道（4）。

伊那福岡
type: Concept
alternative label: 伊那福岡（東海旅客鉄道 飯田線）
broader: g003512
in scheme: scheme
notation: 003512
scope note: 運営会社: 東海旅客鉄道。路線名: 飯田線。鉄道区分: 普通鉄道JR（11）。事業者種別: JR在来線（2）。

浅草
type: Concept
alternative label: 浅草（東武鉄道 伊勢崎線）
broader: g003522
in scheme: scheme
notation: 003513
scope note: 運営会社: 東武鉄道。路線名: 伊勢崎線。鉄道区分: 普通鉄道（12）。事業者種別: 民営鉄道（4）。

早稲田
type: Concept
alternative label: 早稲田（東京都 荒川線）
broader: g003514
in scheme: scheme
notation: 003514
scope note: 運営会社: 東京都。路線名: 荒川線。鉄道区分: 軌道（21）。事業者種別: 公営鉄道（3）。

上野
type: Concept
alternative label: 上野（東京地下鉄 3号線銀座線）
broader: g003505
in scheme: scheme
notation: 003515
scope note: 運営会社: 東京地下鉄。路線名: 3号線銀座線。鉄道区分: 普通鉄道（12）。事業者種別: 民営鉄道（4）。

京成西船
type: Concept
alternative label: 京成西船（京成電鉄 本線）
broader: g003516
in scheme: scheme
notation: 003516
scope note: 運営会社: 京成電鉄。路線名: 本線。鉄道区分: 普通鉄道（12）。事業者種別: 民営鉄道（4）。

上野
type: Concept
alternative label: 上野（東京地下鉄 2号線日比谷線）
broader: g003505
in scheme: scheme
notation: 003517
scope note: 運営会社: 東京地下鉄。路線名: 2号線日比谷線。鉄道区分: 普通鉄道（12）。事業者種別: 民営鉄道（4）。

新船橋
type: Concept
alternative label: 新船橋（東武鉄道 野田線）
broader: g003518
in scheme: scheme
notation: 003518
scope note: 運営会社: 東武鉄道。路線名: 野田線。鉄道区分: 普通鉄道（12）。事業者種別: 民営鉄道（4）。

稲荷町
type: Concept
alternative label: 稲荷町（東京地下鉄 3号線銀座線）
broader: g003519
in scheme: scheme
notation: 003519
scope note: 運営会社: 東京地下鉄。路線名: 3号線銀座線。鉄道区分: 普通鉄道（12）。事業者種別: 民営鉄道（4）。

恋ヶ窪
type: Concept
alternative label: 恋ヶ窪（西武鉄道 国分寺線）
broader: g003520
in scheme: scheme
notation: 003520
scope note: 運営会社: 西武鉄道。路線名: 国分寺線。鉄道区分: 普通鉄道（12）。事業者種別: 民営鉄道（4）。

京成上野
type: Concept
alternative label: 京成上野（京成電鉄 本線）
broader: g003521
in scheme: scheme
notation: 003521
scope note: 運営会社: 京成電鉄。路線名: 本線。鉄道区分: 普通鉄道（12）。事業者種別: 民営鉄道（4）。

浅草
type: Concept
alternative label: 浅草（東京地下鉄 3号線銀座線）
broader: g003522
in scheme: scheme
notation: 003522
scope note: 運営会社: 東京地下鉄。路線名: 3号線銀座線。鉄道区分: 普通鉄道（12）。事業者種別: 民営鉄道（4）。

落合
type: Concept
alternative label: 落合（東京地下鉄 5号線東西線）
broader: g003523
in scheme: scheme
notation: 003523
scope note: 運営会社: 東京地下鉄。路線名: 5号線東西線。鉄道区分: 普通鉄道（12）。事業者種別: 民営鉄道（4）。

とうきょうスカイツリー
type: Concept
alternative label: とうきょうスカイツリー（東武鉄道 伊勢崎線）
broader: g003524
in scheme: scheme
notation: 003524
scope note: 運営会社: 東武鉄道。路線名: 伊勢崎線。鉄道区分: 普通鉄道（12）。事業者種別: 民営鉄道（4）。

小村井
type: Concept
alternative label: 小村井（東武鉄道 亀戸線）
broader: g003525
in scheme: scheme
notation: 003525
scope note: 運営会社: 東武鉄道。路線名: 亀戸線。鉄道区分: 普通鉄道（12）。事業者種別: 民営鉄道（4）。

押上
type: Concept
alternative label: 押上（東京都 1号線浅草線）
broader: g003526
in scheme: scheme
notation: 003526
scope note: 運営会社: 東京都。路線名: 1号線浅草線。鉄道区分: 普通鉄道（12）。事業者種別: 公営鉄道（3）。

押上
type: Concept
alternative label: 押上（京成電鉄 押上線）
broader: g003526
in scheme: scheme
notation: 003527
scope note: 運営会社: 京成電鉄。路線名: 押上線。鉄道区分: 普通鉄道（12）。事業者種別: 民営鉄道（4）。

高松
type: Concept
alternative label: 高松（多摩都市モノレール 多摩都市モノレール線）
broader: g003528
in scheme: scheme
notation: 003528
scope note: 運営会社: 多摩都市モノレール。路線名: 多摩都市モノレール線。鉄道区分: 跨座式モノレール（23）。事業者種別: 第三セクター（5）。

春日
type: Concept
alternative label: 春日（東京都 6号線三田線）
broader: g003529
in scheme: scheme
notation: 003529
scope note: 運営会社: 東京都。路線名: 6号線三田線。鉄道区分: 普通鉄道（12）。事業者種別: 公営鉄道（3）。

田原町
type: Concept
alternative label: 田原町（東京地下鉄 3号線銀座線）
broader: g003530
in scheme: scheme
notation: 003530
scope note: 運営会社: 東京地下鉄。路線名: 3号線銀座線。鉄道区分: 普通鉄道（12）。事業者種別: 民営鉄道（4）。

佐倉
type: Concept
alternative label: 佐倉（東日本旅客鉄道 成田線）
broader: g003531
in scheme: scheme
notation: 003531
scope note: 運営会社: 東日本旅客鉄道。路線名: 成田線。鉄道区分: 普通鉄道JR（11）。事業者種別: JR在来線（2）。

佐倉
type: Concept
alternative label: 佐倉（東日本旅客鉄道 総武線）
broader: g003531
in scheme: scheme
notation: 003532
scope note: 運営会社: 東日本旅客鉄道。路線名: 総武線。鉄道区分: 普通鉄道JR（11）。事業者種別: JR在来線（2）。

韮崎
type: Concept
alternative label: 韮崎（東日本旅客鉄道 中央線）
broader: g003533
in scheme: scheme
notation: 003533
scope note: 運営会社: 東日本旅客鉄道。路線名: 中央線。鉄道区分: 普通鉄道JR（11）。事業者種別: JR在来線（2）。

江戸川橋
type: Concept
alternative label: 江戸川橋（東京地下鉄 8号線有楽町線）
broader: g003534
in scheme: scheme
notation: 003534
scope note: 運営会社: 東京地下鉄。路線名: 8号線有楽町線。鉄道区分: 普通鉄道（12）。事業者種別: 民営鉄道（4）。

薬園台
type: Concept
alternative label: 薬園台（京成電鉄 松戸線）
broader: g003535
in scheme: scheme
notation: 003535
scope note: 運営会社: 京成電鉄。路線名: 松戸線。鉄道区分: 普通鉄道（12）。事業者種別: 民営鉄道（4）。

中神
type: Concept
alternative label: 中神（東日本旅客鉄道 青梅線）
broader: g003536
in scheme: scheme
notation: 003536
scope note: 運営会社: 東日本旅客鉄道。路線名: 青梅線。鉄道区分: 普通鉄道JR（11）。事業者種別: JR在来線（2）。

浅草
type: Concept
alternative label: 浅草（東京都 1号線浅草線）
broader: g003522
in scheme: scheme
notation: 003537
scope note: 運営会社: 東京都。路線名: 1号線浅草線。鉄道区分: 普通鉄道（12）。事業者種別: 公営鉄道（3）。

本所吾妻橋
type: Concept
alternative label: 本所吾妻橋（東京都 1号線浅草線）
broader: g003538
in scheme: scheme
notation: 003538
scope note: 運営会社: 東京都。路線名: 1号線浅草線。鉄道区分: 普通鉄道（12）。事業者種別: 公営鉄道（3）。

春日
type: Concept
alternative label: 春日（東京都 12号線大江戸線）
broader: g003529
in scheme: scheme
notation: 003539
scope note: 運営会社: 東京都。路線名: 12号線大江戸線。鉄道区分: 普通鉄道（12）。事業者種別: 公営鉄道（3）。

押上
type: Concept
alternative label: 押上（東京地下鉄 11号線半蔵門線）
broader: g003526
in scheme: scheme
notation: 003540
scope note: 運営会社: 東京地下鉄。路線名: 11号線半蔵門線。鉄道区分: 普通鉄道（12）。事業者種別: 民営鉄道（4）。

押上
type: Concept
alternative label: 押上（東武鉄道 伊勢崎線）
broader: g003526
in scheme: scheme
notation: 003541
scope note: 運営会社: 東武鉄道。路線名: 伊勢崎線。鉄道区分: 普通鉄道（12）。事業者種別: 民営鉄道（4）。

後楽園
type: Concept
alternative label: 後楽園（東京地下鉄 7号線南北線）
broader: g003542
in scheme: scheme
notation: 003542
scope note: 運営会社: 東京地下鉄。路線名: 7号線南北線。鉄道区分: 普通鉄道（12）。事業者種別: 民営鉄道（4）。

上野御徒町
type: Concept
alternative label: 上野御徒町（東京都 12号線大江戸線）
broader: g003543
in scheme: scheme
notation: 003543
scope note: 運営会社: 東京都。路線名: 12号線大江戸線。鉄道区分: 普通鉄道（12）。事業者種別: 公営鉄道（3）。

西早稲田
type: Concept
alternative label: 西早稲田（東京地下鉄 13号線副都心線）
broader: g003544
in scheme: scheme
notation: 003544
scope note: 運営会社: 東京地下鉄。路線名: 13号線副都心線。鉄道区分: 普通鉄道（12）。事業者種別: 民営鉄道（4）。

上野広小路
type: Concept
alternative label: 上野広小路（東京地下鉄 3号線銀座線）
broader: g003545
in scheme: scheme
notation: 003545
scope note: 運営会社: 東京地下鉄。路線名: 3号線銀座線。鉄道区分: 普通鉄道（12）。事業者種別: 民営鉄道（4）。

本郷三丁目
type: Concept
alternative label: 本郷三丁目（東京都 12号線大江戸線）
broader: g003546
in scheme: scheme
notation: 003546
scope note: 運営会社: 東京都。路線名: 12号線大江戸線。鉄道区分: 普通鉄道（12）。事業者種別: 公営鉄道（3）。

西船橋
type: Concept
alternative label: 西船橋（東日本旅客鉄道 総武線）
broader: g003547
in scheme: scheme
notation: 003547
scope note: 運営会社: 東日本旅客鉄道。路線名: 総武線。鉄道区分: 普通鉄道JR（11）。事業者種別: JR在来線（2）。

東あずま
type: Concept
alternative label: 東あずま（東武鉄道 亀戸線）
broader: g003548
in scheme: scheme
notation: 003548
scope note: 運営会社: 東武鉄道。路線名: 亀戸線。鉄道区分: 普通鉄道（12）。事業者種別: 民営鉄道（4）。

東中野
type: Concept
alternative label: 東中野（東京都 12号線大江戸線）
broader: g003549
in scheme: scheme
notation: 003549
scope note: 運営会社: 東京都。路線名: 12号線大江戸線。鉄道区分: 普通鉄道（12）。事業者種別: 公営鉄道（3）。

後楽園
type: Concept
alternative label: 後楽園（東京地下鉄 4号線丸ノ内線）
broader: g003542
in scheme: scheme
notation: 003550
scope note: 運営会社: 東京地下鉄。路線名: 4号線丸ノ内線。鉄道区分: 普通鉄道（12）。事業者種別: 民営鉄道（4）。

西船橋
type: Concept
alternative label: 西船橋（東京地下鉄 5号線東西線）
broader: g003547
in scheme: scheme
notation: 003551
scope note: 運営会社: 東京地下鉄。路線名: 5号線東西線。鉄道区分: 普通鉄道（12）。事業者種別: 民営鉄道（4）。

西船橋
type: Concept
alternative label: 西船橋（東葉高速鉄道 東葉高速線）
broader: g003547
in scheme: scheme
notation: 003552
scope note: 運営会社: 東葉高速鉄道。路線名: 東葉高速線。鉄道区分: 普通鉄道（12）。事業者種別: 第三セクター（5）。

西船橋
type: Concept
alternative label: 西船橋（東日本旅客鉄道 京葉線）
broader: g003547
in scheme: scheme
notation: 003553
scope note: 運営会社: 東日本旅客鉄道。路線名: 京葉線。鉄道区分: 普通鉄道JR（11）。事業者種別: JR在来線（2）。

西船橋
type: Concept
alternative label: 西船橋（東日本旅客鉄道 武蔵野線）
broader: g003547
in scheme: scheme
notation: 003554
scope note: 運営会社: 東日本旅客鉄道。路線名: 武蔵野線。鉄道区分: 普通鉄道JR（11）。事業者種別: JR在来線（2）。

御徒町
type: Concept
alternative label: 御徒町（東日本旅客鉄道 東北線）
broader: g003555
in scheme: scheme
notation: 003555
scope note: 運営会社: 東日本旅客鉄道。路線名: 東北線。鉄道区分: 普通鉄道JR（11）。事業者種別: JR在来線（2）。

新御徒町
type: Concept
alternative label: 新御徒町（東京都 12号線大江戸線）
broader: g003556
in scheme: scheme
notation: 003556
scope note: 運営会社: 東京都。路線名: 12号線大江戸線。鉄道区分: 普通鉄道（12）。事業者種別: 公営鉄道（3）。

新御徒町
type: Concept
alternative label: 新御徒町（首都圏新都市鉄道 常磐新線）
broader: g003556
in scheme: scheme
notation: 003557
scope note: 運営会社: 首都圏新都市鉄道。路線名: 常磐新線。鉄道区分: 普通鉄道（12）。事業者種別: 第三セクター（5）。

湯島
type: Concept
alternative label: 湯島（東京地下鉄 9号線千代田線）
broader: g003558
in scheme: scheme
notation: 003558
scope note: 運営会社: 東京地下鉄。路線名: 9号線千代田線。鉄道区分: 普通鉄道（12）。事業者種別: 民営鉄道（4）。

本郷三丁目
type: Concept
alternative label: 本郷三丁目（東京地下鉄 4号線丸ノ内線）
broader: g003546
in scheme: scheme
notation: 003559
scope note: 運営会社: 東京地下鉄。路線名: 4号線丸ノ内線。鉄道区分: 普通鉄道（12）。事業者種別: 民営鉄道（4）。

仲御徒町
type: Concept
alternative label: 仲御徒町（東京地下鉄 2号線日比谷線）
broader: g003560
in scheme: scheme
notation: 003560
scope note: 運営会社: 東京地下鉄。路線名: 2号線日比谷線。鉄道区分: 普通鉄道（12）。事業者種別: 民営鉄道（4）。

平井
type: Concept
alternative label: 平井（東日本旅客鉄道 総武線）
broader: g003561
in scheme: scheme
notation: 003561
scope note: 運営会社: 東日本旅客鉄道。路線名: 総武線。鉄道区分: 普通鉄道JR（11）。事業者種別: JR在来線（2）。

東中神
type: Concept
alternative label: 東中神（東日本旅客鉄道 青梅線）
broader: g003562
in scheme: scheme
notation: 003562
scope note: 運営会社: 東日本旅客鉄道。路線名: 青梅線。鉄道区分: 普通鉄道JR（11）。事業者種別: JR在来線（2）。

東中野
type: Concept
alternative label: 東中野（東日本旅客鉄道 中央線）
broader: g003549
in scheme: scheme
notation: 003563
scope note: 運営会社: 東日本旅客鉄道。路線名: 中央線。鉄道区分: 普通鉄道JR（11）。事業者種別: JR在来線（2）。

犬吠
type: Concept
alternative label: 犬吠（銚子電気鉄道 銚子電気鉄道線）
broader: g003564
in scheme: scheme
notation: 003564
scope note: 運営会社: 銚子電気鉄道。路線名: 銚子電気鉄道線。鉄道区分: 普通鉄道（12）。事業者種別: 民営鉄道（4）。

篠崎
type: Concept
alternative label: 篠崎（東京都 10号線新宿線）
broader: g003565
in scheme: scheme
notation: 003565
scope note: 運営会社: 東京都。路線名: 10号線新宿線。鉄道区分: 普通鉄道（12）。事業者種別: 公営鉄道（3）。

東海神
type: Concept
alternative label: 東海神（東葉高速鉄道 東葉高速線）
broader: g003566
in scheme: scheme
notation: 003566
scope note: 運営会社: 東葉高速鉄道。路線名: 東葉高速線。鉄道区分: 普通鉄道（12）。事業者種別: 第三セクター（5）。

海神
type: Concept
alternative label: 海神（京成電鉄 本線）
broader: g003567
in scheme: scheme
notation: 003567
scope note: 運営会社: 京成電鉄。路線名: 本線。鉄道区分: 普通鉄道（12）。事業者種別: 民営鉄道（4）。

中野
type: Concept
alternative label: 中野（東日本旅客鉄道 中央線）
broader: g003568
in scheme: scheme
notation: 003568
scope note: 運営会社: 東日本旅客鉄道。路線名: 中央線。鉄道区分: 普通鉄道JR（11）。事業者種別: JR在来線（2）。

中野
type: Concept
alternative label: 中野（東京地下鉄 5号線東西線）
broader: g003568
in scheme: scheme
notation: 003569
scope note: 運営会社: 東京地下鉄。路線名: 5号線東西線。鉄道区分: 普通鉄道（12）。事業者種別: 民営鉄道（4）。

早稲田
type: Concept
alternative label: 早稲田（東京地下鉄 5号線東西線）
broader: g003570
in scheme: scheme
notation: 003570
scope note: 運営会社: 東京地下鉄。路線名: 5号線東西線。鉄道区分: 普通鉄道（12）。事業者種別: 民営鉄道（4）。

蔵前
type: Concept
alternative label: 蔵前（東京都 12号線大江戸線）
broader: g003571
in scheme: scheme
notation: 003571
scope note: 運営会社: 東京都。路線名: 12号線大江戸線。鉄道区分: 普通鉄道（12）。事業者種別: 公営鉄道（3）。

塩山
type: Concept
alternative label: 塩山（東日本旅客鉄道 中央線）
broader: g003572
in scheme: scheme
notation: 003572
scope note: 運営会社: 東日本旅客鉄道。路線名: 中央線。鉄道区分: 普通鉄道JR（11）。事業者種別: JR在来線（2）。

高円寺
type: Concept
alternative label: 高円寺（東日本旅客鉄道 中央線）
broader: g003573
in scheme: scheme
notation: 003573
scope note: 運営会社: 東日本旅客鉄道。路線名: 中央線。鉄道区分: 普通鉄道JR（11）。事業者種別: JR在来線（2）。

阿佐ヶ谷
type: Concept
alternative label: 阿佐ヶ谷（東日本旅客鉄道 中央線）
broader: g003574
in scheme: scheme
notation: 003574
scope note: 運営会社: 東日本旅客鉄道。路線名: 中央線。鉄道区分: 普通鉄道JR（11）。事業者種別: JR在来線（2）。

荻窪
type: Concept
alternative label: 荻窪（東日本旅客鉄道 中央線）
broader: g003575
in scheme: scheme
notation: 003575
scope note: 運営会社: 東日本旅客鉄道。路線名: 中央線。鉄道区分: 普通鉄道JR（11）。事業者種別: JR在来線（2）。

南酒々井
type: Concept
alternative label: 南酒々井（東日本旅客鉄道 総武線）
broader: g003576
in scheme: scheme
notation: 003576
scope note: 運営会社: 東日本旅客鉄道。路線名: 総武線。鉄道区分: 普通鉄道JR（11）。事業者種別: JR在来線（2）。

荻窪
type: Concept
alternative label: 荻窪（東京地下鉄 4号線丸ノ内線）
broader: g003575
in scheme: scheme
notation: 003577
scope note: 運営会社: 東京地下鉄。路線名: 4号線丸ノ内線。鉄道区分: 普通鉄道（12）。事業者種別: 民営鉄道（4）。

神楽坂
type: Concept
alternative label: 神楽坂（東京地下鉄 5号線東西線）
broader: g003578
in scheme: scheme
notation: 003578
scope note: 運営会社: 東京地下鉄。路線名: 5号線東西線。鉄道区分: 普通鉄道（12）。事業者種別: 民営鉄道（4）。

西荻窪
type: Concept
alternative label: 西荻窪（東日本旅客鉄道 中央線）
broader: g003579
in scheme: scheme
notation: 003579
scope note: 運営会社: 東日本旅客鉄道。路線名: 中央線。鉄道区分: 普通鉄道JR（11）。事業者種別: JR在来線（2）。

水道橋
type: Concept
alternative label: 水道橋（東京都 6号線三田線）
broader: g003580
in scheme: scheme
notation: 003580
scope note: 運営会社: 東京都。路線名: 6号線三田線。鉄道区分: 普通鉄道（12）。事業者種別: 公営鉄道（3）。

西立川
type: Concept
alternative label: 西立川（東日本旅客鉄道 青梅線）
broader: g003581
in scheme: scheme
notation: 003581
scope note: 運営会社: 東日本旅客鉄道。路線名: 青梅線。鉄道区分: 普通鉄道JR（11）。事業者種別: JR在来線（2）。

原木中山
type: Concept
alternative label: 原木中山（東京地下鉄 5号線東西線）
broader: g003582
in scheme: scheme
notation: 003582
scope note: 運営会社: 東京地下鉄。路線名: 5号線東西線。鉄道区分: 普通鉄道（12）。事業者種別: 民営鉄道（4）。

蔵前
type: Concept
alternative label: 蔵前（東京都 1号線浅草線）
broader: g003571
in scheme: scheme
notation: 003583
scope note: 運営会社: 東京都。路線名: 1号線浅草線。鉄道区分: 普通鉄道（12）。事業者種別: 公営鉄道（3）。

吉祥寺
type: Concept
alternative label: 吉祥寺（東日本旅客鉄道 中央線）
broader: g003584
in scheme: scheme
notation: 003584
scope note: 運営会社: 東日本旅客鉄道。路線名: 中央線。鉄道区分: 普通鉄道JR（11）。事業者種別: JR在来線（2）。

飯田橋
type: Concept
alternative label: 飯田橋（東京都 12号線大江戸線）
broader: g003595
in scheme: scheme
notation: 003585
scope note: 運営会社: 東京都。路線名: 12号線大江戸線。鉄道区分: 普通鉄道（12）。事業者種別: 公営鉄道（3）。

末広町
type: Concept
alternative label: 末広町（東京地下鉄 3号線銀座線）
broader: g003586
in scheme: scheme
notation: 003586
scope note: 運営会社: 東京地下鉄。路線名: 3号線銀座線。鉄道区分: 普通鉄道（12）。事業者種別: 民営鉄道（4）。

三鷹
type: Concept
alternative label: 三鷹（東日本旅客鉄道 中央線）
broader: g003587
in scheme: scheme
notation: 003587
scope note: 運営会社: 東日本旅客鉄道。路線名: 中央線。鉄道区分: 普通鉄道JR（11）。事業者種別: JR在来線（2）。

吉祥寺
type: Concept
alternative label: 吉祥寺（京王電鉄 井の頭線）
broader: g003584
in scheme: scheme
notation: 003588
scope note: 運営会社: 京王電鉄。路線名: 井の頭線。鉄道区分: 普通鉄道（12）。事業者種別: 民営鉄道（4）。

船橋
type: Concept
alternative label: 船橋（東武鉄道 野田線）
broader: g003589
in scheme: scheme
notation: 003589
scope note: 運営会社: 東武鉄道。路線名: 野田線。鉄道区分: 普通鉄道（12）。事業者種別: 民営鉄道（4）。

武蔵境
type: Concept
alternative label: 武蔵境（東日本旅客鉄道 中央線）
broader: g003590
in scheme: scheme
notation: 003590
scope note: 運営会社: 東日本旅客鉄道。路線名: 中央線。鉄道区分: 普通鉄道JR（11）。事業者種別: JR在来線（2）。

水道橋
type: Concept
alternative label: 水道橋（東日本旅客鉄道 中央線）
broader: g003580
in scheme: scheme
notation: 003591
scope note: 運営会社: 東日本旅客鉄道。路線名: 中央線。鉄道区分: 普通鉄道JR（11）。事業者種別: JR在来線（2）。

武蔵境
type: Concept
alternative label: 武蔵境（西武鉄道 多摩川線）
broader: g003590
in scheme: scheme
notation: 003592
scope note: 運営会社: 西武鉄道。路線名: 多摩川線。鉄道区分: 普通鉄道（12）。事業者種別: 民営鉄道（4）。

船橋
type: Concept
alternative label: 船橋（東日本旅客鉄道 総武線）
broader: g003589
in scheme: scheme
notation: 003593
scope note: 運営会社: 東日本旅客鉄道。路線名: 総武線。鉄道区分: 普通鉄道JR（11）。事業者種別: JR在来線（2）。

東小金井
type: Concept
alternative label: 東小金井（東日本旅客鉄道 中央線）
broader: g003594
in scheme: scheme
notation: 003594
scope note: 運営会社: 東日本旅客鉄道。路線名: 中央線。鉄道区分: 普通鉄道JR（11）。事業者種別: JR在来線（2）。

飯田橋
type: Concept
alternative label: 飯田橋（東京地下鉄 7号線南北線）
broader: g003595
in scheme: scheme
notation: 003595
scope note: 運営会社: 東京地下鉄。路線名: 7号線南北線。鉄道区分: 普通鉄道（12）。事業者種別: 民営鉄道（4）。

飯田橋
type: Concept
alternative label: 飯田橋（東京地下鉄 5号線東西線）
broader: g003595
in scheme: scheme
notation: 003596
scope note: 運営会社: 東京地下鉄。路線名: 5号線東西線。鉄道区分: 普通鉄道（12）。事業者種別: 民営鉄道（4）。

八千代台
type: Concept
alternative label: 八千代台（京成電鉄 本線）
broader: g003597
in scheme: scheme
notation: 003597
scope note: 運営会社: 京成電鉄。路線名: 本線。鉄道区分: 普通鉄道（12）。事業者種別: 民営鉄道（4）。

飯田橋
type: Concept
alternative label: 飯田橋（東京地下鉄 8号線有楽町線）
broader: g003595
in scheme: scheme
notation: 003598
scope note: 運営会社: 東京地下鉄。路線名: 8号線有楽町線。鉄道区分: 普通鉄道（12）。事業者種別: 民営鉄道（4）。

国分寺
type: Concept
alternative label: 国分寺（西武鉄道 多摩湖線）
broader: g003606
in scheme: scheme
notation: 003599
scope note: 運営会社: 西武鉄道。路線名: 多摩湖線。鉄道区分: 普通鉄道（12）。事業者種別: 民営鉄道（4）。

武蔵小金井
type: Concept
alternative label: 武蔵小金井（東日本旅客鉄道 中央線）
broader: g003600
in scheme: scheme
notation: 003600
scope note: 運営会社: 東日本旅客鉄道。路線名: 中央線。鉄道区分: 普通鉄道JR（11）。事業者種別: JR在来線（2）。

新大久保
type: Concept
alternative label: 新大久保（東日本旅客鉄道 山手線）
broader: g003601
in scheme: scheme
notation: 003601
scope note: 運営会社: 東日本旅客鉄道。路線名: 山手線。鉄道区分: 普通鉄道JR（11）。事業者種別: JR在来線（2）。

牛込神楽坂
type: Concept
alternative label: 牛込神楽坂（東京都 12号線大江戸線）
broader: g003602
in scheme: scheme
notation: 003602
scope note: 運営会社: 東京都。路線名: 12号線大江戸線。鉄道区分: 普通鉄道（12）。事業者種別: 公営鉄道（3）。

前原
type: Concept
alternative label: 前原（京成電鉄 松戸線）
broader: g003603
in scheme: scheme
notation: 003603
scope note: 運営会社: 京成電鉄。路線名: 松戸線。鉄道区分: 普通鉄道（12）。事業者種別: 民営鉄道（4）。

大久保
type: Concept
alternative label: 大久保（東日本旅客鉄道 中央線）
broader: g003604
in scheme: scheme
notation: 003604
scope note: 運営会社: 東日本旅客鉄道。路線名: 中央線。鉄道区分: 普通鉄道JR（11）。事業者種別: JR在来線（2）。

御茶ノ水
type: Concept
alternative label: 御茶ノ水（東京地下鉄 4号線丸ノ内線）
broader: g003615
in scheme: scheme
notation: 003605
scope note: 運営会社: 東京地下鉄。路線名: 4号線丸ノ内線。鉄道区分: 普通鉄道（12）。事業者種別: 民営鉄道（4）。

国分寺
type: Concept
alternative label: 国分寺（東日本旅客鉄道 中央線）
broader: g003606
in scheme: scheme
notation: 003606
scope note: 運営会社: 東日本旅客鉄道。路線名: 中央線。鉄道区分: 普通鉄道JR（11）。事業者種別: JR在来線（2）。

国分寺
type: Concept
alternative label: 国分寺（西武鉄道 国分寺線）
broader: g003606
in scheme: scheme
notation: 003607
scope note: 運営会社: 西武鉄道。路線名: 国分寺線。鉄道区分: 普通鉄道（12）。事業者種別: 民営鉄道（4）。

飯田橋
type: Concept
alternative label: 飯田橋（東日本旅客鉄道 中央線）
broader: g003595
in scheme: scheme
notation: 003608
scope note: 運営会社: 東日本旅客鉄道。路線名: 中央線。鉄道区分: 普通鉄道JR（11）。事業者種別: JR在来線（2）。

京成船橋
type: Concept
alternative label: 京成船橋（京成電鉄 本線）
broader: g003609
in scheme: scheme
notation: 003609
scope note: 運営会社: 京成電鉄。路線名: 本線。鉄道区分: 普通鉄道（12）。事業者種別: 民営鉄道（4）。

亀戸水神
type: Concept
alternative label: 亀戸水神（東武鉄道 亀戸線）
broader: g003610
in scheme: scheme
notation: 003610
scope note: 運営会社: 東武鉄道。路線名: 亀戸線。鉄道区分: 普通鉄道（12）。事業者種別: 民営鉄道（4）。

西国分寺
type: Concept
alternative label: 西国分寺（東日本旅客鉄道 武蔵野線）
broader: g003611
in scheme: scheme
notation: 003611
scope note: 運営会社: 東日本旅客鉄道。路線名: 武蔵野線。鉄道区分: 普通鉄道JR（11）。事業者種別: JR在来線（2）。

東新宿
type: Concept
alternative label: 東新宿（東京地下鉄 13号線副都心線）
broader: g003612
in scheme: scheme
notation: 003612
scope note: 運営会社: 東京地下鉄。路線名: 13号線副都心線。鉄道区分: 普通鉄道（12）。事業者種別: 民営鉄道（4）。

東船橋
type: Concept
alternative label: 東船橋（東日本旅客鉄道 総武線）
broader: g003613
in scheme: scheme
notation: 003613
scope note: 運営会社: 東日本旅客鉄道。路線名: 総武線。鉄道区分: 普通鉄道JR（11）。事業者種別: JR在来線（2）。

西国分寺
type: Concept
alternative label: 西国分寺（東日本旅客鉄道 中央線）
broader: g003611
in scheme: scheme
notation: 003614
scope note: 運営会社: 東日本旅客鉄道。路線名: 中央線。鉄道区分: 普通鉄道JR（11）。事業者種別: JR在来線（2）。

御茶ノ水
type: Concept
alternative label: 御茶ノ水（東日本旅客鉄道 総武線）
broader: g003615
in scheme: scheme
notation: 003615
scope note: 運営会社: 東日本旅客鉄道。路線名: 総武線。鉄道区分: 普通鉄道JR（11）。事業者種別: JR在来線（2）。

御茶ノ水
type: Concept
alternative label: 御茶ノ水（東日本旅客鉄道 中央線）
broader: g003615
in scheme: scheme
notation: 003616
scope note: 運営会社: 東日本旅客鉄道。路線名: 中央線。鉄道区分: 普通鉄道JR（11）。事業者種別: JR在来線（2）。

立川北
type: Concept
alternative label: 立川北（多摩都市モノレール 多摩都市モノレール線）
broader: g003617
in scheme: scheme
notation: 003617
scope note: 運営会社: 多摩都市モノレール。路線名: 多摩都市モノレール線。鉄道区分: 跨座式モノレール（23）。事業者種別: 第三セクター（5）。

牛込柳町
type: Concept
alternative label: 牛込柳町（東京都 12号線大江戸線）
broader: g003618
in scheme: scheme
notation: 003618
scope note: 運営会社: 東京都。路線名: 12号線大江戸線。鉄道区分: 普通鉄道（12）。事業者種別: 公営鉄道（3）。

南阿佐ヶ谷
type: Concept
alternative label: 南阿佐ヶ谷（東京地下鉄 4号線丸ノ内線）
broader: g003619
in scheme: scheme
notation: 003619
scope note: 運営会社: 東京地下鉄。路線名: 4号線丸ノ内線。鉄道区分: 普通鉄道（12）。事業者種別: 民営鉄道（4）。

外川
type: Concept
alternative label: 外川（銚子電気鉄道 銚子電気鉄道線）
broader: g003620
in scheme: scheme
notation: 003620
scope note: 運営会社: 銚子電気鉄道。路線名: 銚子電気鉄道線。鉄道区分: 普通鉄道（12）。事業者種別: 民営鉄道（4）。

八日市場
type: Concept
alternative label: 八日市場（東日本旅客鉄道 総武線）
broader: g003621
in scheme: scheme
notation: 003621
scope note: 運営会社: 東日本旅客鉄道。路線名: 総武線。鉄道区分: 普通鉄道JR（11）。事業者種別: JR在来線（2）。

国立
type: Concept
alternative label: 国立（東日本旅客鉄道 中央線）
broader: g003622
in scheme: scheme
notation: 003622
scope note: 運営会社: 東日本旅客鉄道。路線名: 中央線。鉄道区分: 普通鉄道JR（11）。事業者種別: JR在来線（2）。

若松河田
type: Concept
alternative label: 若松河田（東京都 12号線大江戸線）
broader: g003623
in scheme: scheme
notation: 003623
scope note: 運営会社: 東京都。路線名: 12号線大江戸線。鉄道区分: 普通鉄道（12）。事業者種別: 公営鉄道（3）。

秋葉原
type: Concept
alternative label: 秋葉原（首都圏新都市鉄道 常磐新線）
broader: g003624
in scheme: scheme
notation: 003624
scope note: 運営会社: 首都圏新都市鉄道。路線名: 常磐新線。鉄道区分: 普通鉄道（12）。事業者種別: 第三セクター（5）。

秋葉原
type: Concept
alternative label: 秋葉原（東日本旅客鉄道 東北線）
broader: g003624
in scheme: scheme
notation: 003625
scope note: 運営会社: 東日本旅客鉄道。路線名: 東北線。鉄道区分: 普通鉄道JR（11）。事業者種別: JR在来線（2）。

秋葉原
type: Concept
alternative label: 秋葉原（東日本旅客鉄道 総武線）
broader: g003624
in scheme: scheme
notation: 003626
scope note: 運営会社: 東日本旅客鉄道。路線名: 総武線。鉄道区分: 普通鉄道JR（11）。事業者種別: JR在来線（2）。

立川
type: Concept
alternative label: 立川（東日本旅客鉄道 青梅線）
broader: g003634
in scheme: scheme
notation: 003627
scope note: 運営会社: 東日本旅客鉄道。路線名: 青梅線。鉄道区分: 普通鉄道JR（11）。事業者種別: JR在来線（2）。

東高円寺
type: Concept
alternative label: 東高円寺（東京地下鉄 4号線丸ノ内線）
broader: g003628
in scheme: scheme
notation: 003628
scope note: 運営会社: 東京地下鉄。路線名: 4号線丸ノ内線。鉄道区分: 普通鉄道（12）。事業者種別: 民営鉄道（4）。

秋葉原
type: Concept
alternative label: 秋葉原（東京地下鉄 2号線日比谷線）
broader: g003624
in scheme: scheme
notation: 003629
scope note: 運営会社: 東京地下鉄。路線名: 2号線日比谷線。鉄道区分: 普通鉄道（12）。事業者種別: 民営鉄道（4）。

東新宿
type: Concept
alternative label: 東新宿（東京都 12号線大江戸線）
broader: g003612
in scheme: scheme
notation: 003630
scope note: 運営会社: 東京都。路線名: 12号線大江戸線。鉄道区分: 普通鉄道（12）。事業者種別: 公営鉄道（3）。

中野坂上
type: Concept
alternative label: 中野坂上（東京都 12号線大江戸線）
broader: g003643
in scheme: scheme
notation: 003631
scope note: 運営会社: 東京都。路線名: 12号線大江戸線。鉄道区分: 普通鉄道（12）。事業者種別: 公営鉄道（3）。

新高円寺
type: Concept
alternative label: 新高円寺（東京地下鉄 4号線丸ノ内線）
broader: g003632
in scheme: scheme
notation: 003632
scope note: 運営会社: 東京地下鉄。路線名: 4号線丸ノ内線。鉄道区分: 普通鉄道（12）。事業者種別: 民営鉄道（4）。

須原
type: Concept
alternative label: 須原（東海旅客鉄道 中央線）
broader: g003633
in scheme: scheme
notation: 003633
scope note: 運営会社: 東海旅客鉄道。路線名: 中央線。鉄道区分: 普通鉄道JR（11）。事業者種別: JR在来線（2）。

立川
type: Concept
alternative label: 立川（東日本旅客鉄道 中央線）
broader: g003634
in scheme: scheme
notation: 003634
scope note: 運営会社: 東日本旅客鉄道。路線名: 中央線。鉄道区分: 普通鉄道JR（11）。事業者種別: JR在来線（2）。

亀戸
type: Concept
alternative label: 亀戸（東武鉄道 亀戸線）
broader: g003635
in scheme: scheme
notation: 003635
scope note: 運営会社: 東武鉄道。路線名: 亀戸線。鉄道区分: 普通鉄道（12）。事業者種別: 民営鉄道（4）。

浅草橋
type: Concept
alternative label: 浅草橋（東京都 1号線浅草線）
broader: g003636
in scheme: scheme
notation: 003636
scope note: 運営会社: 東京都。路線名: 1号線浅草線。鉄道区分: 普通鉄道（12）。事業者種別: 公営鉄道（3）。

立川
type: Concept
alternative label: 立川（東日本旅客鉄道 南武線）
broader: g003634
in scheme: scheme
notation: 003637
scope note: 運営会社: 東日本旅客鉄道。路線名: 南武線。鉄道区分: 普通鉄道JR（11）。事業者種別: JR在来線（2）。

新中野
type: Concept
alternative label: 新中野（東京地下鉄 4号線丸ノ内線）
broader: g003638
in scheme: scheme
notation: 003638
scope note: 運営会社: 東京地下鉄。路線名: 4号線丸ノ内線。鉄道区分: 普通鉄道（12）。事業者種別: 民営鉄道（4）。

錦糸町
type: Concept
alternative label: 錦糸町（東京地下鉄 11号線半蔵門線）
broader: g003639
in scheme: scheme
notation: 003639
scope note: 運営会社: 東京地下鉄。路線名: 11号線半蔵門線。鉄道区分: 普通鉄道（12）。事業者種別: 民営鉄道（4）。

浅草橋
type: Concept
alternative label: 浅草橋（東日本旅客鉄道 総武線）
broader: g003636
in scheme: scheme
notation: 003640
scope note: 運営会社: 東日本旅客鉄道。路線名: 総武線。鉄道区分: 普通鉄道JR（11）。事業者種別: JR在来線（2）。

亀戸
type: Concept
alternative label: 亀戸（東日本旅客鉄道 総武線）
broader: g003635
in scheme: scheme
notation: 003641
scope note: 運営会社: 東日本旅客鉄道。路線名: 総武線。鉄道区分: 普通鉄道JR（11）。事業者種別: JR在来線（2）。

井の頭公園
type: Concept
alternative label: 井の頭公園（京王電鉄 井の頭線）
broader: g003642
in scheme: scheme
notation: 003642
scope note: 運営会社: 京王電鉄。路線名: 井の頭線。鉄道区分: 普通鉄道（12）。事業者種別: 民営鉄道（4）。

中野坂上
type: Concept
alternative label: 中野坂上（東京地下鉄 4号線丸ノ内線）
broader: g003643
in scheme: scheme
notation: 003643
scope note: 運営会社: 東京地下鉄。路線名: 4号線丸ノ内線。鉄道区分: 普通鉄道（12）。事業者種別: 民営鉄道（4）。

中野坂上
type: Concept
alternative label: 中野坂上（東京地下鉄 4号線丸ノ内線分岐線）
broader: g003643
in scheme: scheme
notation: 003644
scope note: 運営会社: 東京地下鉄。路線名: 4号線丸ノ内線分岐線。鉄道区分: 普通鉄道（12）。事業者種別: 民営鉄道（4）。

新御茶ノ水
type: Concept
alternative label: 新御茶ノ水（東京地下鉄 9号線千代田線）
broader: g003645
in scheme: scheme
notation: 003645
scope note: 運営会社: 東京地下鉄。路線名: 9号線千代田線。鉄道区分: 普通鉄道（12）。事業者種別: 民営鉄道（4）。

両国
type: Concept
alternative label: 両国（東京都 12号線大江戸線）
broader: g003646
in scheme: scheme
notation: 003646
scope note: 運営会社: 東京都。路線名: 12号線大江戸線。鉄道区分: 普通鉄道（12）。事業者種別: 公営鉄道（3）。

錦糸町
type: Concept
alternative label: 錦糸町（東日本旅客鉄道 総武線）
broader: g003639
in scheme: scheme
notation: 003647
scope note: 運営会社: 東日本旅客鉄道。路線名: 総武線。鉄道区分: 普通鉄道JR（11）。事業者種別: JR在来線（2）。

西武新宿
type: Concept
alternative label: 西武新宿（西武鉄道 新宿線）
broader: g003648
in scheme: scheme
notation: 003648
scope note: 運営会社: 西武鉄道。路線名: 新宿線。鉄道区分: 普通鉄道（12）。事業者種別: 民営鉄道（4）。

立川南
type: Concept
alternative label: 立川南（多摩都市モノレール 多摩都市モノレール線）
broader: g003649
in scheme: scheme
notation: 003649
scope note: 運営会社: 多摩都市モノレール。路線名: 多摩都市モノレール線。鉄道区分: 跨座式モノレール（23）。事業者種別: 第三セクター（5）。

九段下
type: Concept
alternative label: 九段下（東京地下鉄 5号線東西線）
broader: g003657
in scheme: scheme
notation: 003650
scope note: 運営会社: 東京地下鉄。路線名: 5号線東西線。鉄道区分: 普通鉄道（12）。事業者種別: 民営鉄道（4）。

神保町
type: Concept
alternative label: 神保町（東京都 10号線新宿線）
broader: g003651
in scheme: scheme
notation: 003651
scope note: 運営会社: 東京都。路線名: 10号線新宿線。鉄道区分: 普通鉄道（12）。事業者種別: 公営鉄道（3）。

神保町
type: Concept
alternative label: 神保町（東京地下鉄 11号線半蔵門線）
broader: g003651
in scheme: scheme
notation: 003652
scope note: 運営会社: 東京地下鉄。路線名: 11号線半蔵門線。鉄道区分: 普通鉄道（12）。事業者種別: 民営鉄道（4）。

新小金井
type: Concept
alternative label: 新小金井（西武鉄道 多摩川線）
broader: g003653
in scheme: scheme
notation: 003653
scope note: 運営会社: 西武鉄道。路線名: 多摩川線。鉄道区分: 普通鉄道（12）。事業者種別: 民営鉄道（4）。

両国
type: Concept
alternative label: 両国（東日本旅客鉄道 総武線）
broader: g003654
in scheme: scheme
notation: 003654
scope note: 運営会社: 東日本旅客鉄道。路線名: 総武線。鉄道区分: 普通鉄道JR（11）。事業者種別: JR在来線（2）。

岩本町
type: Concept
alternative label: 岩本町（東京都 10号線新宿線）
broader: g003655
in scheme: scheme
notation: 003655
scope note: 運営会社: 東京都。路線名: 10号線新宿線。鉄道区分: 普通鉄道（12）。事業者種別: 公営鉄道（3）。

田切
type: Concept
alternative label: 田切（東海旅客鉄道 飯田線）
broader: g003656
in scheme: scheme
notation: 003656
scope note: 運営会社: 東海旅客鉄道。路線名: 飯田線。鉄道区分: 普通鉄道JR（11）。事業者種別: JR在来線（2）。

九段下
type: Concept
alternative label: 九段下（東京都 10号線新宿線）
broader: g003657
in scheme: scheme
notation: 003657
scope note: 運営会社: 東京都。路線名: 10号線新宿線。鉄道区分: 普通鉄道（12）。事業者種別: 公営鉄道（3）。

九段下
type: Concept
alternative label: 九段下（東京地下鉄 11号線半蔵門線）
broader: g003657
in scheme: scheme
notation: 003658
scope note: 運営会社: 東京地下鉄。路線名: 11号線半蔵門線。鉄道区分: 普通鉄道（12）。事業者種別: 民営鉄道（4）。

小川町
type: Concept
alternative label: 小川町（東京都 10号線新宿線）
broader: g003659
in scheme: scheme
notation: 003659
scope note: 運営会社: 東京都。路線名: 10号線新宿線。鉄道区分: 普通鉄道（12）。事業者種別: 公営鉄道（3）。

神保町
type: Concept
alternative label: 神保町（東京都 6号線三田線）
broader: g003651
in scheme: scheme
notation: 003660
scope note: 運営会社: 東京都。路線名: 6号線三田線。鉄道区分: 普通鉄道（12）。事業者種別: 公営鉄道（3）。

淡路町
type: Concept
alternative label: 淡路町（東京地下鉄 4号線丸ノ内線）
broader: g003661
in scheme: scheme
notation: 003661
scope note: 運営会社: 東京地下鉄。路線名: 4号線丸ノ内線。鉄道区分: 普通鉄道（12）。事業者種別: 民営鉄道（4）。

西新宿
type: Concept
alternative label: 西新宿（東京地下鉄 4号線丸ノ内線）
broader: g003662
in scheme: scheme
notation: 003662
scope note: 運営会社: 東京地下鉄。路線名: 4号線丸ノ内線。鉄道区分: 普通鉄道（12）。事業者種別: 民営鉄道（4）。

東山梨
type: Concept
alternative label: 東山梨（東日本旅客鉄道 中央線）
broader: g003663
in scheme: scheme
notation: 003663
scope note: 運営会社: 東日本旅客鉄道。路線名: 中央線。鉄道区分: 普通鉄道JR（11）。事業者種別: JR在来線（2）。

大神宮下
type: Concept
alternative label: 大神宮下（京成電鉄 本線）
broader: g003664
in scheme: scheme
notation: 003664
scope note: 運営会社: 京成電鉄。路線名: 本線。鉄道区分: 普通鉄道（12）。事業者種別: 民営鉄道（4）。

西国立
type: Concept
alternative label: 西国立（東日本旅客鉄道 南武線）
broader: g003665
in scheme: scheme
notation: 003665
scope note: 運営会社: 東日本旅客鉄道。路線名: 南武線。鉄道区分: 普通鉄道JR（11）。事業者種別: JR在来線（2）。

神田
type: Concept
alternative label: 神田（東京地下鉄 3号線銀座線）
broader: g003677
in scheme: scheme
notation: 003666
scope note: 運営会社: 東京地下鉄。路線名: 3号線銀座線。鉄道区分: 普通鉄道（12）。事業者種別: 民営鉄道（4）。

瑞江
type: Concept
alternative label: 瑞江（東京都 10号線新宿線）
broader: g003667
in scheme: scheme
notation: 003667
scope note: 運営会社: 東京都。路線名: 10号線新宿線。鉄道区分: 普通鉄道（12）。事業者種別: 公営鉄道（3）。

馬喰町
type: Concept
alternative label: 馬喰町（東日本旅客鉄道 総武線）
broader: g003668
in scheme: scheme
notation: 003668
scope note: 運営会社: 東日本旅客鉄道。路線名: 総武線。鉄道区分: 普通鉄道JR（11）。事業者種別: JR在来線（2）。

新宿西口
type: Concept
alternative label: 新宿西口（東京都 12号線大江戸線）
broader: g003669
in scheme: scheme
notation: 003669
scope note: 運営会社: 東京都。路線名: 12号線大江戸線。鉄道区分: 普通鉄道（12）。事業者種別: 公営鉄道（3）。

市ヶ谷
type: Concept
alternative label: 市ヶ谷（東京地下鉄 7号線南北線）
broader: g003671
in scheme: scheme
notation: 003670
scope note: 運営会社: 東京地下鉄。路線名: 7号線南北線。鉄道区分: 普通鉄道（12）。事業者種別: 民営鉄道（4）。

市ヶ谷
type: Concept
alternative label: 市ヶ谷（東京地下鉄 8号線有楽町線）
broader: g003671
in scheme: scheme
notation: 003671
scope note: 運営会社: 東京地下鉄。路線名: 8号線有楽町線。鉄道区分: 普通鉄道（12）。事業者種別: 民営鉄道（4）。

新宿
type: Concept
alternative label: 新宿（東京地下鉄 4号線丸ノ内線）
broader: g003700
in scheme: scheme
notation: 003672
scope note: 運営会社: 東京地下鉄。路線名: 4号線丸ノ内線。鉄道区分: 普通鉄道（12）。事業者種別: 民営鉄道（4）。

曙橋
type: Concept
alternative label: 曙橋（東京都 10号線新宿線）
broader: g003673
in scheme: scheme
notation: 003673
scope note: 運営会社: 東京都。路線名: 10号線新宿線。鉄道区分: 普通鉄道（12）。事業者種別: 公営鉄道（3）。

三鷹台
type: Concept
alternative label: 三鷹台（京王電鉄 井の頭線）
broader: g003674
in scheme: scheme
notation: 003674
scope note: 運営会社: 京王電鉄。路線名: 井の頭線。鉄道区分: 普通鉄道（12）。事業者種別: 民営鉄道（4）。

馬喰横山
type: Concept
alternative label: 馬喰横山（東京都 10号線新宿線）
broader: g003675
in scheme: scheme
notation: 003675
scope note: 運営会社: 東京都。路線名: 10号線新宿線。鉄道区分: 普通鉄道（12）。事業者種別: 公営鉄道（3）。

東日本橋
type: Concept
alternative label: 東日本橋（東京都 1号線浅草線）
broader: g003676
in scheme: scheme
notation: 003676
scope note: 運営会社: 東京都。路線名: 1号線浅草線。鉄道区分: 普通鉄道（12）。事業者種別: 公営鉄道（3）。

神田
type: Concept
alternative label: 神田（東日本旅客鉄道 中央線）
broader: g003677
in scheme: scheme
notation: 003677
scope note: 運営会社: 東日本旅客鉄道。路線名: 中央線。鉄道区分: 普通鉄道JR（11）。事業者種別: JR在来線（2）。

神田
type: Concept
alternative label: 神田（東日本旅客鉄道 東北線）
broader: g003677
in scheme: scheme
notation: 003678
scope note: 運営会社: 東日本旅客鉄道。路線名: 東北線。鉄道区分: 普通鉄道JR（11）。事業者種別: JR在来線（2）。

中野新橋
type: Concept
alternative label: 中野新橋（東京地下鉄 4号線丸ノ内線分岐線）
broader: g003679
in scheme: scheme
notation: 003679
scope note: 運営会社: 東京地下鉄。路線名: 4号線丸ノ内線分岐線。鉄道区分: 普通鉄道（12）。事業者種別: 民営鉄道（4）。

市ヶ谷
type: Concept
alternative label: 市ヶ谷（東京都 10号線新宿線）
broader: g003671
in scheme: scheme
notation: 003680
scope note: 運営会社: 東京都。路線名: 10号線新宿線。鉄道区分: 普通鉄道（12）。事業者種別: 公営鉄道（3）。

津田沼
type: Concept
alternative label: 津田沼（東日本旅客鉄道 総武線）
broader: g003681
in scheme: scheme
notation: 003681
scope note: 運営会社: 東日本旅客鉄道。路線名: 総武線。鉄道区分: 普通鉄道JR（11）。事業者種別: JR在来線（2）。

二俣新町
type: Concept
alternative label: 二俣新町（東日本旅客鉄道 京葉線）
broader: g003682
in scheme: scheme
notation: 003682
scope note: 運営会社: 東日本旅客鉄道。路線名: 京葉線。鉄道区分: 普通鉄道JR（11）。事業者種別: JR在来線（2）。

新宿
type: Concept
alternative label: 新宿（小田急電鉄 小田原線）
broader: g003700
in scheme: scheme
notation: 003683
scope note: 運営会社: 小田急電鉄。路線名: 小田原線。鉄道区分: 普通鉄道（12）。事業者種別: 民営鉄道（4）。

新宿三丁目
type: Concept
alternative label: 新宿三丁目（東京地下鉄 4号線丸ノ内線）
broader: g003689
in scheme: scheme
notation: 003684
scope note: 運営会社: 東京地下鉄。路線名: 4号線丸ノ内線。鉄道区分: 普通鉄道（12）。事業者種別: 民営鉄道（4）。

市ヶ谷
type: Concept
alternative label: 市ヶ谷（東日本旅客鉄道 中央線）
broader: g003671
in scheme: scheme
notation: 003685
scope note: 運営会社: 東日本旅客鉄道。路線名: 中央線。鉄道区分: 普通鉄道JR（11）。事業者種別: JR在来線（2）。

妙典
type: Concept
alternative label: 妙典（東京地下鉄 5号線東西線）
broader: g003686
in scheme: scheme
notation: 003686
scope note: 運営会社: 東京地下鉄。路線名: 5号線東西線。鉄道区分: 普通鉄道（12）。事業者種別: 民営鉄道（4）。

新宿三丁目
type: Concept
alternative label: 新宿三丁目（東京都 10号線新宿線）
broader: g003689
in scheme: scheme
notation: 003687
scope note: 運営会社: 東京都。路線名: 10号線新宿線。鉄道区分: 普通鉄道（12）。事業者種別: 公営鉄道（3）。

中野富士見町
type: Concept
alternative label: 中野富士見町（東京地下鉄 4号線丸ノ内線分岐線）
broader: g003688
in scheme: scheme
notation: 003688
scope note: 運営会社: 東京地下鉄。路線名: 4号線丸ノ内線分岐線。鉄道区分: 普通鉄道（12）。事業者種別: 民営鉄道（4）。

新宿三丁目
type: Concept
alternative label: 新宿三丁目（東京地下鉄 13号線副都心線）
broader: g003689
in scheme: scheme
notation: 003689
scope note: 運営会社: 東京地下鉄。路線名: 13号線副都心線。鉄道区分: 普通鉄道（12）。事業者種別: 民営鉄道（4）。

都庁前
type: Concept
alternative label: 都庁前（東京都 12号線大江戸線）
broader: g003690
in scheme: scheme
notation: 003690
scope note: 運営会社: 東京都。路線名: 12号線大江戸線。鉄道区分: 普通鉄道（12）。事業者種別: 公営鉄道（3）。

竹橋
type: Concept
alternative label: 竹橋（東京地下鉄 5号線東西線）
broader: g003691
in scheme: scheme
notation: 003691
scope note: 運営会社: 東京地下鉄。路線名: 5号線東西線。鉄道区分: 普通鉄道（12）。事業者種別: 民営鉄道（4）。

小伝馬町
type: Concept
alternative label: 小伝馬町（東京地下鉄 2号線日比谷線）
broader: g003692
in scheme: scheme
notation: 003692
scope note: 運営会社: 東京地下鉄。路線名: 2号線日比谷線。鉄道区分: 普通鉄道（12）。事業者種別: 民営鉄道（4）。

新宿
type: Concept
alternative label: 新宿（東日本旅客鉄道 中央線）
broader: g003700
in scheme: scheme
notation: 003693
scope note: 運営会社: 東日本旅客鉄道。路線名: 中央線。鉄道区分: 普通鉄道JR（11）。事業者種別: JR在来線（2）。

新津田沼
type: Concept
alternative label: 新津田沼（京成電鉄 松戸線）
broader: g003694
in scheme: scheme
notation: 003694
scope note: 運営会社: 京成電鉄。路線名: 松戸線。鉄道区分: 普通鉄道（12）。事業者種別: 民営鉄道（4）。

東大島
type: Concept
alternative label: 東大島（東京都 10号線新宿線）
broader: g003695
in scheme: scheme
notation: 003695
scope note: 運営会社: 東京都。路線名: 10号線新宿線。鉄道区分: 普通鉄道（12）。事業者種別: 公営鉄道（3）。

西新宿五丁目
type: Concept
alternative label: 西新宿五丁目（東京都 12号線大江戸線）
broader: g003696
in scheme: scheme
notation: 003696
scope note: 運営会社: 東京都。路線名: 12号線大江戸線。鉄道区分: 普通鉄道（12）。事業者種別: 公営鉄道（3）。

柴崎体育館
type: Concept
alternative label: 柴崎体育館（多摩都市モノレール 多摩都市モノレール線）
broader: g003697
in scheme: scheme
notation: 003697
scope note: 運営会社: 多摩都市モノレール。路線名: 多摩都市モノレール線。鉄道区分: 跨座式モノレール（23）。事業者種別: 第三セクター（5）。

大島
type: Concept
alternative label: 大島（東京都 10号線新宿線）
broader: g003698
in scheme: scheme
notation: 003698
scope note: 運営会社: 東京都。路線名: 10号線新宿線。鉄道区分: 普通鉄道（12）。事業者種別: 公営鉄道（3）。

船橋競馬場
type: Concept
alternative label: 船橋競馬場（京成電鉄 本線）
broader: g003699
in scheme: scheme
notation: 003699
scope note: 運営会社: 京成電鉄。路線名: 本線。鉄道区分: 普通鉄道（12）。事業者種別: 民営鉄道（4）。

新宿
type: Concept
alternative label: 新宿（京王電鉄 京王線）
broader: g003700
in scheme: scheme
notation: 003700
scope note: 運営会社: 京王電鉄。路線名: 京王線。鉄道区分: 普通鉄道（12）。事業者種別: 民営鉄道（4）。

新宿
type: Concept
alternative label: 新宿（東日本旅客鉄道 山手線）
broader: g003700
in scheme: scheme
notation: 003701
scope note: 運営会社: 東日本旅客鉄道。路線名: 山手線。鉄道区分: 普通鉄道JR（11）。事業者種別: JR在来線（2）。

西大島
type: Concept
alternative label: 西大島（東京都 10号線新宿線）
broader: g003702
in scheme: scheme
notation: 003702
scope note: 運営会社: 東京都。路線名: 10号線新宿線。鉄道区分: 普通鉄道（12）。事業者種別: 公営鉄道（3）。

新日本橋
type: Concept
alternative label: 新日本橋（東日本旅客鉄道 総武線）
broader: g003703
in scheme: scheme
notation: 003703
scope note: 運営会社: 東日本旅客鉄道。路線名: 総武線。鉄道区分: 普通鉄道JR（11）。事業者種別: JR在来線（2）。

住吉
type: Concept
alternative label: 住吉（東京都 10号線新宿線）
broader: g003704
in scheme: scheme
notation: 003704
scope note: 運営会社: 東京都。路線名: 10号線新宿線。鉄道区分: 普通鉄道（12）。事業者種別: 公営鉄道（3）。

住吉
type: Concept
alternative label: 住吉（東京地下鉄 11号線半蔵門線）
broader: g003704
in scheme: scheme
notation: 003705
scope note: 運営会社: 東京地下鉄。路線名: 11号線半蔵門線。鉄道区分: 普通鉄道（12）。事業者種別: 民営鉄道（4）。

浜町
type: Concept
alternative label: 浜町（東京都 10号線新宿線）
broader: g003706
in scheme: scheme
notation: 003706
scope note: 運営会社: 東京都。路線名: 10号線新宿線。鉄道区分: 普通鉄道（12）。事業者種別: 公営鉄道（3）。

新宿御苑前
type: Concept
alternative label: 新宿御苑前（東京地下鉄 4号線丸ノ内線）
broader: g003707
in scheme: scheme
notation: 003707
scope note: 運営会社: 東京地下鉄。路線名: 4号線丸ノ内線。鉄道区分: 普通鉄道（12）。事業者種別: 民営鉄道（4）。

新宿
type: Concept
alternative label: 新宿（東京都 10号線新宿線）
broader: g003700
in scheme: scheme
notation: 003708
scope note: 運営会社: 東京都。路線名: 10号線新宿線。鉄道区分: 普通鉄道（12）。事業者種別: 公営鉄道（3）。

菊川
type: Concept
alternative label: 菊川（東京都 10号線新宿線）
broader: g003709
in scheme: scheme
notation: 003709
scope note: 運営会社: 東京都。路線名: 10号線新宿線。鉄道区分: 普通鉄道（12）。事業者種別: 公営鉄道（3）。

久我山
type: Concept
alternative label: 久我山（京王電鉄 井の頭線）
broader: g003710
in scheme: scheme
notation: 003710
scope note: 運営会社: 京王電鉄。路線名: 井の頭線。鉄道区分: 普通鉄道（12）。事業者種別: 民営鉄道（4）。

森下
type: Concept
alternative label: 森下（東京都 10号線新宿線）
broader: g003711
in scheme: scheme
notation: 003711
scope note: 運営会社: 東京都。路線名: 10号線新宿線。鉄道区分: 普通鉄道（12）。事業者種別: 公営鉄道（3）。

森下
type: Concept
alternative label: 森下（東京都 12号線大江戸線）
broader: g003711
in scheme: scheme
notation: 003712
scope note: 運営会社: 東京都。路線名: 12号線大江戸線。鉄道区分: 普通鉄道（12）。事業者種別: 公営鉄道（3）。

四谷三丁目
type: Concept
alternative label: 四谷三丁目（東京地下鉄 4号線丸ノ内線）
broader: g003713
in scheme: scheme
notation: 003713
scope note: 運営会社: 東京地下鉄。路線名: 4号線丸ノ内線。鉄道区分: 普通鉄道（12）。事業者種別: 民営鉄道（4）。

塩崎
type: Concept
alternative label: 塩崎（東日本旅客鉄道 中央線）
broader: g003714
in scheme: scheme
notation: 003714
scope note: 運営会社: 東日本旅客鉄道。路線名: 中央線。鉄道区分: 普通鉄道JR（11）。事業者種別: JR在来線（2）。

新宿
type: Concept
alternative label: 新宿（東京都 12号線大江戸線）
broader: g003700
in scheme: scheme
notation: 003715
scope note: 運営会社: 東京都。路線名: 12号線大江戸線。鉄道区分: 普通鉄道（12）。事業者種別: 公営鉄道（3）。

三越前
type: Concept
alternative label: 三越前（東京地下鉄 3号線銀座線）
broader: g003716
in scheme: scheme
notation: 003716
scope note: 運営会社: 東京地下鉄。路線名: 3号線銀座線。鉄道区分: 普通鉄道（12）。事業者種別: 民営鉄道（4）。

大手町
type: Concept
alternative label: 大手町（東京地下鉄 4号線丸ノ内線）
broader: g003719
in scheme: scheme
notation: 003717
scope note: 運営会社: 東京地下鉄。路線名: 4号線丸ノ内線。鉄道区分: 普通鉄道（12）。事業者種別: 民営鉄道（4）。

実籾
type: Concept
alternative label: 実籾（京成電鉄 本線）
broader: g003718
in scheme: scheme
notation: 003718
scope note: 運営会社: 京成電鉄。路線名: 本線。鉄道区分: 普通鉄道（12）。事業者種別: 民営鉄道（4）。

大手町
type: Concept
alternative label: 大手町（東京地下鉄 11号線半蔵門線）
broader: g003719
in scheme: scheme
notation: 003719
scope note: 運営会社: 東京地下鉄。路線名: 11号線半蔵門線。鉄道区分: 普通鉄道（12）。事業者種別: 民営鉄道（4）。

深戸
type: Concept
alternative label: 深戸（長良川鉄道 越美南線）
broader: g003720
in scheme: scheme
notation: 003720
scope note: 運営会社: 長良川鉄道。路線名: 越美南線。鉄道区分: 普通鉄道（12）。事業者種別: 第三セクター（5）。

人形町
type: Concept
alternative label: 人形町（東京都 1号線浅草線）
broader: g003721
in scheme: scheme
notation: 003721
scope note: 運営会社: 東京都。路線名: 1号線浅草線。鉄道区分: 普通鉄道（12）。事業者種別: 公営鉄道（3）。

人形町
type: Concept
alternative label: 人形町（東京地下鉄 2号線日比谷線）
broader: g003721
in scheme: scheme
notation: 003722
scope note: 運営会社: 東京地下鉄。路線名: 2号線日比谷線。鉄道区分: 普通鉄道（12）。事業者種別: 民営鉄道（4）。

四ツ谷
type: Concept
alternative label: 四ツ谷（東京地下鉄 7号線南北線）
broader: g003728
in scheme: scheme
notation: 003723
scope note: 運営会社: 東京地下鉄。路線名: 7号線南北線。鉄道区分: 普通鉄道（12）。事業者種別: 民営鉄道（4）。

一之江
type: Concept
alternative label: 一之江（東京都 10号線新宿線）
broader: g003724
in scheme: scheme
notation: 003724
scope note: 運営会社: 東京都。路線名: 10号線新宿線。鉄道区分: 普通鉄道（12）。事業者種別: 公営鉄道（3）。

京成大久保
type: Concept
alternative label: 京成大久保（京成電鉄 本線）
broader: g003725
in scheme: scheme
notation: 003725
scope note: 運営会社: 京成電鉄。路線名: 本線。鉄道区分: 普通鉄道（12）。事業者種別: 民営鉄道（4）。

小宮
type: Concept
alternative label: 小宮（東日本旅客鉄道 八高線）
broader: g003726
in scheme: scheme
notation: 003726
scope note: 運営会社: 東日本旅客鉄道。路線名: 八高線。鉄道区分: 普通鉄道JR（11）。事業者種別: JR在来線（2）。

物井
type: Concept
alternative label: 物井（東日本旅客鉄道 総武線）
broader: g003727
in scheme: scheme
notation: 003727
scope note: 運営会社: 東日本旅客鉄道。路線名: 総武線。鉄道区分: 普通鉄道JR（11）。事業者種別: JR在来線（2）。

四ツ谷
type: Concept
alternative label: 四ツ谷（東日本旅客鉄道 中央線）
broader: g003728
in scheme: scheme
notation: 003728
scope note: 運営会社: 東日本旅客鉄道。路線名: 中央線。鉄道区分: 普通鉄道JR（11）。事業者種別: JR在来線（2）。

半蔵門
type: Concept
alternative label: 半蔵門（東京地下鉄 11号線半蔵門線）
broader: g003729
in scheme: scheme
notation: 003729
scope note: 運営会社: 東京地下鉄。路線名: 11号線半蔵門線。鉄道区分: 普通鉄道（12）。事業者種別: 民営鉄道（4）。

大手町
type: Concept
alternative label: 大手町（東京地下鉄 9号線千代田線）
broader: g003719
in scheme: scheme
notation: 003730
scope note: 運営会社: 東京地下鉄。路線名: 9号線千代田線。鉄道区分: 普通鉄道（12）。事業者種別: 民営鉄道（4）。

谷津
type: Concept
alternative label: 谷津（京成電鉄 本線）
broader: g003731
in scheme: scheme
notation: 003731
scope note: 運営会社: 京成電鉄。路線名: 本線。鉄道区分: 普通鉄道（12）。事業者種別: 民営鉄道（4）。

飯倉
type: Concept
alternative label: 飯倉（東日本旅客鉄道 総武線）
broader: g003732
in scheme: scheme
notation: 003732
scope note: 運営会社: 東日本旅客鉄道。路線名: 総武線。鉄道区分: 普通鉄道JR（11）。事業者種別: JR在来線（2）。

矢川
type: Concept
alternative label: 矢川（東日本旅客鉄道 南武線）
broader: g003733
in scheme: scheme
notation: 003733
scope note: 運営会社: 東日本旅客鉄道。路線名: 南武線。鉄道区分: 普通鉄道JR（11）。事業者種別: JR在来線（2）。

山梨市
type: Concept
alternative label: 山梨市（東日本旅客鉄道 中央線）
broader: g003734
in scheme: scheme
notation: 003734
scope note: 運営会社: 東日本旅客鉄道。路線名: 中央線。鉄道区分: 普通鉄道JR（11）。事業者種別: JR在来線（2）。

三越前
type: Concept
alternative label: 三越前（東京地下鉄 11号線半蔵門線）
broader: g003716
in scheme: scheme
notation: 003735
scope note: 運営会社: 東京地下鉄。路線名: 11号線半蔵門線。鉄道区分: 普通鉄道（12）。事業者種別: 民営鉄道（4）。

富士見ヶ丘
type: Concept
alternative label: 富士見ヶ丘（京王電鉄 井の頭線）
broader: g003736
in scheme: scheme
notation: 003736
scope note: 運営会社: 京王電鉄。路線名: 井の頭線。鉄道区分: 普通鉄道（12）。事業者種別: 民営鉄道（4）。

麹町
type: Concept
alternative label: 麹町（東京地下鉄 8号線有楽町線）
broader: g003737
in scheme: scheme
notation: 003737
scope note: 運営会社: 東京地下鉄。路線名: 8号線有楽町線。鉄道区分: 普通鉄道（12）。事業者種別: 民営鉄道（4）。

大手町
type: Concept
alternative label: 大手町（東京地下鉄 5号線東西線）
broader: g003719
in scheme: scheme
notation: 003738
scope note: 運営会社: 東京地下鉄。路線名: 5号線東西線。鉄道区分: 普通鉄道（12）。事業者種別: 民営鉄道（4）。

大桑
type: Concept
alternative label: 大桑（東海旅客鉄道 中央線）
broader: g003739
in scheme: scheme
notation: 003739
scope note: 運営会社: 東海旅客鉄道。路線名: 中央線。鉄道区分: 普通鉄道JR（11）。事業者種別: JR在来線（2）。

四ツ谷
type: Concept
alternative label: 四ツ谷（東京地下鉄 4号線丸ノ内線）
broader: g003728
in scheme: scheme
notation: 003740
scope note: 運営会社: 東京地下鉄。路線名: 4号線丸ノ内線。鉄道区分: 普通鉄道（12）。事業者種別: 民営鉄道（4）。

榎戸
type: Concept
alternative label: 榎戸（東日本旅客鉄道 総武線）
broader: g003741
in scheme: scheme
notation: 003741
scope note: 運営会社: 東日本旅客鉄道。路線名: 総武線。鉄道区分: 普通鉄道JR（11）。事業者種別: JR在来線（2）。

大手町
type: Concept
alternative label: 大手町（東京都 6号線三田線）
broader: g003719
in scheme: scheme
notation: 003742
scope note: 運営会社: 東京都。路線名: 6号線三田線。鉄道区分: 普通鉄道（12）。事業者種別: 公営鉄道（3）。

代々木
type: Concept
alternative label: 代々木（東日本旅客鉄道 山手線）
broader: g003743
in scheme: scheme
notation: 003743
scope note: 運営会社: 東日本旅客鉄道。路線名: 山手線。鉄道区分: 普通鉄道JR（11）。事業者種別: JR在来線（2）。

代々木
type: Concept
alternative label: 代々木（東日本旅客鉄道 中央線）
broader: g003743
in scheme: scheme
notation: 003744
scope note: 運営会社: 東日本旅客鉄道。路線名: 中央線。鉄道区分: 普通鉄道JR（11）。事業者種別: JR在来線（2）。

船堀
type: Concept
alternative label: 船堀（東京都 10号線新宿線）
broader: g003745
in scheme: scheme
notation: 003745
scope note: 運営会社: 東京都。路線名: 10号線新宿線。鉄道区分: 普通鉄道（12）。事業者種別: 公営鉄道（3）。

代々木
type: Concept
alternative label: 代々木（東京都 12号線大江戸線）
broader: g003743
in scheme: scheme
notation: 003746
scope note: 運営会社: 東京都。路線名: 12号線大江戸線。鉄道区分: 普通鉄道（12）。事業者種別: 公営鉄道（3）。

京成津田沼
type: Concept
alternative label: 京成津田沼（京成電鉄 松戸線）
broader: g003747
in scheme: scheme
notation: 003747
scope note: 運営会社: 京成電鉄。路線名: 松戸線。鉄道区分: 普通鉄道（12）。事業者種別: 民営鉄道（4）。

京成津田沼
type: Concept
alternative label: 京成津田沼（京成電鉄 千葉線）
broader: g003747
in scheme: scheme
notation: 003748
scope note: 運営会社: 京成電鉄。路線名: 千葉線。鉄道区分: 普通鉄道（12）。事業者種別: 民営鉄道（4）。

京成津田沼
type: Concept
alternative label: 京成津田沼（京成電鉄 本線）
broader: g003747
in scheme: scheme
notation: 003749
scope note: 運営会社: 京成電鉄。路線名: 本線。鉄道区分: 普通鉄道（12）。事業者種別: 民営鉄道（4）。

南新宿
type: Concept
alternative label: 南新宿（小田急電鉄 小田原線）
broader: g003750
in scheme: scheme
notation: 003750
scope note: 運営会社: 小田急電鉄。路線名: 小田原線。鉄道区分: 普通鉄道（12）。事業者種別: 民営鉄道（4）。

方南町
type: Concept
alternative label: 方南町（東京地下鉄 4号線丸ノ内線分岐線）
broader: g003751
in scheme: scheme
notation: 003751
scope note: 運営会社: 東京地下鉄。路線名: 4号線丸ノ内線分岐線。鉄道区分: 普通鉄道（12）。事業者種別: 民営鉄道（4）。

高井戸
type: Concept
alternative label: 高井戸（京王電鉄 井の頭線）
broader: g003752
in scheme: scheme
notation: 003752
scope note: 運営会社: 京王電鉄。路線名: 井の頭線。鉄道区分: 普通鉄道（12）。事業者種別: 民営鉄道（4）。

水天宮前
type: Concept
alternative label: 水天宮前（東京地下鉄 11号線半蔵門線）
broader: g003753
in scheme: scheme
notation: 003753
scope note: 運営会社: 東京地下鉄。路線名: 11号線半蔵門線。鉄道区分: 普通鉄道（12）。事業者種別: 民営鉄道（4）。

清澄白河
type: Concept
alternative label: 清澄白河（東京都 12号線大江戸線）
broader: g003754
in scheme: scheme
notation: 003754
scope note: 運営会社: 東京都。路線名: 12号線大江戸線。鉄道区分: 普通鉄道（12）。事業者種別: 公営鉄道（3）。

行徳
type: Concept
alternative label: 行徳（東京地下鉄 5号線東西線）
broader: g003755
in scheme: scheme
notation: 003755
scope note: 運営会社: 東京地下鉄。路線名: 5号線東西線。鉄道区分: 普通鉄道（12）。事業者種別: 民営鉄道（4）。

日本橋
type: Concept
alternative label: 日本橋（東京地下鉄 5号線東西線）
broader: g003756
in scheme: scheme
notation: 003756
scope note: 運営会社: 東京地下鉄。路線名: 5号線東西線。鉄道区分: 普通鉄道（12）。事業者種別: 民営鉄道（4）。

清澄白河
type: Concept
alternative label: 清澄白河（東京地下鉄 11号線半蔵門線）
broader: g003754
in scheme: scheme
notation: 003757
scope note: 運営会社: 東京地下鉄。路線名: 11号線半蔵門線。鉄道区分: 普通鉄道（12）。事業者種別: 民営鉄道（4）。

東京
type: Concept
alternative label: 東京（東京地下鉄 4号線丸ノ内線）
broader: g003766
in scheme: scheme
notation: 003758
scope note: 運営会社: 東京地下鉄。路線名: 4号線丸ノ内線。鉄道区分: 普通鉄道（12）。事業者種別: 民営鉄道（4）。

日本橋
type: Concept
alternative label: 日本橋（東京地下鉄 3号線銀座線）
broader: g003756
in scheme: scheme
notation: 003759
scope note: 運営会社: 東京地下鉄。路線名: 3号線銀座線。鉄道区分: 普通鉄道（12）。事業者種別: 民営鉄道（4）。

東京
type: Concept
alternative label: 東京（東日本旅客鉄道 総武線）
broader: g003766
in scheme: scheme
notation: 003760
scope note: 運営会社: 東日本旅客鉄道。路線名: 総武線。鉄道区分: 普通鉄道JR（11）。事業者種別: JR在来線（2）。

南船橋
type: Concept
alternative label: 南船橋（東日本旅客鉄道 京葉線）
broader: g003761
in scheme: scheme
notation: 003761
scope note: 運営会社: 東日本旅客鉄道。路線名: 京葉線。鉄道区分: 普通鉄道JR（11）。事業者種別: JR在来線（2）。

日本橋
type: Concept
alternative label: 日本橋（東京都 1号線浅草線）
broader: g003756
in scheme: scheme
notation: 003762
scope note: 運営会社: 東京都。路線名: 1号線浅草線。鉄道区分: 普通鉄道（12）。事業者種別: 公営鉄道（3）。

浜田山
type: Concept
alternative label: 浜田山（京王電鉄 井の頭線）
broader: g003763
in scheme: scheme
notation: 003763
scope note: 運営会社: 京王電鉄。路線名: 井の頭線。鉄道区分: 普通鉄道（12）。事業者種別: 民営鉄道（4）。

初台
type: Concept
alternative label: 初台（京王電鉄 京王線）
broader: g003764
in scheme: scheme
notation: 003764
scope note: 運営会社: 京王電鉄。路線名: 京王線。鉄道区分: 普通鉄道（12）。事業者種別: 民営鉄道（4）。

谷保
type: Concept
alternative label: 谷保（東日本旅客鉄道 南武線）
broader: g003765
in scheme: scheme
notation: 003765
scope note: 運営会社: 東日本旅客鉄道。路線名: 南武線。鉄道区分: 普通鉄道JR（11）。事業者種別: JR在来線（2）。

東京
type: Concept
alternative label: 東京（東日本旅客鉄道 東北線）
broader: g003766
in scheme: scheme
notation: 003766
scope note: 運営会社: 東日本旅客鉄道。路線名: 東北線。鉄道区分: 普通鉄道JR（11）。事業者種別: JR在来線（2）。

千駄ヶ谷
type: Concept
alternative label: 千駄ヶ谷（東日本旅客鉄道 中央線）
broader: g003767
in scheme: scheme
notation: 003767
scope note: 運営会社: 東日本旅客鉄道。路線名: 中央線。鉄道区分: 普通鉄道JR（11）。事業者種別: JR在来線（2）。

東京
type: Concept
alternative label: 東京（東海旅客鉄道 東海道新幹線）
broader: g003766
in scheme: scheme
notation: 003768
scope note: 運営会社: 東海旅客鉄道。路線名: 東海道新幹線。鉄道区分: 普通鉄道JR（11）。事業者種別: JRの新幹線（1）。

東京
type: Concept
alternative label: 東京（東日本旅客鉄道 東北新幹線）
broader: g003766
in scheme: scheme
notation: 003769
scope note: 運営会社: 東日本旅客鉄道。路線名: 東北新幹線。鉄道区分: 普通鉄道JR（11）。事業者種別: JRの新幹線（1）。

東京
type: Concept
alternative label: 東京（東日本旅客鉄道 東海道線）
broader: g003766
in scheme: scheme
notation: 003770
scope note: 運営会社: 東日本旅客鉄道。路線名: 東海道線。鉄道区分: 普通鉄道JR（11）。事業者種別: JR在来線（2）。

北府中
type: Concept
alternative label: 北府中（東日本旅客鉄道 武蔵野線）
broader: g003771
in scheme: scheme
notation: 003771
scope note: 運営会社: 東日本旅客鉄道。路線名: 武蔵野線。鉄道区分: 普通鉄道JR（11）。事業者種別: JR在来線（2）。

二重橋前
type: Concept
alternative label: 二重橋前（東京地下鉄 9号線千代田線）
broader: g003772
in scheme: scheme
notation: 003772
scope note: 運営会社: 東京地下鉄。路線名: 9号線千代田線。鉄道区分: 普通鉄道（12）。事業者種別: 民営鉄道（4）。

茅場町
type: Concept
alternative label: 茅場町（東京地下鉄 5号線東西線）
broader: g003773
in scheme: scheme
notation: 003773
scope note: 運営会社: 東京地下鉄。路線名: 5号線東西線。鉄道区分: 普通鉄道（12）。事業者種別: 民営鉄道（4）。

信濃町
type: Concept
alternative label: 信濃町（東日本旅客鉄道 中央線）
broader: g003774
in scheme: scheme
notation: 003774
scope note: 運営会社: 東日本旅客鉄道。路線名: 中央線。鉄道区分: 普通鉄道JR（11）。事業者種別: JR在来線（2）。

国立競技場
type: Concept
alternative label: 国立競技場（東京都 12号線大江戸線）
broader: g003775
in scheme: scheme
notation: 003775
scope note: 運営会社: 東京都。路線名: 12号線大江戸線。鉄道区分: 普通鉄道（12）。事業者種別: 公営鉄道（3）。

茅場町
type: Concept
alternative label: 茅場町（東京地下鉄 2号線日比谷線）
broader: g003773
in scheme: scheme
notation: 003776
scope note: 運営会社: 東京地下鉄。路線名: 2号線日比谷線。鉄道区分: 普通鉄道（12）。事業者種別: 民営鉄道（4）。

西永福
type: Concept
alternative label: 西永福（京王電鉄 井の頭線）
broader: g003777
in scheme: scheme
notation: 003777
scope note: 運営会社: 京王電鉄。路線名: 井の頭線。鉄道区分: 普通鉄道（12）。事業者種別: 民営鉄道（4）。

参宮橋
type: Concept
alternative label: 参宮橋（小田急電鉄 小田原線）
broader: g003778
in scheme: scheme
notation: 003778
scope note: 運営会社: 小田急電鉄。路線名: 小田原線。鉄道区分: 普通鉄道（12）。事業者種別: 民営鉄道（4）。

日野
type: Concept
alternative label: 日野（東日本旅客鉄道 中央線）
broader: g003779
in scheme: scheme
notation: 003779
scope note: 運営会社: 東日本旅客鉄道。路線名: 中央線。鉄道区分: 普通鉄道JR（11）。事業者種別: JR在来線（2）。

北参道
type: Concept
alternative label: 北参道（東京地下鉄 13号線副都心線）
broader: g003780
in scheme: scheme
notation: 003780
scope note: 運営会社: 東京地下鉄。路線名: 13号線副都心線。鉄道区分: 普通鉄道（12）。事業者種別: 民営鉄道（4）。

永田町
type: Concept
alternative label: 永田町（東京地下鉄 11号線半蔵門線）
broader: g003782
in scheme: scheme
notation: 003781
scope note: 運営会社: 東京地下鉄。路線名: 11号線半蔵門線。鉄道区分: 普通鉄道（12）。事業者種別: 民営鉄道（4）。

永田町
type: Concept
alternative label: 永田町（東京地下鉄 7号線南北線）
broader: g003782
in scheme: scheme
notation: 003782
scope note: 運営会社: 東京地下鉄。路線名: 7号線南北線。鉄道区分: 普通鉄道（12）。事業者種別: 民営鉄道（4）。

甲州街道
type: Concept
alternative label: 甲州街道（多摩都市モノレール 多摩都市モノレール線）
broader: g003783
in scheme: scheme
notation: 003783
scope note: 運営会社: 多摩都市モノレール。路線名: 多摩都市モノレール線。鉄道区分: 跨座式モノレール（23）。事業者種別: 第三セクター（5）。

永田町
type: Concept
alternative label: 永田町（東京地下鉄 8号線有楽町線）
broader: g003782
in scheme: scheme
notation: 003784
scope note: 運営会社: 東京地下鉄。路線名: 8号線有楽町線。鉄道区分: 普通鉄道（12）。事業者種別: 民営鉄道（4）。

東京
type: Concept
alternative label: 東京（東日本旅客鉄道 京葉線）
broader: g003785
in scheme: scheme
notation: 003785
scope note: 運営会社: 東日本旅客鉄道。路線名: 京葉線。鉄道区分: 普通鉄道JR（11）。事業者種別: JR在来線（2）。

飯島
type: Concept
alternative label: 飯島（東海旅客鉄道 飯田線）
broader: g003786
in scheme: scheme
notation: 003786
scope note: 運営会社: 東海旅客鉄道。路線名: 飯田線。鉄道区分: 普通鉄道JR（11）。事業者種別: JR在来線（2）。

桜田門
type: Concept
alternative label: 桜田門（東京地下鉄 8号線有楽町線）
broader: g003787
in scheme: scheme
notation: 003787
scope note: 運営会社: 東京地下鉄。路線名: 8号線有楽町線。鉄道区分: 普通鉄道（12）。事業者種別: 民営鉄道（4）。

赤坂見附
type: Concept
alternative label: 赤坂見附（東京地下鉄 3号線銀座線）
broader: g003788
in scheme: scheme
notation: 003788
scope note: 運営会社: 東京地下鉄。路線名: 3号線銀座線。鉄道区分: 普通鉄道（12）。事業者種別: 民営鉄道（4）。

赤坂見附
type: Concept
alternative label: 赤坂見附（東京地下鉄 4号線丸ノ内線）
broader: g003788
in scheme: scheme
notation: 003789
scope note: 運営会社: 東京地下鉄。路線名: 4号線丸ノ内線。鉄道区分: 普通鉄道（12）。事業者種別: 民営鉄道（4）。

多磨
type: Concept
alternative label: 多磨（西武鉄道 多摩川線）
broader: g003790
in scheme: scheme
notation: 003790
scope note: 運営会社: 西武鉄道。路線名: 多摩川線。鉄道区分: 普通鉄道（12）。事業者種別: 民営鉄道（4）。

幡ヶ谷
type: Concept
alternative label: 幡ヶ谷（京王電鉄 京王線）
broader: g003791
in scheme: scheme
notation: 003791
scope note: 運営会社: 京王電鉄。路線名: 京王線。鉄道区分: 普通鉄道（12）。事業者種別: 民営鉄道（4）。

京橋
type: Concept
alternative label: 京橋（東京地下鉄 3号線銀座線）
broader: g003792
in scheme: scheme
notation: 003792
scope note: 運営会社: 東京地下鉄。路線名: 3号線銀座線。鉄道区分: 普通鉄道（12）。事業者種別: 民営鉄道（4）。

日比谷
type: Concept
alternative label: 日比谷（東京都 6号線三田線）
broader: g003802
in scheme: scheme
notation: 003793
scope note: 運営会社: 東京都。路線名: 6号線三田線。鉄道区分: 普通鉄道（12）。事業者種別: 公営鉄道（3）。

永福町
type: Concept
alternative label: 永福町（京王電鉄 井の頭線）
broader: g003794
in scheme: scheme
notation: 003794
scope note: 運営会社: 京王電鉄。路線名: 井の頭線。鉄道区分: 普通鉄道（12）。事業者種別: 民営鉄道（4）。

有楽町
type: Concept
alternative label: 有楽町（東京地下鉄 8号線有楽町線）
broader: g003795
in scheme: scheme
notation: 003795
scope note: 運営会社: 東京地下鉄。路線名: 8号線有楽町線。鉄道区分: 普通鉄道（12）。事業者種別: 民営鉄道（4）。

宝町
type: Concept
alternative label: 宝町（東京都 1号線浅草線）
broader: g003796
in scheme: scheme
notation: 003796
scope note: 運営会社: 東京都。路線名: 1号線浅草線。鉄道区分: 普通鉄道（12）。事業者種別: 公営鉄道（3）。

八丁堀
type: Concept
alternative label: 八丁堀（東京地下鉄 2号線日比谷線）
broader: g003797
in scheme: scheme
notation: 003797
scope note: 運営会社: 東京地下鉄。路線名: 2号線日比谷線。鉄道区分: 普通鉄道（12）。事業者種別: 民営鉄道（4）。

有楽町
type: Concept
alternative label: 有楽町（東日本旅客鉄道 東海道線）
broader: g003795
in scheme: scheme
notation: 003798
scope note: 運営会社: 東日本旅客鉄道。路線名: 東海道線。鉄道区分: 普通鉄道JR（11）。事業者種別: JR在来線（2）。

国会議事堂前
type: Concept
alternative label: 国会議事堂前（東京地下鉄 4号線丸ノ内線）
broader: g003799
in scheme: scheme
notation: 003799
scope note: 運営会社: 東京地下鉄。路線名: 4号線丸ノ内線。鉄道区分: 普通鉄道（12）。事業者種別: 民営鉄道（4）。

八丁堀
type: Concept
alternative label: 八丁堀（東日本旅客鉄道 京葉線）
broader: g003797
in scheme: scheme
notation: 003800
scope note: 運営会社: 東日本旅客鉄道。路線名: 京葉線。鉄道区分: 普通鉄道JR（11）。事業者種別: JR在来線（2）。

銀座一丁目
type: Concept
alternative label: 銀座一丁目（東京地下鉄 8号線有楽町線）
broader: g003801
in scheme: scheme
notation: 003801
scope note: 運営会社: 東京地下鉄。路線名: 8号線有楽町線。鉄道区分: 普通鉄道（12）。事業者種別: 民営鉄道（4）。

日比谷
type: Concept
alternative label: 日比谷（東京地下鉄 2号線日比谷線）
broader: g003802
in scheme: scheme
notation: 003802
scope note: 運営会社: 東京地下鉄。路線名: 2号線日比谷線。鉄道区分: 普通鉄道（12）。事業者種別: 民営鉄道（4）。

霞ヶ関
type: Concept
alternative label: 霞ヶ関（東京地下鉄 4号線丸ノ内線）
broader: g003805
in scheme: scheme
notation: 003803
scope note: 運営会社: 東京地下鉄。路線名: 4号線丸ノ内線。鉄道区分: 普通鉄道（12）。事業者種別: 民営鉄道（4）。

日比谷
type: Concept
alternative label: 日比谷（東京地下鉄 9号線千代田線）
broader: g003802
in scheme: scheme
notation: 003804
scope note: 運営会社: 東京地下鉄。路線名: 9号線千代田線。鉄道区分: 普通鉄道（12）。事業者種別: 民営鉄道（4）。

霞ヶ関
type: Concept
alternative label: 霞ヶ関（東京地下鉄 2号線日比谷線）
broader: g003805
in scheme: scheme
notation: 003805
scope note: 運営会社: 東京地下鉄。路線名: 2号線日比谷線。鉄道区分: 普通鉄道（12）。事業者種別: 民営鉄道（4）。

笹塚
type: Concept
alternative label: 笹塚（京王電鉄 京王線）
broader: g003806
in scheme: scheme
notation: 003806
scope note: 運営会社: 京王電鉄。路線名: 京王線。鉄道区分: 普通鉄道（12）。事業者種別: 民営鉄道（4）。

国会議事堂前
type: Concept
alternative label: 国会議事堂前（東京地下鉄 9号線千代田線）
broader: g003799
in scheme: scheme
notation: 003807
scope note: 運営会社: 東京地下鉄。路線名: 9号線千代田線。鉄道区分: 普通鉄道（12）。事業者種別: 民営鉄道（4）。

春日居町
type: Concept
alternative label: 春日居町（東日本旅客鉄道 中央線）
broader: g003808
in scheme: scheme
notation: 003808
scope note: 運営会社: 東日本旅客鉄道。路線名: 中央線。鉄道区分: 普通鉄道JR（11）。事業者種別: JR在来線（2）。

銀座
type: Concept
alternative label: 銀座（東京地下鉄 4号線丸ノ内線）
broader: g003823
in scheme: scheme
notation: 003809
scope note: 運営会社: 東京地下鉄。路線名: 4号線丸ノ内線。鉄道区分: 普通鉄道（12）。事業者種別: 民営鉄道（4）。

溜池山王
type: Concept
alternative label: 溜池山王（東京地下鉄 7号線南北線）
broader: g003810
in scheme: scheme
notation: 003810
scope note: 運営会社: 東京地下鉄。路線名: 7号線南北線。鉄道区分: 普通鉄道（12）。事業者種別: 民営鉄道（4）。

野尻
type: Concept
alternative label: 野尻（東海旅客鉄道 中央線）
broader: g003811
in scheme: scheme
notation: 003811
scope note: 運営会社: 東海旅客鉄道。路線名: 中央線。鉄道区分: 普通鉄道JR（11）。事業者種別: JR在来線（2）。

青山一丁目
type: Concept
alternative label: 青山一丁目（東京地下鉄 11号線半蔵門線）
broader: g003812
in scheme: scheme
notation: 003812
scope note: 運営会社: 東京地下鉄。路線名: 11号線半蔵門線。鉄道区分: 普通鉄道（12）。事業者種別: 民営鉄道（4）。

青山一丁目
type: Concept
alternative label: 青山一丁目（東京都 12号線大江戸線）
broader: g003812
in scheme: scheme
notation: 003813
scope note: 運営会社: 東京都。路線名: 12号線大江戸線。鉄道区分: 普通鉄道（12）。事業者種別: 公営鉄道（3）。

京成幕張本郷
type: Concept
alternative label: 京成幕張本郷（京成電鉄 千葉線）
broader: g003814
in scheme: scheme
notation: 003814
scope note: 運営会社: 京成電鉄。路線名: 千葉線。鉄道区分: 普通鉄道（12）。事業者種別: 民営鉄道（4）。

幕張本郷
type: Concept
alternative label: 幕張本郷（東日本旅客鉄道 総武線）
broader: g003815
in scheme: scheme
notation: 003815
scope note: 運営会社: 東日本旅客鉄道。路線名: 総武線。鉄道区分: 普通鉄道JR（11）。事業者種別: JR在来線（2）。

勝沼ぶどう郷
type: Concept
alternative label: 勝沼ぶどう郷（東日本旅客鉄道 中央線）
broader: g003816
in scheme: scheme
notation: 003816
scope note: 運営会社: 東日本旅客鉄道。路線名: 中央線。鉄道区分: 普通鉄道JR（11）。事業者種別: JR在来線（2）。

青山一丁目
type: Concept
alternative label: 青山一丁目（東京地下鉄 3号線銀座線）
broader: g003812
in scheme: scheme
notation: 003817
scope note: 運営会社: 東京地下鉄。路線名: 3号線銀座線。鉄道区分: 普通鉄道（12）。事業者種別: 民営鉄道（4）。

門前仲町
type: Concept
alternative label: 門前仲町（東京都 12号線大江戸線）
broader: g003818
in scheme: scheme
notation: 003818
scope note: 運営会社: 東京都。路線名: 12号線大江戸線。鉄道区分: 普通鉄道（12）。事業者種別: 公営鉄道（3）。

南行徳
type: Concept
alternative label: 南行徳（東京地下鉄 5号線東西線）
broader: g003819
in scheme: scheme
notation: 003819
scope note: 運営会社: 東京地下鉄。路線名: 5号線東西線。鉄道区分: 普通鉄道（12）。事業者種別: 民営鉄道（4）。

霞ヶ関
type: Concept
alternative label: 霞ヶ関（東京地下鉄 9号線千代田線）
broader: g003805
in scheme: scheme
notation: 003820
scope note: 運営会社: 東京地下鉄。路線名: 9号線千代田線。鉄道区分: 普通鉄道（12）。事業者種別: 民営鉄道（4）。

府中
type: Concept
alternative label: 府中（京王電鉄 京王線）
broader: g003821
in scheme: scheme
notation: 003821
scope note: 運営会社: 京王電鉄。路線名: 京王線。鉄道区分: 普通鉄道（12）。事業者種別: 民営鉄道（4）。

赤坂
type: Concept
alternative label: 赤坂（東京地下鉄 9号線千代田線）
broader: g003822
in scheme: scheme
notation: 003822
scope note: 運営会社: 東京地下鉄。路線名: 9号線千代田線。鉄道区分: 普通鉄道（12）。事業者種別: 民営鉄道（4）。

銀座
type: Concept
alternative label: 銀座（東京地下鉄 2号線日比谷線）
broader: g003823
in scheme: scheme
notation: 003823
scope note: 運営会社: 東京地下鉄。路線名: 2号線日比谷線。鉄道区分: 普通鉄道（12）。事業者種別: 民営鉄道（4）。

門前仲町
type: Concept
alternative label: 門前仲町（東京地下鉄 5号線東西線）
broader: g003818
in scheme: scheme
notation: 003824
scope note: 運営会社: 東京地下鉄。路線名: 5号線東西線。鉄道区分: 普通鉄道（12）。事業者種別: 民営鉄道（4）。

赤池
type: Concept
alternative label: 赤池（長良川鉄道 越美南線）
broader: g003825
in scheme: scheme
notation: 003825
scope note: 運営会社: 長良川鉄道。路線名: 越美南線。鉄道区分: 普通鉄道（12）。事業者種別: 第三セクター（5）。

溜池山王
type: Concept
alternative label: 溜池山王（東京地下鉄 3号線銀座線）
broader: g003810
in scheme: scheme
notation: 003826
scope note: 運営会社: 東京地下鉄。路線名: 3号線銀座線。鉄道区分: 普通鉄道（12）。事業者種別: 民営鉄道（4）。

銀座
type: Concept
alternative label: 銀座（東京地下鉄 3号線銀座線）
broader: g003823
in scheme: scheme
notation: 003827
scope note: 運営会社: 東京地下鉄。路線名: 3号線銀座線。鉄道区分: 普通鉄道（12）。事業者種別: 民営鉄道（4）。

原宿
type: Concept
alternative label: 原宿（東日本旅客鉄道 山手線）
broader: g003828
in scheme: scheme
notation: 003828
scope note: 運営会社: 東日本旅客鉄道。路線名: 山手線。鉄道区分: 普通鉄道JR（11）。事業者種別: JR在来線（2）。

万願寺
type: Concept
alternative label: 万願寺（多摩都市モノレール 多摩都市モノレール線）
broader: g003829
in scheme: scheme
notation: 003829
scope note: 運営会社: 多摩都市モノレール。路線名: 多摩都市モノレール線。鉄道区分: 跨座式モノレール（23）。事業者種別: 第三セクター（5）。

代田橋
type: Concept
alternative label: 代田橋（京王電鉄 京王線）
broader: g003830
in scheme: scheme
notation: 003830
scope note: 運営会社: 京王電鉄。路線名: 京王線。鉄道区分: 普通鉄道（12）。事業者種別: 民営鉄道（4）。

西府
type: Concept
alternative label: 西府（東日本旅客鉄道 南武線）
broader: g003831
in scheme: scheme
notation: 003831
scope note: 運営会社: 東日本旅客鉄道。路線名: 南武線。鉄道区分: 普通鉄道JR（11）。事業者種別: JR在来線（2）。

芦花公園
type: Concept
alternative label: 芦花公園（京王電鉄 京王線）
broader: g003832
in scheme: scheme
notation: 003832
scope note: 運営会社: 京王電鉄。路線名: 京王線。鉄道区分: 普通鉄道（12）。事業者種別: 民営鉄道（4）。

新富町
type: Concept
alternative label: 新富町（東京地下鉄 8号線有楽町線）
broader: g003833
in scheme: scheme
notation: 003833
scope note: 運営会社: 東京地下鉄。路線名: 8号線有楽町線。鉄道区分: 普通鉄道（12）。事業者種別: 民営鉄道（4）。

外苑前
type: Concept
alternative label: 外苑前（東京地下鉄 3号線銀座線）
broader: g003834
in scheme: scheme
notation: 003834
scope note: 運営会社: 東京地下鉄。路線名: 3号線銀座線。鉄道区分: 普通鉄道（12）。事業者種別: 民営鉄道（4）。

虎ノ門
type: Concept
alternative label: 虎ノ門（東京地下鉄 3号線銀座線）
broader: g003835
in scheme: scheme
notation: 003835
scope note: 運営会社: 東京地下鉄。路線名: 3号線銀座線。鉄道区分: 普通鉄道（12）。事業者種別: 民営鉄道（4）。

八幡山
type: Concept
alternative label: 八幡山（京王電鉄 京王線）
broader: g003836
in scheme: scheme
notation: 003836
scope note: 運営会社: 京王電鉄。路線名: 京王線。鉄道区分: 普通鉄道（12）。事業者種別: 民営鉄道（4）。

代々木八幡
type: Concept
alternative label: 代々木八幡（小田急電鉄 小田原線）
broader: g003837
in scheme: scheme
notation: 003837
scope note: 運営会社: 小田急電鉄。路線名: 小田原線。鉄道区分: 普通鉄道（12）。事業者種別: 民営鉄道（4）。

東銀座
type: Concept
alternative label: 東銀座（東京都 1号線浅草線）
broader: g003838
in scheme: scheme
notation: 003838
scope note: 運営会社: 東京都。路線名: 1号線浅草線。鉄道区分: 普通鉄道（12）。事業者種別: 公営鉄道（3）。

東陽町
type: Concept
alternative label: 東陽町（東京地下鉄 5号線東西線）
broader: g003839
in scheme: scheme
notation: 003839
scope note: 運営会社: 東京地下鉄。路線名: 5号線東西線。鉄道区分: 普通鉄道（12）。事業者種別: 民営鉄道（4）。

木場
type: Concept
alternative label: 木場（東京地下鉄 5号線東西線）
broader: g003840
in scheme: scheme
notation: 003840
scope note: 運営会社: 東京地下鉄。路線名: 5号線東西線。鉄道区分: 普通鉄道（12）。事業者種別: 民営鉄道（4）。

北八王子
type: Concept
alternative label: 北八王子（東日本旅客鉄道 八高線）
broader: g003841
in scheme: scheme
notation: 003841
scope note: 運営会社: 東日本旅客鉄道。路線名: 八高線。鉄道区分: 普通鉄道JR（11）。事業者種別: JR在来線（2）。

内幸町
type: Concept
alternative label: 内幸町（東京都 6号線三田線）
broader: g003842
in scheme: scheme
notation: 003842
scope note: 運営会社: 東京都。路線名: 6号線三田線。鉄道区分: 普通鉄道（12）。事業者種別: 公営鉄道（3）。

東銀座
type: Concept
alternative label: 東銀座（東京地下鉄 2号線日比谷線）
broader: g003838
in scheme: scheme
notation: 003843
scope note: 運営会社: 東京地下鉄。路線名: 2号線日比谷線。鉄道区分: 普通鉄道（12）。事業者種別: 民営鉄道（4）。

明治神宮前
type: Concept
alternative label: 明治神宮前（東京地下鉄 9号線千代田線）
broader: g003844
in scheme: scheme
notation: 003844
scope note: 運営会社: 東京地下鉄。路線名: 9号線千代田線。鉄道区分: 普通鉄道（12）。事業者種別: 民営鉄道（4）。

代々木公園
type: Concept
alternative label: 代々木公園（東京地下鉄 9号線千代田線）
broader: g003845
in scheme: scheme
notation: 003845
scope note: 運営会社: 東京地下鉄。路線名: 9号線千代田線。鉄道区分: 普通鉄道（12）。事業者種別: 民営鉄道（4）。

明大前
type: Concept
alternative label: 明大前（京王電鉄 井の頭線）
broader: g003846
in scheme: scheme
notation: 003846
scope note: 運営会社: 京王電鉄。路線名: 井の頭線。鉄道区分: 普通鉄道（12）。事業者種別: 民営鉄道（4）。

代々木上原
type: Concept
alternative label: 代々木上原（東京地下鉄 9号線千代田線）
broader: g003847
in scheme: scheme
notation: 003847
scope note: 運営会社: 東京地下鉄。路線名: 9号線千代田線。鉄道区分: 普通鉄道（12）。事業者種別: 民営鉄道（4）。

代々木上原
type: Concept
alternative label: 代々木上原（小田急電鉄 小田原線）
broader: g003847
in scheme: scheme
notation: 003848
scope note: 運営会社: 小田急電鉄。路線名: 小田原線。鉄道区分: 普通鉄道（12）。事業者種別: 民営鉄道（4）。

上北沢
type: Concept
alternative label: 上北沢（京王電鉄 京王線）
broader: g003849
in scheme: scheme
notation: 003849
scope note: 運営会社: 京王電鉄。路線名: 京王線。鉄道区分: 普通鉄道（12）。事業者種別: 民営鉄道（4）。

東府中
type: Concept
alternative label: 東府中（京王電鉄 京王線）
broader: g003850
in scheme: scheme
notation: 003850
scope note: 運営会社: 京王電鉄。路線名: 京王線。鉄道区分: 普通鉄道（12）。事業者種別: 民営鉄道（4）。

東府中
type: Concept
alternative label: 東府中（京王電鉄 競馬場線）
broader: g003850
in scheme: scheme
notation: 003851
scope note: 運営会社: 京王電鉄。路線名: 競馬場線。鉄道区分: 普通鉄道（12）。事業者種別: 民営鉄道（4）。

竜王
type: Concept
alternative label: 竜王（東日本旅客鉄道 中央線）
broader: g003852
in scheme: scheme
notation: 003852
scope note: 運営会社: 東日本旅客鉄道。路線名: 中央線。鉄道区分: 普通鉄道JR（11）。事業者種別: JR在来線（2）。

分倍河原
type: Concept
alternative label: 分倍河原（東日本旅客鉄道 南武線）
broader: g003853
in scheme: scheme
notation: 003853
scope note: 運営会社: 東日本旅客鉄道。路線名: 南武線。鉄道区分: 普通鉄道JR（11）。事業者種別: JR在来線（2）。

南砂町
type: Concept
alternative label: 南砂町（東京地下鉄 5号線東西線）
broader: g003854
in scheme: scheme
notation: 003854
scope note: 運営会社: 東京地下鉄。路線名: 5号線東西線。鉄道区分: 普通鉄道（12）。事業者種別: 民営鉄道（4）。

明大前
type: Concept
alternative label: 明大前（京王電鉄 京王線）
broader: g003846
in scheme: scheme
notation: 003855
scope note: 運営会社: 京王電鉄。路線名: 京王線。鉄道区分: 普通鉄道（12）。事業者種別: 民営鉄道（4）。

府中競馬正門前
type: Concept
alternative label: 府中競馬正門前（京王電鉄 競馬場線）
broader: g003856
in scheme: scheme
notation: 003856
scope note: 運営会社: 京王電鉄。路線名: 競馬場線。鉄道区分: 普通鉄道（12）。事業者種別: 民営鉄道（4）。

明治神宮前
type: Concept
alternative label: 明治神宮前（東京地下鉄 13号線副都心線）
broader: g003844
in scheme: scheme
notation: 003857
scope note: 運営会社: 東京地下鉄。路線名: 13号線副都心線。鉄道区分: 普通鉄道（12）。事業者種別: 民営鉄道（4）。

分倍河原
type: Concept
alternative label: 分倍河原（京王電鉄 京王線）
broader: g003853
in scheme: scheme
notation: 003858
scope note: 運営会社: 京王電鉄。路線名: 京王線。鉄道区分: 普通鉄道（12）。事業者種別: 民営鉄道（4）。

越中島
type: Concept
alternative label: 越中島（東日本旅客鉄道 京葉線）
broader: g003859
in scheme: scheme
notation: 003859
scope note: 運営会社: 東日本旅客鉄道。路線名: 京葉線。鉄道区分: 普通鉄道JR（11）。事業者種別: JR在来線（2）。

築地
type: Concept
alternative label: 築地（東京地下鉄 2号線日比谷線）
broader: g003860
in scheme: scheme
notation: 003860
scope note: 運営会社: 東京地下鉄。路線名: 2号線日比谷線。鉄道区分: 普通鉄道（12）。事業者種別: 民営鉄道（4）。

千歳烏山
type: Concept
alternative label: 千歳烏山（京王電鉄 京王線）
broader: g003861
in scheme: scheme
notation: 003861
scope note: 運営会社: 京王電鉄。路線名: 京王線。鉄道区分: 普通鉄道（12）。事業者種別: 民営鉄道（4）。

桜上水
type: Concept
alternative label: 桜上水（京王電鉄 京王線）
broader: g003862
in scheme: scheme
notation: 003862
scope note: 運営会社: 京王電鉄。路線名: 京王線。鉄道区分: 普通鉄道（12）。事業者種別: 民営鉄道（4）。

新習志野
type: Concept
alternative label: 新習志野（東日本旅客鉄道 京葉線）
broader: g003863
in scheme: scheme
notation: 003863
scope note: 運営会社: 東日本旅客鉄道。路線名: 京葉線。鉄道区分: 普通鉄道JR（11）。事業者種別: JR在来線（2）。

新橋
type: Concept
alternative label: 新橋（東京地下鉄 3号線銀座線）
broader: g003872
in scheme: scheme
notation: 003864
scope note: 運営会社: 東京地下鉄。路線名: 3号線銀座線。鉄道区分: 普通鉄道（12）。事業者種別: 民営鉄道（4）。

網野
type: Concept
alternative label: 網野（WILLER TRAINS 宮津線）
broader: g003865
in scheme: scheme
notation: 003865
scope note: 運営会社: WILLER TRAINS。路線名: 宮津線。鉄道区分: 普通鉄道（12）。事業者種別: 第三セクター（5）。

虎ノ門ヒルズ
type: Concept
alternative label: 虎ノ門ヒルズ（東京地下鉄 2号線日比谷線）
broader: g003866
in scheme: scheme
notation: 003866
scope note: 運営会社: 東京地下鉄。路線名: 2号線日比谷線。鉄道区分: 普通鉄道（12）。事業者種別: 民営鉄道（4）。

甲府
type: Concept
alternative label: 甲府（東日本旅客鉄道 中央線）
broader: g003867
in scheme: scheme
notation: 003867
scope note: 運営会社: 東日本旅客鉄道。路線名: 中央線。鉄道区分: 普通鉄道JR（11）。事業者種別: JR在来線（2）。

乃木坂
type: Concept
alternative label: 乃木坂（東京地下鉄 9号線千代田線）
broader: g003868
in scheme: scheme
notation: 003868
scope note: 運営会社: 東京地下鉄。路線名: 9号線千代田線。鉄道区分: 普通鉄道（12）。事業者種別: 民営鉄道（4）。

甲府
type: Concept
alternative label: 甲府（東海旅客鉄道 身延線）
broader: g003867
in scheme: scheme
notation: 003869
scope note: 運営会社: 東海旅客鉄道。路線名: 身延線。鉄道区分: 普通鉄道JR（11）。事業者種別: JR在来線（2）。

市川塩浜
type: Concept
alternative label: 市川塩浜（東日本旅客鉄道 京葉線）
broader: g003870
in scheme: scheme
notation: 003870
scope note: 運営会社: 東日本旅客鉄道。路線名: 京葉線。鉄道区分: 普通鉄道JR（11）。事業者種別: JR在来線（2）。

多磨霊園
type: Concept
alternative label: 多磨霊園（京王電鉄 京王線）
broader: g003871
in scheme: scheme
notation: 003871
scope note: 運営会社: 京王電鉄。路線名: 京王線。鉄道区分: 普通鉄道（12）。事業者種別: 民営鉄道（4）。

新橋
type: Concept
alternative label: 新橋（東日本旅客鉄道 東海道線）
broader: g003872
in scheme: scheme
notation: 003872
scope note: 運営会社: 東日本旅客鉄道。路線名: 東海道線。鉄道区分: 普通鉄道JR（11）。事業者種別: JR在来線（2）。

白糸台
type: Concept
alternative label: 白糸台（西武鉄道 多摩川線）
broader: g003873
in scheme: scheme
notation: 003873
scope note: 運営会社: 西武鉄道。路線名: 多摩川線。鉄道区分: 普通鉄道（12）。事業者種別: 民営鉄道（4）。

下高井戸
type: Concept
alternative label: 下高井戸（京王電鉄 京王線）
broader: g003874
in scheme: scheme
notation: 003874
scope note: 運営会社: 京王電鉄。路線名: 京王線。鉄道区分: 普通鉄道（12）。事業者種別: 民営鉄道（4）。

浦安
type: Concept
alternative label: 浦安（東京地下鉄 5号線東西線）
broader: g003875
in scheme: scheme
notation: 003875
scope note: 運営会社: 東京地下鉄。路線名: 5号線東西線。鉄道区分: 普通鉄道（12）。事業者種別: 民営鉄道（4）。

府中本町
type: Concept
alternative label: 府中本町（東日本旅客鉄道 南武線）
broader: g003876
in scheme: scheme
notation: 003876
scope note: 運営会社: 東日本旅客鉄道。路線名: 南武線。鉄道区分: 普通鉄道JR（11）。事業者種別: JR在来線（2）。

下高井戸
type: Concept
alternative label: 下高井戸（東急電鉄 世田谷線）
broader: g003874
in scheme: scheme
notation: 003877
scope note: 運営会社: 東急電鉄。路線名: 世田谷線。鉄道区分: 軌道（21）。事業者種別: 民営鉄道（4）。

府中本町
type: Concept
alternative label: 府中本町（東日本旅客鉄道 武蔵野線）
broader: g003876
in scheme: scheme
notation: 003878
scope note: 運営会社: 東日本旅客鉄道。路線名: 武蔵野線。鉄道区分: 普通鉄道JR（11）。事業者種別: JR在来線（2）。

表参道
type: Concept
alternative label: 表参道（東京地下鉄 9号線千代田線）
broader: g003883
in scheme: scheme
notation: 003879
scope note: 運営会社: 東京地下鉄。路線名: 9号線千代田線。鉄道区分: 普通鉄道（12）。事業者種別: 民営鉄道（4）。

東北沢
type: Concept
alternative label: 東北沢（小田急電鉄 小田原線）
broader: g003880
in scheme: scheme
notation: 003880
scope note: 運営会社: 小田急電鉄。路線名: 小田原線。鉄道区分: 普通鉄道（12）。事業者種別: 民営鉄道（4）。

伊那本郷
type: Concept
alternative label: 伊那本郷（東海旅客鉄道 飯田線）
broader: g003881
in scheme: scheme
notation: 003881
scope note: 運営会社: 東海旅客鉄道。路線名: 飯田線。鉄道区分: 普通鉄道JR（11）。事業者種別: JR在来線（2）。

新橋
type: Concept
alternative label: 新橋（ゆりかもめ 東京臨海新交通臨海線）
broader: g003872
in scheme: scheme
notation: 003882
scope note: 運営会社: ゆりかもめ。路線名: 東京臨海新交通臨海線。鉄道区分: 案内軌条式（24）。事業者種別: 第三セクター（5）。

表参道
type: Concept
alternative label: 表参道（東京地下鉄 11号線半蔵門線）
broader: g003883
in scheme: scheme
notation: 003883
scope note: 運営会社: 東京地下鉄。路線名: 11号線半蔵門線。鉄道区分: 普通鉄道（12）。事業者種別: 民営鉄道（4）。

六本木一丁目
type: Concept
alternative label: 六本木一丁目（東京地下鉄 7号線南北線）
broader: g003884
in scheme: scheme
notation: 003884
scope note: 運営会社: 東京地下鉄。路線名: 7号線南北線。鉄道区分: 普通鉄道（12）。事業者種別: 民営鉄道（4）。

表参道
type: Concept
alternative label: 表参道（東京地下鉄 3号線銀座線）
broader: g003883
in scheme: scheme
notation: 003885
scope note: 運営会社: 東京地下鉄。路線名: 3号線銀座線。鉄道区分: 普通鉄道（12）。事業者種別: 民営鉄道（4）。

築地市場
type: Concept
alternative label: 築地市場（東京都 12号線大江戸線）
broader: g003886
in scheme: scheme
notation: 003886
scope note: 運営会社: 東京都。路線名: 12号線大江戸線。鉄道区分: 普通鉄道（12）。事業者種別: 公営鉄道（3）。

汐留
type: Concept
alternative label: 汐留（東京都 12号線大江戸線）
broader: g003887
in scheme: scheme
notation: 003887
scope note: 運営会社: 東京都。路線名: 12号線大江戸線。鉄道区分: 普通鉄道（12）。事業者種別: 公営鉄道（3）。

新橋
type: Concept
alternative label: 新橋（東京都 1号線浅草線）
broader: g003872
in scheme: scheme
notation: 003888
scope note: 運営会社: 東京都。路線名: 1号線浅草線。鉄道区分: 普通鉄道（12）。事業者種別: 公営鉄道（3）。

月島
type: Concept
alternative label: 月島（東京地下鉄 8号線有楽町線）
broader: g003889
in scheme: scheme
notation: 003889
scope note: 運営会社: 東京地下鉄。路線名: 8号線有楽町線。鉄道区分: 普通鉄道（12）。事業者種別: 民営鉄道（4）。

西葛西
type: Concept
alternative label: 西葛西（東京地下鉄 5号線東西線）
broader: g003890
in scheme: scheme
notation: 003890
scope note: 運営会社: 東京地下鉄。路線名: 5号線東西線。鉄道区分: 普通鉄道（12）。事業者種別: 民営鉄道（4）。

武蔵野台
type: Concept
alternative label: 武蔵野台（京王電鉄 京王線）
broader: g003891
in scheme: scheme
notation: 003891
scope note: 運営会社: 京王電鉄。路線名: 京王線。鉄道区分: 普通鉄道（12）。事業者種別: 民営鉄道（4）。

六本木
type: Concept
alternative label: 六本木（東京都 12号線大江戸線）
broader: g003892
in scheme: scheme
notation: 003892
scope note: 運営会社: 東京都。路線名: 12号線大江戸線。鉄道区分: 普通鉄道（12）。事業者種別: 公営鉄道（3）。

月島
type: Concept
alternative label: 月島（東京都 12号線大江戸線）
broader: g003889
in scheme: scheme
notation: 003893
scope note: 運営会社: 東京都。路線名: 12号線大江戸線。鉄道区分: 普通鉄道（12）。事業者種別: 公営鉄道（3）。

葛西
type: Concept
alternative label: 葛西（東京地下鉄 5号線東西線）
broader: g003894
in scheme: scheme
notation: 003894
scope note: 運営会社: 東京地下鉄。路線名: 5号線東西線。鉄道区分: 普通鉄道（12）。事業者種別: 民営鉄道（4）。

八街
type: Concept
alternative label: 八街（東日本旅客鉄道 総武線）
broader: g003895
in scheme: scheme
notation: 003895
scope note: 運営会社: 東日本旅客鉄道。路線名: 総武線。鉄道区分: 普通鉄道JR（11）。事業者種別: JR在来線（2）。

汐留
type: Concept
alternative label: 汐留（ゆりかもめ 東京臨海新交通臨海線）
broader: g003887
in scheme: scheme
notation: 003896
scope note: 運営会社: ゆりかもめ。路線名: 東京臨海新交通臨海線。鉄道区分: 案内軌条式（24）。事業者種別: 第三セクター（5）。

六本木
type: Concept
alternative label: 六本木（東京地下鉄 2号線日比谷線）
broader: g003892
in scheme: scheme
notation: 003897
scope note: 運営会社: 東京地下鉄。路線名: 2号線日比谷線。鉄道区分: 普通鉄道（12）。事業者種別: 民営鉄道（4）。

四街道
type: Concept
alternative label: 四街道（東日本旅客鉄道 総武線）
broader: g003898
in scheme: scheme
notation: 003898
scope note: 運営会社: 東日本旅客鉄道。路線名: 総武線。鉄道区分: 普通鉄道JR（11）。事業者種別: JR在来線（2）。

東松原
type: Concept
alternative label: 東松原（京王電鉄 井の頭線）
broader: g003899
in scheme: scheme
notation: 003899
scope note: 運営会社: 京王電鉄。路線名: 井の頭線。鉄道区分: 普通鉄道（12）。事業者種別: 民営鉄道（4）。

神谷町
type: Concept
alternative label: 神谷町（東京地下鉄 2号線日比谷線）
broader: g003900
in scheme: scheme
notation: 003900
scope note: 運営会社: 東京地下鉄。路線名: 2号線日比谷線。鉄道区分: 普通鉄道（12）。事業者種別: 民営鉄道（4）。

新代田
type: Concept
alternative label: 新代田（京王電鉄 井の頭線）
broader: g003901
in scheme: scheme
notation: 003901
scope note: 運営会社: 京王電鉄。路線名: 井の頭線。鉄道区分: 普通鉄道（12）。事業者種別: 民営鉄道（4）。

飛騨金山
type: Concept
alternative label: 飛騨金山（東海旅客鉄道 高山線）
broader: g003902
in scheme: scheme
notation: 003902
scope note: 運営会社: 東海旅客鉄道。路線名: 高山線。鉄道区分: 普通鉄道JR（11）。事業者種別: JR在来線（2）。

仙川
type: Concept
alternative label: 仙川（京王電鉄 京王線）
broader: g003903
in scheme: scheme
notation: 003903
scope note: 運営会社: 京王電鉄。路線名: 京王線。鉄道区分: 普通鉄道（12）。事業者種別: 民営鉄道（4）。

高幡不動
type: Concept
alternative label: 高幡不動（京王電鉄 京王線）
broader: g003904
in scheme: scheme
notation: 003904
scope note: 運営会社: 京王電鉄。路線名: 京王線。鉄道区分: 普通鉄道（12）。事業者種別: 民営鉄道（4）。

高幡不動
type: Concept
alternative label: 高幡不動（京王電鉄 動物園線）
broader: g003904
in scheme: scheme
notation: 003905
scope note: 運営会社: 京王電鉄。路線名: 動物園線。鉄道区分: 普通鉄道（12）。事業者種別: 民営鉄道（4）。

金手
type: Concept
alternative label: 金手（東海旅客鉄道 身延線）
broader: g003906
in scheme: scheme
notation: 003906
scope note: 運営会社: 東海旅客鉄道。路線名: 身延線。鉄道区分: 普通鉄道JR（11）。事業者種別: JR在来線（2）。

横芝
type: Concept
alternative label: 横芝（東日本旅客鉄道 総武線）
broader: g003907
in scheme: scheme
notation: 003907
scope note: 運営会社: 東日本旅客鉄道。路線名: 総武線。鉄道区分: 普通鉄道JR（11）。事業者種別: JR在来線（2）。

下北沢
type: Concept
alternative label: 下北沢（京王電鉄 井の頭線）
broader: g003908
in scheme: scheme
notation: 003908
scope note: 運営会社: 京王電鉄。路線名: 井の頭線。鉄道区分: 普通鉄道（12）。事業者種別: 民営鉄道（4）。

下北沢
type: Concept
alternative label: 下北沢（小田急電鉄 小田原線）
broader: g003908
in scheme: scheme
notation: 003909
scope note: 運営会社: 小田急電鉄。路線名: 小田原線。鉄道区分: 普通鉄道（12）。事業者種別: 民営鉄道（4）。

高幡不動
type: Concept
alternative label: 高幡不動（多摩都市モノレール 多摩都市モノレール線）
broader: g003904
in scheme: scheme
notation: 003910
scope note: 運営会社: 多摩都市モノレール。路線名: 多摩都市モノレール線。鉄道区分: 跨座式モノレール（23）。事業者種別: 第三セクター（5）。

御成門
type: Concept
alternative label: 御成門（東京都 6号線三田線）
broader: g003911
in scheme: scheme
notation: 003911
scope note: 運営会社: 東京都。路線名: 6号線三田線。鉄道区分: 普通鉄道（12）。事業者種別: 公営鉄道（3）。

美並苅安
type: Concept
alternative label: 美並苅安（長良川鉄道 越美南線）
broader: g003912
in scheme: scheme
notation: 003912
scope note: 運営会社: 長良川鉄道。路線名: 越美南線。鉄道区分: 普通鉄道（12）。事業者種別: 第三セクター（5）。

京成幕張
type: Concept
alternative label: 京成幕張（京成電鉄 千葉線）
broader: g003913
in scheme: scheme
notation: 003913
scope note: 運営会社: 京成電鉄。路線名: 千葉線。鉄道区分: 普通鉄道（12）。事業者種別: 民営鉄道（4）。

池ノ上
type: Concept
alternative label: 池ノ上（京王電鉄 井の頭線）
broader: g003914
in scheme: scheme
notation: 003914
scope note: 運営会社: 京王電鉄。路線名: 井の頭線。鉄道区分: 普通鉄道（12）。事業者種別: 民営鉄道（4）。

松原
type: Concept
alternative label: 松原（東急電鉄 世田谷線）
broader: g003915
in scheme: scheme
notation: 003915
scope note: 運営会社: 東急電鉄。路線名: 世田谷線。鉄道区分: 軌道（21）。事業者種別: 民営鉄道（4）。

飛田給
type: Concept
alternative label: 飛田給（京王電鉄 京王線）
broader: g003916
in scheme: scheme
notation: 003916
scope note: 運営会社: 京王電鉄。路線名: 京王線。鉄道区分: 普通鉄道（12）。事業者種別: 民営鉄道（4）。

善光寺
type: Concept
alternative label: 善光寺（東海旅客鉄道 身延線）
broader: g003917
in scheme: scheme
notation: 003917
scope note: 運営会社: 東海旅客鉄道。路線名: 身延線。鉄道区分: 普通鉄道JR（11）。事業者種別: JR在来線（2）。

酒折
type: Concept
alternative label: 酒折（東日本旅客鉄道 中央線）
broader: g003918
in scheme: scheme
notation: 003918
scope note: 運営会社: 東日本旅客鉄道。路線名: 中央線。鉄道区分: 普通鉄道JR（11）。事業者種別: JR在来線（2）。

幕張
type: Concept
alternative label: 幕張（東日本旅客鉄道 総武線）
broader: g003919
in scheme: scheme
notation: 003919
scope note: 運営会社: 東日本旅客鉄道。路線名: 総武線。鉄道区分: 普通鉄道JR（11）。事業者種別: JR在来線（2）。

中河原
type: Concept
alternative label: 中河原（京王電鉄 京王線）
broader: g003920
in scheme: scheme
notation: 003920
scope note: 運営会社: 京王電鉄。路線名: 京王線。鉄道区分: 普通鉄道（12）。事業者種別: 民営鉄道（4）。

豊田
type: Concept
alternative label: 豊田（東日本旅客鉄道 中央線）
broader: g003921
in scheme: scheme
notation: 003921
scope note: 運営会社: 東日本旅客鉄道。路線名: 中央線。鉄道区分: 普通鉄道JR（11）。事業者種別: JR在来線（2）。

渋谷
type: Concept
alternative label: 渋谷（東京地下鉄 11号線半蔵門線）
broader: g003922
in scheme: scheme
notation: 003922
scope note: 運営会社: 東京地下鉄。路線名: 11号線半蔵門線。鉄道区分: 普通鉄道（12）。事業者種別: 民営鉄道（4）。

渋谷
type: Concept
alternative label: 渋谷（東急電鉄 田園都市線）
broader: g003922
in scheme: scheme
notation: 003923
scope note: 運営会社: 東急電鉄。路線名: 田園都市線。鉄道区分: 普通鉄道（12）。事業者種別: 民営鉄道（4）。

渋谷
type: Concept
alternative label: 渋谷（東京地下鉄 3号線銀座線）
broader: g003922
in scheme: scheme
notation: 003924
scope note: 運営会社: 東京地下鉄。路線名: 3号線銀座線。鉄道区分: 普通鉄道（12）。事業者種別: 民営鉄道（4）。

渋谷
type: Concept
alternative label: 渋谷（東京地下鉄 13号線副都心線）
broader: g003922
in scheme: scheme
notation: 003925
scope note: 運営会社: 東京地下鉄。路線名: 13号線副都心線。鉄道区分: 普通鉄道（12）。事業者種別: 民営鉄道（4）。

渋谷
type: Concept
alternative label: 渋谷（東急電鉄 東横線）
broader: g003922
in scheme: scheme
notation: 003926
scope note: 運営会社: 東急電鉄。路線名: 東横線。鉄道区分: 普通鉄道（12）。事業者種別: 民営鉄道（4）。

勝どき
type: Concept
alternative label: 勝どき（東京都 12号線大江戸線）
broader: g003927
in scheme: scheme
notation: 003927
scope note: 運営会社: 東京都。路線名: 12号線大江戸線。鉄道区分: 普通鉄道（12）。事業者種別: 公営鉄道（3）。

潮見
type: Concept
alternative label: 潮見（東日本旅客鉄道 京葉線）
broader: g003928
in scheme: scheme
notation: 003928
scope note: 運営会社: 東日本旅客鉄道。路線名: 京葉線。鉄道区分: 普通鉄道JR（11）。事業者種別: JR在来線（2）。

駒場東大前
type: Concept
alternative label: 駒場東大前（京王電鉄 井の頭線）
broader: g003929
in scheme: scheme
notation: 003929
scope note: 運営会社: 京王電鉄。路線名: 井の頭線。鉄道区分: 普通鉄道（12）。事業者種別: 民営鉄道（4）。

渋谷
type: Concept
alternative label: 渋谷（京王電鉄 井の頭線）
broader: g003922
in scheme: scheme
notation: 003930
scope note: 運営会社: 京王電鉄。路線名: 井の頭線。鉄道区分: 普通鉄道（12）。事業者種別: 民営鉄道（4）。

世田谷代田
type: Concept
alternative label: 世田谷代田（小田急電鉄 小田原線）
broader: g003931
in scheme: scheme
notation: 003931
scope note: 運営会社: 小田急電鉄。路線名: 小田原線。鉄道区分: 普通鉄道（12）。事業者種別: 民営鉄道（4）。

渋谷
type: Concept
alternative label: 渋谷（東日本旅客鉄道 山手線）
broader: g003922
in scheme: scheme
notation: 003932
scope note: 運営会社: 東日本旅客鉄道。路線名: 山手線。鉄道区分: 普通鉄道JR（11）。事業者種別: JR在来線（2）。

つつじヶ丘
type: Concept
alternative label: つつじヶ丘（京王電鉄 京王線）
broader: g003933
in scheme: scheme
notation: 003933
scope note: 運営会社: 京王電鉄。路線名: 京王線。鉄道区分: 普通鉄道（12）。事業者種別: 民営鉄道（4）。

京王八王子
type: Concept
alternative label: 京王八王子（京王電鉄 京王線）
broader: g003934
in scheme: scheme
notation: 003934
scope note: 運営会社: 京王電鉄。路線名: 京王線。鉄道区分: 普通鉄道（12）。事業者種別: 民営鉄道（4）。

石和温泉
type: Concept
alternative label: 石和温泉（東日本旅客鉄道 中央線）
broader: g003935
in scheme: scheme
notation: 003935
scope note: 運営会社: 東日本旅客鉄道。路線名: 中央線。鉄道区分: 普通鉄道JR（11）。事業者種別: JR在来線（2）。

百草園
type: Concept
alternative label: 百草園（京王電鉄 京王線）
broader: g003936
in scheme: scheme
notation: 003936
scope note: 運営会社: 京王電鉄。路線名: 京王線。鉄道区分: 普通鉄道（12）。事業者種別: 民営鉄道（4）。

西調布
type: Concept
alternative label: 西調布（京王電鉄 京王線）
broader: g003937
in scheme: scheme
notation: 003937
scope note: 運営会社: 京王電鉄。路線名: 京王線。鉄道区分: 普通鉄道（12）。事業者種別: 民営鉄道（4）。

神泉
type: Concept
alternative label: 神泉（京王電鉄 井の頭線）
broader: g003938
in scheme: scheme
notation: 003938
scope note: 運営会社: 京王電鉄。路線名: 井の頭線。鉄道区分: 普通鉄道（12）。事業者種別: 民営鉄道（4）。

大門
type: Concept
alternative label: 大門（東京都 12号線大江戸線）
broader: g003939
in scheme: scheme
notation: 003939
scope note: 運営会社: 東京都。路線名: 12号線大江戸線。鉄道区分: 普通鉄道（12）。事業者種別: 公営鉄道（3）。

大門
type: Concept
alternative label: 大門（東京都 1号線浅草線）
broader: g003939
in scheme: scheme
notation: 003940
scope note: 運営会社: 東京都。路線名: 1号線浅草線。鉄道区分: 普通鉄道（12）。事業者種別: 公営鉄道（3）。

麻布十番
type: Concept
alternative label: 麻布十番（東京都 12号線大江戸線）
broader: g003941
in scheme: scheme
notation: 003941
scope note: 運営会社: 東京都。路線名: 12号線大江戸線。鉄道区分: 普通鉄道（12）。事業者種別: 公営鉄道（3）。

西八王子
type: Concept
alternative label: 西八王子（東日本旅客鉄道 中央線）
broader: g003942
in scheme: scheme
notation: 003942
scope note: 運営会社: 東日本旅客鉄道。路線名: 中央線。鉄道区分: 普通鉄道JR（11）。事業者種別: JR在来線（2）。

競艇場前
type: Concept
alternative label: 競艇場前（西武鉄道 多摩川線）
broader: g003943
in scheme: scheme
notation: 003943
scope note: 運営会社: 西武鉄道。路線名: 多摩川線。鉄道区分: 普通鉄道（12）。事業者種別: 民営鉄道（4）。

是政
type: Concept
alternative label: 是政（西武鉄道 多摩川線）
broader: g003944
in scheme: scheme
notation: 003944
scope note: 運営会社: 西武鉄道。路線名: 多摩川線。鉄道区分: 普通鉄道（12）。事業者種別: 民営鉄道（4）。

梅ヶ丘
type: Concept
alternative label: 梅ヶ丘（小田急電鉄 小田原線）
broader: g003945
in scheme: scheme
notation: 003945
scope note: 運営会社: 小田急電鉄。路線名: 小田原線。鉄道区分: 普通鉄道（12）。事業者種別: 民営鉄道（4）。

モノレール浜松町
type: Concept
alternative label: モノレール浜松町（東京モノレール 東京モノレール羽田空港線）
broader: g003946
in scheme: scheme
notation: 003946
scope note: 運営会社: 東京モノレール。路線名: 東京モノレール羽田空港線。鉄道区分: 跨座式鉄道（15）。事業者種別: 民営鉄道（4）。

八王子
type: Concept
alternative label: 八王子（東日本旅客鉄道 中央線）
broader: g003947
in scheme: scheme
notation: 003947
scope note: 運営会社: 東日本旅客鉄道。路線名: 中央線。鉄道区分: 普通鉄道JR（11）。事業者種別: JR在来線（2）。

八王子
type: Concept
alternative label: 八王子（東日本旅客鉄道 八高線）
broader: g003947
in scheme: scheme
notation: 003948
scope note: 運営会社: 東日本旅客鉄道。路線名: 八高線。鉄道区分: 普通鉄道JR（11）。事業者種別: JR在来線（2）。

浜松町
type: Concept
alternative label: 浜松町（東日本旅客鉄道 東海道線）
broader: g003949
in scheme: scheme
notation: 003949
scope note: 運営会社: 東日本旅客鉄道。路線名: 東海道線。鉄道区分: 普通鉄道JR（11）。事業者種別: JR在来線（2）。

程久保
type: Concept
alternative label: 程久保（多摩都市モノレール 多摩都市モノレール線）
broader: g003950
in scheme: scheme
notation: 003950
scope note: 運営会社: 多摩都市モノレール。路線名: 多摩都市モノレール線。鉄道区分: 跨座式モノレール（23）。事業者種別: 第三セクター（5）。

豊洲
type: Concept
alternative label: 豊洲（東京地下鉄 8号線有楽町線）
broader: g003951
in scheme: scheme
notation: 003951
scope note: 運営会社: 東京地下鉄。路線名: 8号線有楽町線。鉄道区分: 普通鉄道（12）。事業者種別: 民営鉄道（4）。

南平
type: Concept
alternative label: 南平（京王電鉄 京王線）
broader: g003952
in scheme: scheme
notation: 003952
scope note: 運営会社: 京王電鉄。路線名: 京王線。鉄道区分: 普通鉄道（12）。事業者種別: 民営鉄道（4）。

八王子
type: Concept
alternative label: 八王子（東日本旅客鉄道 横浜線）
broader: g003947
in scheme: scheme
notation: 003953
scope note: 運営会社: 東日本旅客鉄道。路線名: 横浜線。鉄道区分: 普通鉄道JR（11）。事業者種別: JR在来線（2）。

赤羽橋
type: Concept
alternative label: 赤羽橋（東京都 12号線大江戸線）
broader: g003954
in scheme: scheme
notation: 003954
scope note: 運営会社: 東京都。路線名: 12号線大江戸線。鉄道区分: 普通鉄道（12）。事業者種別: 公営鉄道（3）。

麻布十番
type: Concept
alternative label: 麻布十番（東京地下鉄 7号線南北線）
broader: g003941
in scheme: scheme
notation: 003955
scope note: 運営会社: 東京地下鉄。路線名: 7号線南北線。鉄道区分: 普通鉄道（12）。事業者種別: 民営鉄道（4）。

七久保
type: Concept
alternative label: 七久保（東海旅客鉄道 飯田線）
broader: g003956
in scheme: scheme
notation: 003956
scope note: 運営会社: 東海旅客鉄道。路線名: 飯田線。鉄道区分: 普通鉄道JR（11）。事業者種別: JR在来線（2）。

山下
type: Concept
alternative label: 山下（東急電鉄 世田谷線）
broader: g003957
in scheme: scheme
notation: 003957
scope note: 運営会社: 東急電鉄。路線名: 世田谷線。鉄道区分: 軌道（21）。事業者種別: 民営鉄道（4）。

竹芝
type: Concept
alternative label: 竹芝（ゆりかもめ 東京臨海新交通臨海線）
broader: g003958
in scheme: scheme
notation: 003958
scope note: 運営会社: ゆりかもめ。路線名: 東京臨海新交通臨海線。鉄道区分: 案内軌条式（24）。事業者種別: 第三セクター（5）。

柴崎
type: Concept
alternative label: 柴崎（京王電鉄 京王線）
broader: g003959
in scheme: scheme
notation: 003959
scope note: 運営会社: 京王電鉄。路線名: 京王線。鉄道区分: 普通鉄道（12）。事業者種別: 民営鉄道（4）。

豪徳寺
type: Concept
alternative label: 豪徳寺（小田急電鉄 小田原線）
broader: g003960
in scheme: scheme
notation: 003960
scope note: 運営会社: 小田急電鉄。路線名: 小田原線。鉄道区分: 普通鉄道（12）。事業者種別: 民営鉄道（4）。

豊洲
type: Concept
alternative label: 豊洲（ゆりかもめ 東京臨海新交通臨海線）
broader: g003951
in scheme: scheme
notation: 003961
scope note: 運営会社: ゆりかもめ。路線名: 東京臨海新交通臨海線。鉄道区分: 案内軌条式（24）。事業者種別: 第三セクター（5）。

芝公園
type: Concept
alternative label: 芝公園（東京都 6号線三田線）
broader: g003962
in scheme: scheme
notation: 003962
scope note: 運営会社: 東京都。路線名: 6号線三田線。鉄道区分: 普通鉄道（12）。事業者種別: 公営鉄道（3）。

佐津
type: Concept
alternative label: 佐津（西日本旅客鉄道 山陰線）
broader: g003963
in scheme: scheme
notation: 003963
scope note: 運営会社: 西日本旅客鉄道。路線名: 山陰線。鉄道区分: 普通鉄道JR（11）。事業者種別: JR在来線（2）。

検見川
type: Concept
alternative label: 検見川（京成電鉄 千葉線）
broader: g003964
in scheme: scheme
notation: 003964
scope note: 運営会社: 京成電鉄。路線名: 千葉線。鉄道区分: 普通鉄道（12）。事業者種別: 民営鉄道（4）。

新検見川
type: Concept
alternative label: 新検見川（東日本旅客鉄道 総武線）
broader: g003965
in scheme: scheme
notation: 003965
scope note: 運営会社: 東日本旅客鉄道。路線名: 総武線。鉄道区分: 普通鉄道JR（11）。事業者種別: JR在来線（2）。

調布
type: Concept
alternative label: 調布（京王電鉄 京王線）
broader: g003966
in scheme: scheme
notation: 003966
scope note: 運営会社: 京王電鉄。路線名: 京王線。鉄道区分: 普通鉄道（12）。事業者種別: 民営鉄道（4）。

調布
type: Concept
alternative label: 調布（京王電鉄 相模原線）
broader: g003966
in scheme: scheme
notation: 003967
scope note: 運営会社: 京王電鉄。路線名: 相模原線。鉄道区分: 普通鉄道（12）。事業者種別: 民営鉄道（4）。

鎧
type: Concept
alternative label: 鎧（西日本旅客鉄道 山陰線）
broader: g003968
in scheme: scheme
notation: 003968
scope note: 運営会社: 西日本旅客鉄道。路線名: 山陰線。鉄道区分: 普通鉄道JR（11）。事業者種別: JR在来線（2）。

広尾
type: Concept
alternative label: 広尾（東京地下鉄 2号線日比谷線）
broader: g003969
in scheme: scheme
notation: 003969
scope note: 運営会社: 東京地下鉄。路線名: 2号線日比谷線。鉄道区分: 普通鉄道（12）。事業者種別: 民営鉄道（4）。

経堂
type: Concept
alternative label: 経堂（小田急電鉄 小田原線）
broader: g003970
in scheme: scheme
notation: 003970
scope note: 運営会社: 小田急電鉄。路線名: 小田原線。鉄道区分: 普通鉄道（12）。事業者種別: 民営鉄道（4）。

聖蹟桜ヶ丘
type: Concept
alternative label: 聖蹟桜ヶ丘（京王電鉄 京王線）
broader: g003971
in scheme: scheme
notation: 003971
scope note: 運営会社: 京王電鉄。路線名: 京王線。鉄道区分: 普通鉄道（12）。事業者種別: 民営鉄道（4）。

池尻大橋
type: Concept
alternative label: 池尻大橋（東急電鉄 田園都市線）
broader: g003972
in scheme: scheme
notation: 003972
scope note: 運営会社: 東急電鉄。路線名: 田園都市線。鉄道区分: 普通鉄道（12）。事業者種別: 民営鉄道（4）。

国領
type: Concept
alternative label: 国領（京王電鉄 京王線）
broader: g003973
in scheme: scheme
notation: 003973
scope note: 運営会社: 京王電鉄。路線名: 京王線。鉄道区分: 普通鉄道（12）。事業者種別: 民営鉄道（4）。

夕日ヶ浦木津温泉
type: Concept
alternative label: 夕日ヶ浦木津温泉（WILLER TRAINS 宮津線）
broader: g003974
in scheme: scheme
notation: 003974
scope note: 運営会社: WILLER TRAINS。路線名: 宮津線。鉄道区分: 普通鉄道（12）。事業者種別: 第三セクター（5）。

布田
type: Concept
alternative label: 布田（京王電鉄 京王線）
broader: g003975
in scheme: scheme
notation: 003975
scope note: 運営会社: 京王電鉄。路線名: 京王線。鉄道区分: 普通鉄道（12）。事業者種別: 民営鉄道（4）。

竹野
type: Concept
alternative label: 竹野（西日本旅客鉄道 山陰線）
broader: g003976
in scheme: scheme
notation: 003976
scope note: 運営会社: 西日本旅客鉄道。路線名: 山陰線。鉄道区分: 普通鉄道JR（11）。事業者種別: JR在来線（2）。

多摩動物公園
type: Concept
alternative label: 多摩動物公園（京王電鉄 動物園線）
broader: g003977
in scheme: scheme
notation: 003977
scope note: 運営会社: 京王電鉄。路線名: 動物園線。鉄道区分: 普通鉄道（12）。事業者種別: 民営鉄道（4）。

新浦安
type: Concept
alternative label: 新浦安（東日本旅客鉄道 京葉線）
broader: g003978
in scheme: scheme
notation: 003978
scope note: 運営会社: 東日本旅客鉄道。路線名: 京葉線。鉄道区分: 普通鉄道JR（11）。事業者種別: JR在来線（2）。

日の出
type: Concept
alternative label: 日の出（ゆりかもめ 東京臨海新交通臨海線）
broader: g003979
in scheme: scheme
notation: 003979
scope note: 運営会社: ゆりかもめ。路線名: 東京臨海新交通臨海線。鉄道区分: 案内軌条式（24）。事業者種別: 第三セクター（5）。

南多摩
type: Concept
alternative label: 南多摩（東日本旅客鉄道 南武線）
broader: g003980
in scheme: scheme
notation: 003980
scope note: 運営会社: 東日本旅客鉄道。路線名: 南武線。鉄道区分: 普通鉄道JR（11）。事業者種別: JR在来線（2）。

新豊洲
type: Concept
alternative label: 新豊洲（ゆりかもめ 東京臨海新交通臨海線）
broader: g003981
in scheme: scheme
notation: 003981
scope note: 運営会社: ゆりかもめ。路線名: 東京臨海新交通臨海線。鉄道区分: 案内軌条式（24）。事業者種別: 第三セクター（5）。

餘部
type: Concept
alternative label: 餘部（西日本旅客鉄道 山陰線）
broader: g003982
in scheme: scheme
notation: 003982
scope note: 運営会社: 西日本旅客鉄道。路線名: 山陰線。鉄道区分: 普通鉄道JR（11）。事業者種別: JR在来線（2）。

多摩動物公園
type: Concept
alternative label: 多摩動物公園（多摩都市モノレール 多摩都市モノレール線）
broader: g003977
in scheme: scheme
notation: 003983
scope note: 運営会社: 多摩都市モノレール。路線名: 多摩都市モノレール線。鉄道区分: 跨座式モノレール（23）。事業者種別: 第三セクター（5）。

海浜幕張
type: Concept
alternative label: 海浜幕張（東日本旅客鉄道 京葉線）
broader: g003984
in scheme: scheme
notation: 003984
scope note: 運営会社: 東日本旅客鉄道。路線名: 京葉線。鉄道区分: 普通鉄道JR（11）。事業者種別: JR在来線（2）。

代官山
type: Concept
alternative label: 代官山（東急電鉄 東横線）
broader: g003985
in scheme: scheme
notation: 003985
scope note: 運営会社: 東急電鉄。路線名: 東横線。鉄道区分: 普通鉄道（12）。事業者種別: 民営鉄道（4）。

三田
type: Concept
alternative label: 三田（東京都 6号線三田線）
broader: g003986
in scheme: scheme
notation: 003986
scope note: 運営会社: 東京都。路線名: 6号線三田線。鉄道区分: 普通鉄道（12）。事業者種別: 公営鉄道（3）。

三田
type: Concept
alternative label: 三田（東京都 1号線浅草線）
broader: g003986
in scheme: scheme
notation: 003987
scope note: 運営会社: 東京都。路線名: 1号線浅草線。鉄道区分: 普通鉄道（12）。事業者種別: 公営鉄道（3）。

千歳船橋
type: Concept
alternative label: 千歳船橋（小田急電鉄 小田原線）
broader: g003988
in scheme: scheme
notation: 003988
scope note: 運営会社: 小田急電鉄。路線名: 小田原線。鉄道区分: 普通鉄道（12）。事業者種別: 民営鉄道（4）。

宮の坂
type: Concept
alternative label: 宮の坂（東急電鉄 世田谷線）
broader: g003989
in scheme: scheme
notation: 003989
scope note: 運営会社: 東急電鉄。路線名: 世田谷線。鉄道区分: 軌道（21）。事業者種別: 民営鉄道（4）。

平山城址公園
type: Concept
alternative label: 平山城址公園（京王電鉄 京王線）
broader: g003990
in scheme: scheme
notation: 003990
scope note: 運営会社: 京王電鉄。路線名: 京王線。鉄道区分: 普通鉄道（12）。事業者種別: 民営鉄道（4）。

恵比寿
type: Concept
alternative label: 恵比寿（東京地下鉄 2号線日比谷線）
broader: g003991
in scheme: scheme
notation: 003991
scope note: 運営会社: 東京地下鉄。路線名: 2号線日比谷線。鉄道区分: 普通鉄道（12）。事業者種別: 民営鉄道（4）。

恵比寿
type: Concept
alternative label: 恵比寿（東日本旅客鉄道 山手線）
broader: g003991
in scheme: scheme
notation: 003992
scope note: 運営会社: 東日本旅客鉄道。路線名: 山手線。鉄道区分: 普通鉄道JR（11）。事業者種別: JR在来線（2）。

柴山
type: Concept
alternative label: 柴山（西日本旅客鉄道 山陰線）
broader: g003993
in scheme: scheme
notation: 003993
scope note: 運営会社: 西日本旅客鉄道。路線名: 山陰線。鉄道区分: 普通鉄道JR（11）。事業者種別: JR在来線（2）。

福野
type: Concept
alternative label: 福野（長良川鉄道 越美南線）
broader: g003994
in scheme: scheme
notation: 003994
scope note: 運営会社: 長良川鉄道。路線名: 越美南線。鉄道区分: 普通鉄道（12）。事業者種別: 第三セクター（5）。

新木場
type: Concept
alternative label: 新木場（東日本旅客鉄道 京葉線）
broader: g003997
in scheme: scheme
notation: 003995
scope note: 運営会社: 東日本旅客鉄道。路線名: 京葉線。鉄道区分: 普通鉄道JR（11）。事業者種別: JR在来線（2）。

若林
type: Concept
alternative label: 若林（東急電鉄 世田谷線）
broader: g003996
in scheme: scheme
notation: 003996
scope note: 運営会社: 東急電鉄。路線名: 世田谷線。鉄道区分: 軌道（21）。事業者種別: 民営鉄道（4）。

新木場
type: Concept
alternative label: 新木場（東京臨海高速鉄道 臨海副都心線）
broader: g003997
in scheme: scheme
notation: 003997
scope note: 運営会社: 東京臨海高速鉄道。路線名: 臨海副都心線。鉄道区分: 普通鉄道（12）。事業者種別: 第三セクター（5）。

新木場
type: Concept
alternative label: 新木場（東京地下鉄 8号線有楽町線）
broader: g003997
in scheme: scheme
notation: 003998
scope note: 運営会社: 東京地下鉄。路線名: 8号線有楽町線。鉄道区分: 普通鉄道（12）。事業者種別: 民営鉄道（4）。

辰巳
type: Concept
alternative label: 辰巳（東京地下鉄 8号線有楽町線）
broader: g003999
in scheme: scheme
notation: 003999
scope note: 運営会社: 東京地下鉄。路線名: 8号線有楽町線。鉄道区分: 普通鉄道（12）。事業者種別: 民営鉄道（4）。

田町
type: Concept
alternative label: 田町（東日本旅客鉄道 東海道線）
broader: g004000
in scheme: scheme
notation: 004000
scope note: 運営会社: 東日本旅客鉄道。路線名: 東海道線。鉄道区分: 普通鉄道JR（11）。事業者種別: JR在来線（2）。

市場前
type: Concept
alternative label: 市場前（ゆりかもめ 東京臨海新交通臨海線）
broader: g004001
in scheme: scheme
notation: 004001
scope note: 運営会社: ゆりかもめ。路線名: 東京臨海新交通臨海線。鉄道区分: 案内軌条式（24）。事業者種別: 第三セクター（5）。

十二兼
type: Concept
alternative label: 十二兼（東海旅客鉄道 中央線）
broader: g004002
in scheme: scheme
notation: 004002
scope note: 運営会社: 東海旅客鉄道。路線名: 中央線。鉄道区分: 普通鉄道JR（11）。事業者種別: JR在来線（2）。

敦賀
type: Concept
alternative label: 敦賀（西日本旅客鉄道 小浜線）
broader: g010186
in scheme: scheme
notation: 004003
scope note: 運営会社: 西日本旅客鉄道。路線名: 小浜線。鉄道区分: 普通鉄道JR（11）。事業者種別: JR在来線（2）。

敦賀
type: Concept
alternative label: 敦賀（西日本旅客鉄道 北陸線）
broader: g010186
in scheme: scheme
notation: 004004
scope note: 運営会社: 西日本旅客鉄道。路線名: 北陸線。鉄道区分: 普通鉄道JR（11）。事業者種別: JR在来線（2）。

高遠原
type: Concept
alternative label: 高遠原（東海旅客鉄道 飯田線）
broader: g004005
in scheme: scheme
notation: 004005
scope note: 運営会社: 東海旅客鉄道。路線名: 飯田線。鉄道区分: 普通鉄道JR（11）。事業者種別: JR在来線（2）。

西太子堂
type: Concept
alternative label: 西太子堂（東急電鉄 世田谷線）
broader: g004006
in scheme: scheme
notation: 004006
scope note: 運営会社: 東急電鉄。路線名: 世田谷線。鉄道区分: 軌道（21）。事業者種別: 民営鉄道（4）。

北野
type: Concept
alternative label: 北野（京王電鉄 京王線）
broader: g004007
in scheme: scheme
notation: 004007
scope note: 運営会社: 京王電鉄。路線名: 京王線。鉄道区分: 普通鉄道（12）。事業者種別: 民営鉄道（4）。

北野
type: Concept
alternative label: 北野（京王電鉄 高尾線）
broader: g004007
in scheme: scheme
notation: 004008
scope note: 運営会社: 京王電鉄。路線名: 高尾線。鉄道区分: 普通鉄道（12）。事業者種別: 民営鉄道（4）。

京王片倉
type: Concept
alternative label: 京王片倉（京王電鉄 高尾線）
broader: g004009
in scheme: scheme
notation: 004009
scope note: 運営会社: 京王電鉄。路線名: 高尾線。鉄道区分: 普通鉄道（12）。事業者種別: 民営鉄道（4）。

山田
type: Concept
alternative label: 山田（京王電鉄 高尾線）
broader: g004010
in scheme: scheme
notation: 004010
scope note: 運営会社: 京王電鉄。路線名: 高尾線。鉄道区分: 普通鉄道（12）。事業者種別: 民営鉄道（4）。

稲城長沼
type: Concept
alternative label: 稲城長沼（東日本旅客鉄道 南武線）
broader: g004011
in scheme: scheme
notation: 004011
scope note: 運営会社: 東日本旅客鉄道。路線名: 南武線。鉄道区分: 普通鉄道JR（11）。事業者種別: JR在来線（2）。

葛西臨海公園
type: Concept
alternative label: 葛西臨海公園（東日本旅客鉄道 京葉線）
broader: g004012
in scheme: scheme
notation: 004012
scope note: 運営会社: 東日本旅客鉄道。路線名: 京葉線。鉄道区分: 普通鉄道JR（11）。事業者種別: JR在来線（2）。

京王多摩川
type: Concept
alternative label: 京王多摩川（京王電鉄 相模原線）
broader: g004013
in scheme: scheme
notation: 004013
scope note: 運営会社: 京王電鉄。路線名: 相模原線。鉄道区分: 普通鉄道（12）。事業者種別: 民営鉄道（4）。

中目黒
type: Concept
alternative label: 中目黒（東京地下鉄 2号線日比谷線）
broader: g004014
in scheme: scheme
notation: 004014
scope note: 運営会社: 東京地下鉄。路線名: 2号線日比谷線。鉄道区分: 普通鉄道（12）。事業者種別: 民営鉄道（4）。

中目黒
type: Concept
alternative label: 中目黒（東急電鉄 東横線）
broader: g004014
in scheme: scheme
notation: 004015
scope note: 運営会社: 東急電鉄。路線名: 東横線。鉄道区分: 普通鉄道（12）。事業者種別: 民営鉄道（4）。

三軒茶屋
type: Concept
alternative label: 三軒茶屋（東急電鉄 世田谷線）
broader: g004016
in scheme: scheme
notation: 004016
scope note: 運営会社: 東急電鉄。路線名: 世田谷線。鉄道区分: 軌道（21）。事業者種別: 民営鉄道（4）。

松陰神社前
type: Concept
alternative label: 松陰神社前（東急電鉄 世田谷線）
broader: g004017
in scheme: scheme
notation: 004017
scope note: 運営会社: 東急電鉄。路線名: 世田谷線。鉄道区分: 軌道（21）。事業者種別: 民営鉄道（4）。

南甲府
type: Concept
alternative label: 南甲府（東海旅客鉄道 身延線）
broader: g004018
in scheme: scheme
notation: 004018
scope note: 運営会社: 東海旅客鉄道。路線名: 身延線。鉄道区分: 普通鉄道JR（11）。事業者種別: JR在来線（2）。

めじろ台
type: Concept
alternative label: めじろ台（京王電鉄 高尾線）
broader: g004019
in scheme: scheme
notation: 004019
scope note: 運営会社: 京王電鉄。路線名: 高尾線。鉄道区分: 普通鉄道（12）。事業者種別: 民営鉄道（4）。

上町
type: Concept
alternative label: 上町（東急電鉄 世田谷線）
broader: g004020
in scheme: scheme
notation: 004020
scope note: 運営会社: 東急電鉄。路線名: 世田谷線。鉄道区分: 軌道（21）。事業者種別: 民営鉄道（4）。

世田谷
type: Concept
alternative label: 世田谷（東急電鉄 世田谷線）
broader: g004021
in scheme: scheme
notation: 004021
scope note: 運営会社: 東急電鉄。路線名: 世田谷線。鉄道区分: 軌道（21）。事業者種別: 民営鉄道（4）。

三軒茶屋
type: Concept
alternative label: 三軒茶屋（東急電鉄 田園都市線）
broader: g004016
in scheme: scheme
notation: 004022
scope note: 運営会社: 東急電鉄。路線名: 田園都市線。鉄道区分: 普通鉄道（12）。事業者種別: 民営鉄道（4）。

スポーツセンター
type: Concept
alternative label: スポーツセンター（千葉都市モノレール 2号線）
broader: g004023
in scheme: scheme
notation: 004023
scope note: 運営会社: 千葉都市モノレール。路線名: 2号線。鉄道区分: 懸垂式モノレール（22）。事業者種別: 第三セクター（5）。

祖師ヶ谷大蔵
type: Concept
alternative label: 祖師ヶ谷大蔵（小田急電鉄 小田原線）
broader: g004024
in scheme: scheme
notation: 004024
scope note: 運営会社: 小田急電鉄。路線名: 小田原線。鉄道区分: 普通鉄道（12）。事業者種別: 民営鉄道（4）。

白金高輪
type: Concept
alternative label: 白金高輪（東京都 6号線三田線）
broader: g004025
in scheme: scheme
notation: 004025
scope note: 運営会社: 東京都。路線名: 6号線三田線。鉄道区分: 普通鉄道（12）。事業者種別: 公営鉄道（3）。

白金高輪
type: Concept
alternative label: 白金高輪（東京地下鉄 7号線南北線）
broader: g004025
in scheme: scheme
notation: 004026
scope note: 運営会社: 東京地下鉄。路線名: 7号線南北線。鉄道区分: 普通鉄道（12）。事業者種別: 民営鉄道（4）。

長沼
type: Concept
alternative label: 長沼（京王電鉄 京王線）
broader: g004027
in scheme: scheme
notation: 004027
scope note: 運営会社: 京王電鉄。路線名: 京王線。鉄道区分: 普通鉄道（12）。事業者種別: 民営鉄道（4）。

動物公園
type: Concept
alternative label: 動物公園（千葉都市モノレール 2号線）
broader: g004028
in scheme: scheme
notation: 004028
scope note: 運営会社: 千葉都市モノレール。路線名: 2号線。鉄道区分: 懸垂式モノレール（22）。事業者種別: 第三セクター（5）。

高尾
type: Concept
alternative label: 高尾（東日本旅客鉄道 中央線）
broader: g004029
in scheme: scheme
notation: 004029
scope note: 運営会社: 東日本旅客鉄道。路線名: 中央線。鉄道区分: 普通鉄道JR（11）。事業者種別: JR在来線（2）。

芝浦ふ頭
type: Concept
alternative label: 芝浦ふ頭（ゆりかもめ 東京臨海新交通臨海線）
broader: g004030
in scheme: scheme
notation: 004030
scope note: 運営会社: ゆりかもめ。路線名: 東京臨海新交通臨海線。鉄道区分: 案内軌条式（24）。事業者種別: 第三セクター（5）。

中央大学・明星大学
type: Concept
alternative label: 中央大学・明星大学（多摩都市モノレール 多摩都市モノレール線）
broader: g004031
in scheme: scheme
notation: 004031
scope note: 運営会社: 多摩都市モノレール。路線名: 多摩都市モノレール線。鉄道区分: 跨座式モノレール（23）。事業者種別: 第三セクター（5）。

矢野口
type: Concept
alternative label: 矢野口（東日本旅客鉄道 南武線）
broader: g004032
in scheme: scheme
notation: 004032
scope note: 運営会社: 東日本旅客鉄道。路線名: 南武線。鉄道区分: 普通鉄道JR（11）。事業者種別: JR在来線（2）。

高尾
type: Concept
alternative label: 高尾（京王電鉄 高尾線）
broader: g004029
in scheme: scheme
notation: 004033
scope note: 運営会社: 京王電鉄。路線名: 高尾線。鉄道区分: 普通鉄道（12）。事業者種別: 民営鉄道（4）。

東雲
type: Concept
alternative label: 東雲（東京臨海高速鉄道 臨海副都心線）
broader: g004034
in scheme: scheme
notation: 004034
scope note: 運営会社: 東京臨海高速鉄道。路線名: 臨海副都心線。鉄道区分: 普通鉄道（12）。事業者種別: 第三セクター（5）。

狭間
type: Concept
alternative label: 狭間（京王電鉄 高尾線）
broader: g004035
in scheme: scheme
notation: 004035
scope note: 運営会社: 京王電鉄。路線名: 高尾線。鉄道区分: 普通鉄道（12）。事業者種別: 民営鉄道（4）。

成城学園前
type: Concept
alternative label: 成城学園前（小田急電鉄 小田原線）
broader: g004036
in scheme: scheme
notation: 004036
scope note: 運営会社: 小田急電鉄。路線名: 小田原線。鉄道区分: 普通鉄道（12）。事業者種別: 民営鉄道（4）。

有明テニスの森
type: Concept
alternative label: 有明テニスの森（ゆりかもめ 東京臨海新交通臨海線）
broader: g004037
in scheme: scheme
notation: 004037
scope note: 運営会社: ゆりかもめ。路線名: 東京臨海新交通臨海線。鉄道区分: 案内軌条式（24）。事業者種別: 第三セクター（5）。

片倉
type: Concept
alternative label: 片倉（東日本旅客鉄道 横浜線）
broader: g004038
in scheme: scheme
notation: 004038
scope note: 運営会社: 東日本旅客鉄道。路線名: 横浜線。鉄道区分: 普通鉄道JR（11）。事業者種別: JR在来線（2）。

穴川
type: Concept
alternative label: 穴川（千葉都市モノレール 2号線）
broader: g004039
in scheme: scheme
notation: 004039
scope note: 運営会社: 千葉都市モノレール。路線名: 2号線。鉄道区分: 懸垂式モノレール（22）。事業者種別: 第三セクター（5）。

甲斐大和
type: Concept
alternative label: 甲斐大和（東日本旅客鉄道 中央線）
broader: g004040
in scheme: scheme
notation: 004040
scope note: 運営会社: 東日本旅客鉄道。路線名: 中央線。鉄道区分: 普通鉄道JR（11）。事業者種別: JR在来線（2）。

みつわ台
type: Concept
alternative label: みつわ台（千葉都市モノレール 2号線）
broader: g004041
in scheme: scheme
notation: 004041
scope note: 運営会社: 千葉都市モノレール。路線名: 2号線。鉄道区分: 懸垂式モノレール（22）。事業者種別: 第三セクター（5）。

泉岳寺
type: Concept
alternative label: 泉岳寺（東京都 1号線浅草線）
broader: g004042
in scheme: scheme
notation: 004042
scope note: 運営会社: 東京都。路線名: 1号線浅草線。鉄道区分: 普通鉄道（12）。事業者種別: 公営鉄道（3）。

泉岳寺
type: Concept
alternative label: 泉岳寺（京浜急行電鉄 本線）
broader: g004042
in scheme: scheme
notation: 004043
scope note: 運営会社: 京浜急行電鉄。路線名: 本線。鉄道区分: 普通鉄道（12）。事業者種別: 民営鉄道（4）。

白金台
type: Concept
alternative label: 白金台（東京都 6号線三田線）
broader: g004044
in scheme: scheme
notation: 004044
scope note: 運営会社: 東京都。路線名: 6号線三田線。鉄道区分: 普通鉄道（12）。事業者種別: 公営鉄道（3）。

白金台
type: Concept
alternative label: 白金台（東京地下鉄 7号線南北線）
broader: g004044
in scheme: scheme
notation: 004045
scope note: 運営会社: 東京地下鉄。路線名: 7号線南北線。鉄道区分: 普通鉄道（12）。事業者種別: 民営鉄道（4）。

大矢
type: Concept
alternative label: 大矢（長良川鉄道 越美南線）
broader: g004046
in scheme: scheme
notation: 004046
scope note: 運営会社: 長良川鉄道。路線名: 越美南線。鉄道区分: 普通鉄道（12）。事業者種別: 第三セクター（5）。

稲毛
type: Concept
alternative label: 稲毛（東日本旅客鉄道 総武線）
broader: g004047
in scheme: scheme
notation: 004047
scope note: 運営会社: 東日本旅客鉄道。路線名: 総武線。鉄道区分: 普通鉄道JR（11）。事業者種別: JR在来線（2）。

京成稲毛
type: Concept
alternative label: 京成稲毛（京成電鉄 千葉線）
broader: g004048
in scheme: scheme
notation: 004048
scope note: 運営会社: 京成電鉄。路線名: 千葉線。鉄道区分: 普通鉄道（12）。事業者種別: 民営鉄道（4）。

検見川浜
type: Concept
alternative label: 検見川浜（東日本旅客鉄道 京葉線）
broader: g004049
in scheme: scheme
notation: 004049
scope note: 運営会社: 東日本旅客鉄道。路線名: 京葉線。鉄道区分: 普通鉄道JR（11）。事業者種別: JR在来線（2）。

祐天寺
type: Concept
alternative label: 祐天寺（東急電鉄 東横線）
broader: g004050
in scheme: scheme
notation: 004050
scope note: 運営会社: 東急電鉄。路線名: 東横線。鉄道区分: 普通鉄道（12）。事業者種別: 民営鉄道（4）。

大塚・帝京大学
type: Concept
alternative label: 大塚・帝京大学（多摩都市モノレール 多摩都市モノレール線）
broader: g004051
in scheme: scheme
notation: 004051
scope note: 運営会社: 多摩都市モノレール。路線名: 多摩都市モノレール線。鉄道区分: 跨座式モノレール（23）。事業者種別: 第三セクター（5）。

甲斐住吉
type: Concept
alternative label: 甲斐住吉（東海旅客鉄道 身延線）
broader: g004052
in scheme: scheme
notation: 004052
scope note: 運営会社: 東海旅客鉄道。路線名: 身延線。鉄道区分: 普通鉄道JR（11）。事業者種別: JR在来線（2）。

喜多見
type: Concept
alternative label: 喜多見（小田急電鉄 小田原線）
broader: g004053
in scheme: scheme
notation: 004053
scope note: 運営会社: 小田急電鉄。路線名: 小田原線。鉄道区分: 普通鉄道（12）。事業者種別: 民営鉄道（4）。

松尾
type: Concept
alternative label: 松尾（東日本旅客鉄道 総武線）
broader: g004054
in scheme: scheme
notation: 004054
scope note: 運営会社: 東日本旅客鉄道。路線名: 総武線。鉄道区分: 普通鉄道JR（11）。事業者種別: JR在来線（2）。

舞浜
type: Concept
alternative label: 舞浜（東日本旅客鉄道 京葉線）
broader: g004055
in scheme: scheme
notation: 004055
scope note: 運営会社: 東日本旅客鉄道。路線名: 京葉線。鉄道区分: 普通鉄道JR（11）。事業者種別: JR在来線（2）。

稲城
type: Concept
alternative label: 稲城（京王電鉄 相模原線）
broader: g004056
in scheme: scheme
notation: 004056
scope note: 運営会社: 京王電鉄。路線名: 相模原線。鉄道区分: 普通鉄道（12）。事業者種別: 民営鉄道（4）。

都賀
type: Concept
alternative label: 都賀（東日本旅客鉄道 総武線）
broader: g004057
in scheme: scheme
notation: 004057
scope note: 運営会社: 東日本旅客鉄道。路線名: 総武線。鉄道区分: 普通鉄道JR（11）。事業者種別: JR在来線（2）。

東京ディズニーランド･ステーション
type: Concept
alternative label: 東京ディズニーランド･ステーション（舞浜リゾートライン ディズニーリゾートライン）
broader: g004058
in scheme: scheme
notation: 004058
scope note: 運営会社: 舞浜リゾートライン。路線名: ディズニーリゾートライン。鉄道区分: 跨座式鉄道（15）。事業者種別: 民営鉄道（4）。

香住
type: Concept
alternative label: 香住（西日本旅客鉄道 山陰線）
broader: g004059
in scheme: scheme
notation: 004059
scope note: 運営会社: 西日本旅客鉄道。路線名: 山陰線。鉄道区分: 普通鉄道JR（11）。事業者種別: JR在来線（2）。

都賀
type: Concept
alternative label: 都賀（千葉都市モノレール 2号線）
broader: g004057
in scheme: scheme
notation: 004060
scope note: 運営会社: 千葉都市モノレール。路線名: 2号線。鉄道区分: 懸垂式モノレール（22）。事業者種別: 第三セクター（5）。

高輪ゲートウェイ
type: Concept
alternative label: 高輪ゲートウェイ（東日本旅客鉄道 東海道線）
broader: g004061
in scheme: scheme
notation: 004061
scope note: 運営会社: 東日本旅客鉄道。路線名: 東海道線。鉄道区分: 普通鉄道JR（11）。事業者種別: JR在来線（2）。

樽見
type: Concept
alternative label: 樽見（樽見鉄道 樽見線）
broader: g004062
in scheme: scheme
notation: 004062
scope note: 運営会社: 樽見鉄道。路線名: 樽見線。鉄道区分: 普通鉄道（12）。事業者種別: 第三セクター（5）。

リゾートゲートウェイ･ステーション
type: Concept
alternative label: リゾートゲートウェイ･ステーション（舞浜リゾートライン ディズニーリゾートライン）
broader: g004063
in scheme: scheme
notation: 004063
scope note: 運営会社: 舞浜リゾートライン。路線名: ディズニーリゾートライン。鉄道区分: 跨座式鉄道（15）。事業者種別: 民営鉄道（4）。

有明
type: Concept
alternative label: 有明（ゆりかもめ 東京臨海新交通臨海線）
broader: g004064
in scheme: scheme
notation: 004064
scope note: 運営会社: ゆりかもめ。路線名: 東京臨海新交通臨海線。鉄道区分: 案内軌条式（24）。事業者種別: 第三セクター（5）。

国際展示場
type: Concept
alternative label: 国際展示場（東京臨海高速鉄道 臨海副都心線）
broader: g004065
in scheme: scheme
notation: 004065
scope note: 運営会社: 東京臨海高速鉄道。路線名: 臨海副都心線。鉄道区分: 普通鉄道（12）。事業者種別: 第三セクター（5）。

京王稲田堤
type: Concept
alternative label: 京王稲田堤（京王電鉄 相模原線）
broader: g004066
in scheme: scheme
notation: 004066
scope note: 運営会社: 京王電鉄。路線名: 相模原線。鉄道区分: 普通鉄道（12）。事業者種別: 民営鉄道（4）。

稲田堤
type: Concept
alternative label: 稲田堤（東日本旅客鉄道 南武線）
broader: g004067
in scheme: scheme
notation: 004067
scope note: 運営会社: 東日本旅客鉄道。路線名: 南武線。鉄道区分: 普通鉄道JR（11）。事業者種別: JR在来線（2）。

下油井
type: Concept
alternative label: 下油井（東海旅客鉄道 高山線）
broader: g004068
in scheme: scheme
notation: 004068
scope note: 運営会社: 東海旅客鉄道。路線名: 高山線。鉄道区分: 普通鉄道JR（11）。事業者種別: JR在来線（2）。

駒沢大学
type: Concept
alternative label: 駒沢大学（東急電鉄 田園都市線）
broader: g004069
in scheme: scheme
notation: 004069
scope note: 運営会社: 東急電鉄。路線名: 田園都市線。鉄道区分: 普通鉄道（12）。事業者種別: 民営鉄道（4）。

京王よみうりランド
type: Concept
alternative label: 京王よみうりランド（京王電鉄 相模原線）
broader: g004070
in scheme: scheme
notation: 004070
scope note: 運営会社: 京王電鉄。路線名: 相模原線。鉄道区分: 普通鉄道（12）。事業者種別: 民営鉄道（4）。

目黒
type: Concept
alternative label: 目黒（東日本旅客鉄道 山手線）
broader: g004072
in scheme: scheme
notation: 004071
scope note: 運営会社: 東日本旅客鉄道。路線名: 山手線。鉄道区分: 普通鉄道JR（11）。事業者種別: JR在来線（2）。

目黒
type: Concept
alternative label: 目黒（東京都 6号線三田線）
broader: g004072
in scheme: scheme
notation: 004072
scope note: 運営会社: 東京都。路線名: 6号線三田線。鉄道区分: 普通鉄道（12）。事業者種別: 公営鉄道（3）。

目黒
type: Concept
alternative label: 目黒（東京地下鉄 7号線南北線）
broader: g004072
in scheme: scheme
notation: 004073
scope note: 運営会社: 東京地下鉄。路線名: 7号線南北線。鉄道区分: 普通鉄道（12）。事業者種別: 民営鉄道（4）。

目黒
type: Concept
alternative label: 目黒（東急電鉄 目黒線）
broader: g004072
in scheme: scheme
notation: 004074
scope note: 運営会社: 東急電鉄。路線名: 目黒線。鉄道区分: 普通鉄道（12）。事業者種別: 民営鉄道（4）。

高尾山口
type: Concept
alternative label: 高尾山口（京王電鉄 高尾線）
broader: g004075
in scheme: scheme
notation: 004075
scope note: 運営会社: 京王電鉄。路線名: 高尾線。鉄道区分: 普通鉄道（12）。事業者種別: 民営鉄道（4）。

狛江
type: Concept
alternative label: 狛江（小田急電鉄 小田原線）
broader: g004076
in scheme: scheme
notation: 004076
scope note: 運営会社: 小田急電鉄。路線名: 小田原線。鉄道区分: 普通鉄道（12）。事業者種別: 民営鉄道（4）。

松が谷
type: Concept
alternative label: 松が谷（多摩都市モノレール 多摩都市モノレール線）
broader: g004077
in scheme: scheme
notation: 004077
scope note: 運営会社: 多摩都市モノレール。路線名: 多摩都市モノレール線。鉄道区分: 跨座式モノレール（23）。事業者種別: 第三セクター（5）。

桜新町
type: Concept
alternative label: 桜新町（東急電鉄 田園都市線）
broader: g004078
in scheme: scheme
notation: 004078
scope note: 運営会社: 東急電鉄。路線名: 田園都市線。鉄道区分: 普通鉄道（12）。事業者種別: 民営鉄道（4）。

高輪台
type: Concept
alternative label: 高輪台（東京都 1号線浅草線）
broader: g004079
in scheme: scheme
notation: 004079
scope note: 運営会社: 東京都。路線名: 1号線浅草線。鉄道区分: 普通鉄道（12）。事業者種別: 公営鉄道（3）。

天台
type: Concept
alternative label: 天台（千葉都市モノレール 2号線）
broader: g004080
in scheme: scheme
notation: 004080
scope note: 運営会社: 千葉都市モノレール。路線名: 2号線。鉄道区分: 懸垂式モノレール（22）。事業者種別: 第三セクター（5）。

桜木
type: Concept
alternative label: 桜木（千葉都市モノレール 2号線）
broader: g004081
in scheme: scheme
notation: 004081
scope note: 運営会社: 千葉都市モノレール。路線名: 2号線。鉄道区分: 懸垂式モノレール（22）。事業者種別: 第三セクター（5）。

八王子みなみ野
type: Concept
alternative label: 八王子みなみ野（東日本旅客鉄道 横浜線）
broader: g004082
in scheme: scheme
notation: 004082
scope note: 運営会社: 東日本旅客鉄道。路線名: 横浜線。鉄道区分: 普通鉄道JR（11）。事業者種別: JR在来線（2）。

清滝
type: Concept
alternative label: 清滝（高尾登山電鉄 高尾鋼索線）
broader: g004083
in scheme: scheme
notation: 004083
scope note: 運営会社: 高尾登山電鉄。路線名: 高尾鋼索線。鉄道区分: 鋼索鉄道（13）。事業者種別: 民営鉄道（4）。

高尾山
type: Concept
alternative label: 高尾山（高尾登山電鉄 高尾鋼索線）
broader: g004084
in scheme: scheme
notation: 004084
scope note: 運営会社: 高尾登山電鉄。路線名: 高尾鋼索線。鉄道区分: 鋼索鉄道（13）。事業者種別: 民営鉄道（4）。

国母
type: Concept
alternative label: 国母（東海旅客鉄道 身延線）
broader: g004085
in scheme: scheme
notation: 004085
scope note: 運営会社: 東海旅客鉄道。路線名: 身延線。鉄道区分: 普通鉄道JR（11）。事業者種別: JR在来線（2）。

京王永山
type: Concept
alternative label: 京王永山（京王電鉄 相模原線）
broader: g004086
in scheme: scheme
notation: 004086
scope note: 運営会社: 京王電鉄。路線名: 相模原線。鉄道区分: 普通鉄道（12）。事業者種別: 民営鉄道（4）。

東京ビッグサイト
type: Concept
alternative label: 東京ビッグサイト（ゆりかもめ 東京臨海新交通臨海線）
broader: g004087
in scheme: scheme
notation: 004087
scope note: 運営会社: ゆりかもめ。路線名: 東京臨海新交通臨海線。鉄道区分: 案内軌条式（24）。事業者種別: 第三セクター（5）。

小天橋
type: Concept
alternative label: 小天橋（WILLER TRAINS 宮津線）
broader: g004088
in scheme: scheme
notation: 004088
scope note: 運営会社: WILLER TRAINS。路線名: 宮津線。鉄道区分: 普通鉄道（12）。事業者種別: 第三セクター（5）。

中野島
type: Concept
alternative label: 中野島（東日本旅客鉄道 南武線）
broader: g004089
in scheme: scheme
notation: 004089
scope note: 運営会社: 東日本旅客鉄道。路線名: 南武線。鉄道区分: 普通鉄道JR（11）。事業者種別: JR在来線（2）。

小田急永山
type: Concept
alternative label: 小田急永山（小田急電鉄 多摩線）
broader: g004090
in scheme: scheme
notation: 004090
scope note: 運営会社: 小田急電鉄。路線名: 多摩線。鉄道区分: 普通鉄道（12）。事業者種別: 民営鉄道（4）。

お台場海浜公園
type: Concept
alternative label: お台場海浜公園（ゆりかもめ 東京臨海新交通臨海線）
broader: g004091
in scheme: scheme
notation: 004091
scope note: 運営会社: ゆりかもめ。路線名: 東京臨海新交通臨海線。鉄道区分: 案内軌条式（24）。事業者種別: 第三セクター（5）。

品川
type: Concept
alternative label: 品川（東海旅客鉄道 東海道新幹線）
broader: g004095
in scheme: scheme
notation: 004092
scope note: 運営会社: 東海旅客鉄道。路線名: 東海道新幹線。鉄道区分: 普通鉄道JR（11）。事業者種別: JRの新幹線（1）。

稲毛海岸
type: Concept
alternative label: 稲毛海岸（東日本旅客鉄道 京葉線）
broader: g004093
in scheme: scheme
notation: 004093
scope note: 運営会社: 東日本旅客鉄道。路線名: 京葉線。鉄道区分: 普通鉄道JR（11）。事業者種別: JR在来線（2）。

学芸大学
type: Concept
alternative label: 学芸大学（東急電鉄 東横線）
broader: g004094
in scheme: scheme
notation: 004094
scope note: 運営会社: 東急電鉄。路線名: 東横線。鉄道区分: 普通鉄道（12）。事業者種別: 民営鉄道（4）。

品川
type: Concept
alternative label: 品川（東日本旅客鉄道 東海道線）
broader: g004095
in scheme: scheme
notation: 004095
scope note: 運営会社: 東日本旅客鉄道。路線名: 東海道線。鉄道区分: 普通鉄道JR（11）。事業者種別: JR在来線（2）。

日向
type: Concept
alternative label: 日向（東日本旅客鉄道 総武線）
broader: g004096
in scheme: scheme
notation: 004096
scope note: 運営会社: 東日本旅客鉄道。路線名: 総武線。鉄道区分: 普通鉄道JR（11）。事業者種別: JR在来線（2）。

品川
type: Concept
alternative label: 品川（東日本旅客鉄道 山手線）
broader: g004095
in scheme: scheme
notation: 004097
scope note: 運営会社: 東日本旅客鉄道。路線名: 山手線。鉄道区分: 普通鉄道JR（11）。事業者種別: JR在来線（2）。

ベイサイド･ステーション
type: Concept
alternative label: ベイサイド･ステーション（舞浜リゾートライン ディズニーリゾートライン）
broader: g004098
in scheme: scheme
notation: 004098
scope note: 運営会社: 舞浜リゾートライン。路線名: ディズニーリゾートライン。鉄道区分: 跨座式鉄道（15）。事業者種別: 民営鉄道（4）。

小倉台
type: Concept
alternative label: 小倉台（千葉都市モノレール 2号線）
broader: g004099
in scheme: scheme
notation: 004099
scope note: 運営会社: 千葉都市モノレール。路線名: 2号線。鉄道区分: 懸垂式モノレール（22）。事業者種別: 第三セクター（5）。

みなみ子宝温泉
type: Concept
alternative label: みなみ子宝温泉（長良川鉄道 越美南線）
broader: g004100
in scheme: scheme
notation: 004100
scope note: 運営会社: 長良川鉄道。路線名: 越美南線。鉄道区分: 普通鉄道（12）。事業者種別: 第三セクター（5）。

品川
type: Concept
alternative label: 品川（京浜急行電鉄 本線）
broader: g004095
in scheme: scheme
notation: 004101
scope note: 運営会社: 京浜急行電鉄。路線名: 本線。鉄道区分: 普通鉄道（12）。事業者種別: 民営鉄道（4）。

久谷
type: Concept
alternative label: 久谷（西日本旅客鉄道 山陰線）
broader: g004102
in scheme: scheme
notation: 004102
scope note: 運営会社: 西日本旅客鉄道。路線名: 山陰線。鉄道区分: 普通鉄道JR（11）。事業者種別: JR在来線（2）。

千城台北
type: Concept
alternative label: 千城台北（千葉都市モノレール 2号線）
broader: g004103
in scheme: scheme
notation: 004103
scope note: 運営会社: 千葉都市モノレール。路線名: 2号線。鉄道区分: 懸垂式モノレール（22）。事業者種別: 第三セクター（5）。

伊那田島
type: Concept
alternative label: 伊那田島（東海旅客鉄道 飯田線）
broader: g004104
in scheme: scheme
notation: 004104
scope note: 運営会社: 東海旅客鉄道。路線名: 飯田線。鉄道区分: 普通鉄道JR（11）。事業者種別: JR在来線（2）。

和泉多摩川
type: Concept
alternative label: 和泉多摩川（小田急電鉄 小田原線）
broader: g004105
in scheme: scheme
notation: 004105
scope note: 運営会社: 小田急電鉄。路線名: 小田原線。鉄道区分: 普通鉄道（12）。事業者種別: 民営鉄道（4）。

東京ディズニーシー･ステーション
type: Concept
alternative label: 東京ディズニーシー･ステーション（舞浜リゾートライン ディズニーリゾートライン）
broader: g004106
in scheme: scheme
notation: 004106
scope note: 運営会社: 舞浜リゾートライン。路線名: ディズニーリゾートライン。鉄道区分: 跨座式鉄道（15）。事業者種別: 民営鉄道（4）。

五反田
type: Concept
alternative label: 五反田（東京都 1号線浅草線）
broader: g004110
in scheme: scheme
notation: 004107
scope note: 運営会社: 東京都。路線名: 1号線浅草線。鉄道区分: 普通鉄道（12）。事業者種別: 公営鉄道（3）。

東京テレポート
type: Concept
alternative label: 東京テレポート（東京臨海高速鉄道 臨海副都心線）
broader: g004108
in scheme: scheme
notation: 004108
scope note: 運営会社: 東京臨海高速鉄道。路線名: 臨海副都心線。鉄道区分: 普通鉄道（12）。事業者種別: 第三セクター（5）。

用賀
type: Concept
alternative label: 用賀（東急電鉄 田園都市線）
broader: g004109
in scheme: scheme
notation: 004109
scope note: 運営会社: 東急電鉄。路線名: 田園都市線。鉄道区分: 普通鉄道（12）。事業者種別: 民営鉄道（4）。

五反田
type: Concept
alternative label: 五反田（東日本旅客鉄道 山手線）
broader: g004110
in scheme: scheme
notation: 004110
scope note: 運営会社: 東日本旅客鉄道。路線名: 山手線。鉄道区分: 普通鉄道JR（11）。事業者種別: JR在来線（2）。

峰山
type: Concept
alternative label: 峰山（WILLER TRAINS 宮津線）
broader: g004111
in scheme: scheme
notation: 004111
scope note: 運営会社: WILLER TRAINS。路線名: 宮津線。鉄道区分: 普通鉄道（12）。事業者種別: 第三セクター（5）。

台場
type: Concept
alternative label: 台場（ゆりかもめ 東京臨海新交通臨海線）
broader: g004112
in scheme: scheme
notation: 004112
scope note: 運営会社: ゆりかもめ。路線名: 東京臨海新交通臨海線。鉄道区分: 案内軌条式（24）。事業者種別: 第三セクター（5）。

作草部
type: Concept
alternative label: 作草部（千葉都市モノレール 2号線）
broader: g004113
in scheme: scheme
notation: 004113
scope note: 運営会社: 千葉都市モノレール。路線名: 2号線。鉄道区分: 懸垂式モノレール（22）。事業者種別: 第三セクター（5）。

不動前
type: Concept
alternative label: 不動前（東急電鉄 目黒線）
broader: g004114
in scheme: scheme
notation: 004114
scope note: 運営会社: 東急電鉄。路線名: 目黒線。鉄道区分: 普通鉄道（12）。事業者種別: 民営鉄道（4）。

みどり台
type: Concept
alternative label: みどり台（京成電鉄 千葉線）
broader: g004115
in scheme: scheme
notation: 004115
scope note: 運営会社: 京成電鉄。路線名: 千葉線。鉄道区分: 普通鉄道（12）。事業者種別: 民営鉄道（4）。

京王多摩センター
type: Concept
alternative label: 京王多摩センター（京王電鉄 相模原線）
broader: g004116
in scheme: scheme
notation: 004116
scope note: 運営会社: 京王電鉄。路線名: 相模原線。鉄道区分: 普通鉄道（12）。事業者種別: 民営鉄道（4）。

五反田
type: Concept
alternative label: 五反田（東急電鉄 池上線）
broader: g004110
in scheme: scheme
notation: 004117
scope note: 運営会社: 東急電鉄。路線名: 池上線。鉄道区分: 普通鉄道（12）。事業者種別: 民営鉄道（4）。

小田急多摩センター
type: Concept
alternative label: 小田急多摩センター（小田急電鉄 多摩線）
broader: g004118
in scheme: scheme
notation: 004118
scope note: 運営会社: 小田急電鉄。路線名: 多摩線。鉄道区分: 普通鉄道（12）。事業者種別: 民営鉄道（4）。

青海
type: Concept
alternative label: 青海（ゆりかもめ 東京臨海新交通臨海線）
broader: g004119
in scheme: scheme
notation: 004119
scope note: 運営会社: ゆりかもめ。路線名: 東京臨海新交通臨海線。鉄道区分: 案内軌条式（24）。事業者種別: 第三セクター（5）。

京王堀之内
type: Concept
alternative label: 京王堀之内（京王電鉄 相模原線）
broader: g004120
in scheme: scheme
notation: 004120
scope note: 運営会社: 京王電鉄。路線名: 相模原線。鉄道区分: 普通鉄道（12）。事業者種別: 民営鉄道（4）。

多摩センター
type: Concept
alternative label: 多摩センター（多摩都市モノレール 多摩都市モノレール線）
broader: g004121
in scheme: scheme
notation: 004121
scope note: 運営会社: 多摩都市モノレール。路線名: 多摩都市モノレール線。鉄道区分: 跨座式モノレール（23）。事業者種別: 第三セクター（5）。

城崎温泉
type: Concept
alternative label: 城崎温泉（西日本旅客鉄道 山陰線）
broader: g004122
in scheme: scheme
notation: 004122
scope note: 運営会社: 西日本旅客鉄道。路線名: 山陰線。鉄道区分: 普通鉄道JR（11）。事業者種別: JR在来線（2）。

天王洲アイル
type: Concept
alternative label: 天王洲アイル（東京モノレール 東京モノレール羽田空港線）
broader: g004123
in scheme: scheme
notation: 004123
scope note: 運営会社: 東京モノレール。路線名: 東京モノレール羽田空港線。鉄道区分: 跨座式鉄道（15）。事業者種別: 民営鉄道（4）。

西千葉
type: Concept
alternative label: 西千葉（東日本旅客鉄道 総武線）
broader: g004124
in scheme: scheme
notation: 004124
scope note: 運営会社: 東日本旅客鉄道。路線名: 総武線。鉄道区分: 普通鉄道JR（11）。事業者種別: JR在来線（2）。

北品川
type: Concept
alternative label: 北品川（京浜急行電鉄 本線）
broader: g004125
in scheme: scheme
notation: 004125
scope note: 運営会社: 京浜急行電鉄。路線名: 本線。鉄道区分: 普通鉄道（12）。事業者種別: 民営鉄道（4）。

千城台
type: Concept
alternative label: 千城台（千葉都市モノレール 2号線）
broader: g004126
in scheme: scheme
notation: 004126
scope note: 運営会社: 千葉都市モノレール。路線名: 2号線。鉄道区分: 懸垂式モノレール（22）。事業者種別: 第三セクター（5）。

大崎広小路
type: Concept
alternative label: 大崎広小路（東急電鉄 池上線）
broader: g004127
in scheme: scheme
notation: 004127
scope note: 運営会社: 東急電鉄。路線名: 池上線。鉄道区分: 普通鉄道（12）。事業者種別: 民営鉄道（4）。

東京国際クルーズターミナル
type: Concept
alternative label: 東京国際クルーズターミナル（ゆりかもめ 東京臨海新交通臨海線）
broader: g004128
in scheme: scheme
notation: 004128
scope note: 運営会社: ゆりかもめ。路線名: 東京臨海新交通臨海線。鉄道区分: 案内軌条式（24）。事業者種別: 第三セクター（5）。

天王洲アイル
type: Concept
alternative label: 天王洲アイル（東京臨海高速鉄道 臨海副都心線）
broader: g004123
in scheme: scheme
notation: 004129
scope note: 運営会社: 東京臨海高速鉄道。路線名: 臨海副都心線。鉄道区分: 普通鉄道（12）。事業者種別: 第三セクター（5）。

登戸
type: Concept
alternative label: 登戸（小田急電鉄 小田原線）
broader: g004130
in scheme: scheme
notation: 004130
scope note: 運営会社: 小田急電鉄。路線名: 小田原線。鉄道区分: 普通鉄道（12）。事業者種別: 民営鉄道（4）。

登戸
type: Concept
alternative label: 登戸（東日本旅客鉄道 南武線）
broader: g004130
in scheme: scheme
notation: 004131
scope note: 運営会社: 東日本旅客鉄道。路線名: 南武線。鉄道区分: 普通鉄道JR（11）。事業者種別: JR在来線（2）。

浜坂
type: Concept
alternative label: 浜坂（西日本旅客鉄道 山陰線）
broader: g004132
in scheme: scheme
notation: 004132
scope note: 運営会社: 西日本旅客鉄道。路線名: 山陰線。鉄道区分: 普通鉄道JR（11）。事業者種別: JR在来線（2）。

武蔵小山
type: Concept
alternative label: 武蔵小山（東急電鉄 目黒線）
broader: g004133
in scheme: scheme
notation: 004133
scope note: 運営会社: 東急電鉄。路線名: 目黒線。鉄道区分: 普通鉄道（12）。事業者種別: 民営鉄道（4）。

八坂
type: Concept
alternative label: 八坂（長良川鉄道 越美南線）
broader: g004134
in scheme: scheme
notation: 004134
scope note: 運営会社: 長良川鉄道。路線名: 越美南線。鉄道区分: 普通鉄道（12）。事業者種別: 第三セクター（5）。

大崎
type: Concept
alternative label: 大崎（東日本旅客鉄道 山手線）
broader: g004135
in scheme: scheme
notation: 004135
scope note: 運営会社: 東日本旅客鉄道。路線名: 山手線。鉄道区分: 普通鉄道JR（11）。事業者種別: JR在来線（2）。

大崎
type: Concept
alternative label: 大崎（東京臨海高速鉄道 臨海副都心線）
broader: g004135
in scheme: scheme
notation: 004136
scope note: 運営会社: 東京臨海高速鉄道。路線名: 臨海副都心線。鉄道区分: 普通鉄道（12）。事業者種別: 第三セクター（5）。

千葉公園
type: Concept
alternative label: 千葉公園（千葉都市モノレール 2号線）
broader: g004137
in scheme: scheme
notation: 004137
scope note: 運営会社: 千葉都市モノレール。路線名: 2号線。鉄道区分: 懸垂式モノレール（22）。事業者種別: 第三セクター（5）。

諸寄
type: Concept
alternative label: 諸寄（西日本旅客鉄道 山陰線）
broader: g004138
in scheme: scheme
notation: 004138
scope note: 運営会社: 西日本旅客鉄道。路線名: 山陰線。鉄道区分: 普通鉄道JR（11）。事業者種別: JR在来線（2）。

若葉台
type: Concept
alternative label: 若葉台（京王電鉄 相模原線）
broader: g004139
in scheme: scheme
notation: 004139
scope note: 運営会社: 京王電鉄。路線名: 相模原線。鉄道区分: 普通鉄道（12）。事業者種別: 民営鉄道（4）。

上野原
type: Concept
alternative label: 上野原（東日本旅客鉄道 中央線）
broader: g004140
in scheme: scheme
notation: 004140
scope note: 運営会社: 東日本旅客鉄道。路線名: 中央線。鉄道区分: 普通鉄道JR（11）。事業者種別: JR在来線（2）。

はるひ野
type: Concept
alternative label: はるひ野（小田急電鉄 多摩線）
broader: g004141
in scheme: scheme
notation: 004141
scope note: 運営会社: 小田急電鉄。路線名: 多摩線。鉄道区分: 普通鉄道（12）。事業者種別: 民営鉄道（4）。

西敦賀
type: Concept
alternative label: 西敦賀（西日本旅客鉄道 小浜線）
broader: g004142
in scheme: scheme
notation: 004142
scope note: 運営会社: 西日本旅客鉄道。路線名: 小浜線。鉄道区分: 普通鉄道JR（11）。事業者種別: JR在来線（2）。

都立大学
type: Concept
alternative label: 都立大学（東急電鉄 東横線）
broader: g004143
in scheme: scheme
notation: 004143
scope note: 運営会社: 東急電鉄。路線名: 東横線。鉄道区分: 普通鉄道（12）。事業者種別: 民営鉄道（4）。

テレコムセンター
type: Concept
alternative label: テレコムセンター（ゆりかもめ 東京臨海新交通臨海線）
broader: g004144
in scheme: scheme
notation: 004144
scope note: 運営会社: ゆりかもめ。路線名: 東京臨海新交通臨海線。鉄道区分: 案内軌条式（24）。事業者種別: 第三セクター（5）。

西登戸
type: Concept
alternative label: 西登戸（京成電鉄 千葉線）
broader: g004145
in scheme: scheme
notation: 004145
scope note: 運営会社: 京成電鉄。路線名: 千葉線。鉄道区分: 普通鉄道（12）。事業者種別: 民営鉄道（4）。

上片桐
type: Concept
alternative label: 上片桐（東海旅客鉄道 飯田線）
broader: g004146
in scheme: scheme
notation: 004146
scope note: 運営会社: 東海旅客鉄道。路線名: 飯田線。鉄道区分: 普通鉄道JR（11）。事業者種別: JR在来線（2）。

水鳥
type: Concept
alternative label: 水鳥（樽見鉄道 樽見線）
broader: g004147
in scheme: scheme
notation: 004147
scope note: 運営会社: 樽見鉄道。路線名: 樽見線。鉄道区分: 普通鉄道（12）。事業者種別: 第三セクター（5）。

相模湖
type: Concept
alternative label: 相模湖（東日本旅客鉄道 中央線）
broader: g004148
in scheme: scheme
notation: 004148
scope note: 運営会社: 東日本旅客鉄道。路線名: 中央線。鉄道区分: 普通鉄道JR（11）。事業者種別: JR在来線（2）。

粟野
type: Concept
alternative label: 粟野（西日本旅客鉄道 小浜線）
broader: g004149
in scheme: scheme
notation: 004149
scope note: 運営会社: 西日本旅客鉄道。路線名: 小浜線。鉄道区分: 普通鉄道JR（11）。事業者種別: JR在来線（2）。

向ヶ丘遊園
type: Concept
alternative label: 向ヶ丘遊園（小田急電鉄 小田原線）
broader: g004150
in scheme: scheme
notation: 004150
scope note: 運営会社: 小田急電鉄。路線名: 小田原線。鉄道区分: 普通鉄道（12）。事業者種別: 民営鉄道（4）。

東千葉
type: Concept
alternative label: 東千葉（東日本旅客鉄道 総武線）
broader: g004151
in scheme: scheme
notation: 004151
scope note: 運営会社: 東日本旅客鉄道。路線名: 総武線。鉄道区分: 普通鉄道JR（11）。事業者種別: JR在来線（2）。

常永
type: Concept
alternative label: 常永（東海旅客鉄道 身延線）
broader: g004152
in scheme: scheme
notation: 004152
scope note: 運営会社: 東海旅客鉄道。路線名: 身延線。鉄道区分: 普通鉄道JR（11）。事業者種別: JR在来線（2）。

新馬場
type: Concept
alternative label: 新馬場（京浜急行電鉄 本線）
broader: g004153
in scheme: scheme
notation: 004153
scope note: 運営会社: 京浜急行電鉄。路線名: 本線。鉄道区分: 普通鉄道（12）。事業者種別: 民営鉄道（4）。

唐木田
type: Concept
alternative label: 唐木田（小田急電鉄 多摩線）
broader: g004154
in scheme: scheme
notation: 004154
scope note: 運営会社: 小田急電鉄。路線名: 多摩線。鉄道区分: 普通鉄道（12）。事業者種別: 民営鉄道（4）。

戸越銀座
type: Concept
alternative label: 戸越銀座（東急電鉄 池上線）
broader: g004155
in scheme: scheme
notation: 004155
scope note: 運営会社: 東急電鉄。路線名: 池上線。鉄道区分: 普通鉄道（12）。事業者種別: 民営鉄道（4）。

藤野
type: Concept
alternative label: 藤野（東日本旅客鉄道 中央線）
broader: g004156
in scheme: scheme
notation: 004156
scope note: 運営会社: 東日本旅客鉄道。路線名: 中央線。鉄道区分: 普通鉄道JR（11）。事業者種別: JR在来線（2）。

西小山
type: Concept
alternative label: 西小山（東急電鉄 目黒線）
broader: g004157
in scheme: scheme
notation: 004157
scope note: 運営会社: 東急電鉄。路線名: 目黒線。鉄道区分: 普通鉄道（12）。事業者種別: 民営鉄道（4）。

宿河原
type: Concept
alternative label: 宿河原（東日本旅客鉄道 南武線）
broader: g004158
in scheme: scheme
notation: 004158
scope note: 運営会社: 東日本旅客鉄道。路線名: 南武線。鉄道区分: 普通鉄道JR（11）。事業者種別: JR在来線（2）。

生田
type: Concept
alternative label: 生田（小田急電鉄 小田原線）
broader: g004159
in scheme: scheme
notation: 004159
scope note: 運営会社: 小田急電鉄。路線名: 小田原線。鉄道区分: 普通鉄道（12）。事業者種別: 民営鉄道（4）。

読売ランド前
type: Concept
alternative label: 読売ランド前（小田急電鉄 小田原線）
broader: g004160
in scheme: scheme
notation: 004160
scope note: 運営会社: 小田急電鉄。路線名: 小田原線。鉄道区分: 普通鉄道（12）。事業者種別: 民営鉄道（4）。

戸越
type: Concept
alternative label: 戸越（東京都 1号線浅草線）
broader: g004161
in scheme: scheme
notation: 004161
scope note: 運営会社: 東京都。路線名: 1号線浅草線。鉄道区分: 普通鉄道（12）。事業者種別: 公営鉄道（3）。

四方津
type: Concept
alternative label: 四方津（東日本旅客鉄道 中央線）
broader: g004162
in scheme: scheme
notation: 004162
scope note: 運営会社: 東日本旅客鉄道。路線名: 中央線。鉄道区分: 普通鉄道JR（11）。事業者種別: JR在来線（2）。

南大沢
type: Concept
alternative label: 南大沢（京王電鉄 相模原線）
broader: g004163
in scheme: scheme
notation: 004163
scope note: 運営会社: 京王電鉄。路線名: 相模原線。鉄道区分: 普通鉄道（12）。事業者種別: 民営鉄道（4）。

東美浜
type: Concept
alternative label: 東美浜（西日本旅客鉄道 小浜線）
broader: g004164
in scheme: scheme
notation: 004164
scope note: 運営会社: 西日本旅客鉄道。路線名: 小浜線。鉄道区分: 普通鉄道JR（11）。事業者種別: JR在来線（2）。

千葉
type: Concept
alternative label: 千葉（東日本旅客鉄道 総武線）
broader: g004173
in scheme: scheme
notation: 004165
scope note: 運営会社: 東日本旅客鉄道。路線名: 総武線。鉄道区分: 普通鉄道JR（11）。事業者種別: JR在来線（2）。

大月
type: Concept
alternative label: 大月（東日本旅客鉄道 中央線）
broader: g004166
in scheme: scheme
notation: 004166
scope note: 運営会社: 東日本旅客鉄道。路線名: 中央線。鉄道区分: 普通鉄道JR（11）。事業者種別: JR在来線（2）。

千葉
type: Concept
alternative label: 千葉（東日本旅客鉄道 外房線）
broader: g004173
in scheme: scheme
notation: 004167
scope note: 運営会社: 東日本旅客鉄道。路線名: 外房線。鉄道区分: 普通鉄道JR（11）。事業者種別: JR在来線（2）。

黒川
type: Concept
alternative label: 黒川（小田急電鉄 多摩線）
broader: g004168
in scheme: scheme
notation: 004168
scope note: 運営会社: 小田急電鉄。路線名: 多摩線。鉄道区分: 普通鉄道（12）。事業者種別: 民営鉄道（4）。

栄町
type: Concept
alternative label: 栄町（千葉都市モノレール 1号線）
broader: g004169
in scheme: scheme
notation: 004169
scope note: 運営会社: 千葉都市モノレール。路線名: 1号線。鉄道区分: 懸垂式モノレール（22）。事業者種別: 第三セクター（5）。

猿橋
type: Concept
alternative label: 猿橋（東日本旅客鉄道 中央線）
broader: g004170
in scheme: scheme
notation: 004170
scope note: 運営会社: 東日本旅客鉄道。路線名: 中央線。鉄道区分: 普通鉄道JR（11）。事業者種別: JR在来線（2）。

大月
type: Concept
alternative label: 大月（富士山麓電気鉄道 大月線）
broader: g004166
in scheme: scheme
notation: 004171
scope note: 運営会社: 富士山麓電気鉄道。路線名: 大月線。鉄道区分: 普通鉄道（12）。事業者種別: 民営鉄道（4）。

新千葉
type: Concept
alternative label: 新千葉（京成電鉄 千葉線）
broader: g004172
in scheme: scheme
notation: 004172
scope note: 運営会社: 京成電鉄。路線名: 千葉線。鉄道区分: 普通鉄道（12）。事業者種別: 民営鉄道（4）。

千葉
type: Concept
alternative label: 千葉（千葉都市モノレール 1号線）
broader: g004173
in scheme: scheme
notation: 004173
scope note: 運営会社: 千葉都市モノレール。路線名: 1号線。鉄道区分: 懸垂式モノレール（22）。事業者種別: 第三セクター（5）。

千葉
type: Concept
alternative label: 千葉（千葉都市モノレール 2号線）
broader: g004173
in scheme: scheme
notation: 004174
scope note: 運営会社: 千葉都市モノレール。路線名: 2号線。鉄道区分: 懸垂式モノレール（22）。事業者種別: 第三セクター（5）。

上野毛
type: Concept
alternative label: 上野毛（東急電鉄 大井町線）
broader: g004175
in scheme: scheme
notation: 004175
scope note: 運営会社: 東急電鉄。路線名: 大井町線。鉄道区分: 普通鉄道（12）。事業者種別: 民営鉄道（4）。

京成千葉
type: Concept
alternative label: 京成千葉（京成電鉄 千葉線）
broader: g004176
in scheme: scheme
notation: 004176
scope note: 運営会社: 京成電鉄。路線名: 千葉線。鉄道区分: 普通鉄道（12）。事業者種別: 民営鉄道（4）。

二子玉川
type: Concept
alternative label: 二子玉川（東急電鉄 大井町線）
broader: g004177
in scheme: scheme
notation: 004177
scope note: 運営会社: 東急電鉄。路線名: 大井町線。鉄道区分: 普通鉄道（12）。事業者種別: 民営鉄道（4）。

二子玉川
type: Concept
alternative label: 二子玉川（東急電鉄 田園都市線）
broader: g004177
in scheme: scheme
notation: 004178
scope note: 運営会社: 東急電鉄。路線名: 田園都市線。鉄道区分: 普通鉄道（12）。事業者種別: 民営鉄道（4）。

久地
type: Concept
alternative label: 久地（東日本旅客鉄道 南武線）
broader: g004179
in scheme: scheme
notation: 004179
scope note: 運営会社: 東日本旅客鉄道。路線名: 南武線。鉄道区分: 普通鉄道JR（11）。事業者種別: JR在来線（2）。

洗足
type: Concept
alternative label: 洗足（東急電鉄 目黒線）
broader: g004180
in scheme: scheme
notation: 004180
scope note: 運営会社: 東急電鉄。路線名: 目黒線。鉄道区分: 普通鉄道（12）。事業者種別: 民営鉄道（4）。

荏原中延
type: Concept
alternative label: 荏原中延（東急電鉄 池上線）
broader: g004181
in scheme: scheme
notation: 004181
scope note: 運営会社: 東急電鉄。路線名: 池上線。鉄道区分: 普通鉄道（12）。事業者種別: 民営鉄道（4）。

品川シーサイド
type: Concept
alternative label: 品川シーサイド（東京臨海高速鉄道 臨海副都心線）
broader: g004182
in scheme: scheme
notation: 004182
scope note: 運営会社: 東京臨海高速鉄道。路線名: 臨海副都心線。鉄道区分: 普通鉄道（12）。事業者種別: 第三セクター（5）。

上大月
type: Concept
alternative label: 上大月（富士山麓電気鉄道 大月線）
broader: g004183
in scheme: scheme
notation: 004183
scope note: 運営会社: 富士山麓電気鉄道。路線名: 大月線。鉄道区分: 普通鉄道（12）。事業者種別: 民営鉄道（4）。

青物横丁
type: Concept
alternative label: 青物横丁（京浜急行電鉄 本線）
broader: g004184
in scheme: scheme
notation: 004184
scope note: 運営会社: 京浜急行電鉄。路線名: 本線。鉄道区分: 普通鉄道（12）。事業者種別: 民営鉄道（4）。

百合ヶ丘
type: Concept
alternative label: 百合ヶ丘（小田急電鉄 小田原線）
broader: g004185
in scheme: scheme
notation: 004185
scope note: 運営会社: 小田急電鉄。路線名: 小田原線。鉄道区分: 普通鉄道（12）。事業者種別: 民営鉄道（4）。

戸越公園
type: Concept
alternative label: 戸越公園（東急電鉄 大井町線）
broader: g004186
in scheme: scheme
notation: 004186
scope note: 運営会社: 東急電鉄。路線名: 大井町線。鉄道区分: 普通鉄道（12）。事業者種別: 民営鉄道（4）。

葭川公園
type: Concept
alternative label: 葭川公園（千葉都市モノレール 1号線）
broader: g004187
in scheme: scheme
notation: 004187
scope note: 運営会社: 千葉都市モノレール。路線名: 1号線。鉄道区分: 懸垂式モノレール（22）。事業者種別: 第三セクター（5）。

下神明
type: Concept
alternative label: 下神明（東急電鉄 大井町線）
broader: g004188
in scheme: scheme
notation: 004188
scope note: 運営会社: 東急電鉄。路線名: 大井町線。鉄道区分: 普通鉄道（12）。事業者種別: 民営鉄道（4）。

成東
type: Concept
alternative label: 成東（東日本旅客鉄道 総武線）
broader: g004189
in scheme: scheme
notation: 004189
scope note: 運営会社: 東日本旅客鉄道。路線名: 総武線。鉄道区分: 普通鉄道JR（11）。事業者種別: JR在来線（2）。

成東
type: Concept
alternative label: 成東（東日本旅客鉄道 東金線）
broader: g004189
in scheme: scheme
notation: 004190
scope note: 運営会社: 東日本旅客鉄道。路線名: 東金線。鉄道区分: 普通鉄道JR（11）。事業者種別: JR在来線（2）。

等々力
type: Concept
alternative label: 等々力（東急電鉄 大井町線）
broader: g004191
in scheme: scheme
notation: 004191
scope note: 運営会社: 東急電鉄。路線名: 大井町線。鉄道区分: 普通鉄道（12）。事業者種別: 民営鉄道（4）。

鳥沢
type: Concept
alternative label: 鳥沢（東日本旅客鉄道 中央線）
broader: g004192
in scheme: scheme
notation: 004192
scope note: 運営会社: 東日本旅客鉄道。路線名: 中央線。鉄道区分: 普通鉄道JR（11）。事業者種別: JR在来線（2）。

大井町
type: Concept
alternative label: 大井町（東急電鉄 大井町線）
broader: g004197
in scheme: scheme
notation: 004193
scope note: 運営会社: 東急電鉄。路線名: 大井町線。鉄道区分: 普通鉄道（12）。事業者種別: 民営鉄道（4）。

千葉中央
type: Concept
alternative label: 千葉中央（京成電鉄 千原線）
broader: g004194
in scheme: scheme
notation: 004194
scope note: 運営会社: 京成電鉄。路線名: 千原線。鉄道区分: 普通鉄道（12）。事業者種別: 民営鉄道（4）。

千葉中央
type: Concept
alternative label: 千葉中央（京成電鉄 千葉線）
broader: g004194
in scheme: scheme
notation: 004195
scope note: 運営会社: 京成電鉄。路線名: 千葉線。鉄道区分: 普通鉄道（12）。事業者種別: 民営鉄道（4）。

自由が丘
type: Concept
alternative label: 自由が丘（東急電鉄 大井町線）
broader: g004196
in scheme: scheme
notation: 004196
scope note: 運営会社: 東急電鉄。路線名: 大井町線。鉄道区分: 普通鉄道（12）。事業者種別: 民営鉄道（4）。

大井町
type: Concept
alternative label: 大井町（東京臨海高速鉄道 臨海副都心線）
broader: g004197
in scheme: scheme
notation: 004197
scope note: 運営会社: 東京臨海高速鉄道。路線名: 臨海副都心線。鉄道区分: 普通鉄道（12）。事業者種別: 第三セクター（5）。

二子新地
type: Concept
alternative label: 二子新地（東急電鉄 田園都市線）
broader: g004198
in scheme: scheme
notation: 004198
scope note: 運営会社: 東急電鉄。路線名: 田園都市線。鉄道区分: 普通鉄道（12）。事業者種別: 民営鉄道（4）。

自由が丘
type: Concept
alternative label: 自由が丘（東急電鉄 東横線）
broader: g004196
in scheme: scheme
notation: 004199
scope note: 運営会社: 東急電鉄。路線名: 東横線。鉄道区分: 普通鉄道（12）。事業者種別: 民営鉄道（4）。

大岡山
type: Concept
alternative label: 大岡山（東急電鉄 目黒線）
broader: g004200
in scheme: scheme
notation: 004200
scope note: 運営会社: 東急電鉄。路線名: 目黒線。鉄道区分: 普通鉄道（12）。事業者種別: 民営鉄道（4）。

千葉みなと
type: Concept
alternative label: 千葉みなと（千葉都市モノレール 1号線）
broader: g004201
in scheme: scheme
notation: 004201
scope note: 運営会社: 千葉都市モノレール。路線名: 1号線。鉄道区分: 懸垂式モノレール（22）。事業者種別: 第三セクター（5）。

大岡山
type: Concept
alternative label: 大岡山（東急電鉄 大井町線）
broader: g004200
in scheme: scheme
notation: 004202
scope note: 運営会社: 東急電鉄。路線名: 大井町線。鉄道区分: 普通鉄道（12）。事業者種別: 民営鉄道（4）。

市役所前
type: Concept
alternative label: 市役所前（千葉都市モノレール 1号線）
broader: g004203
in scheme: scheme
notation: 004203
scope note: 運営会社: 千葉都市モノレール。路線名: 1号線。鉄道区分: 懸垂式モノレール（22）。事業者種別: 第三セクター（5）。

居組
type: Concept
alternative label: 居組（西日本旅客鉄道 山陰線）
broader: g004204
in scheme: scheme
notation: 004204
scope note: 運営会社: 西日本旅客鉄道。路線名: 山陰線。鉄道区分: 普通鉄道JR（11）。事業者種別: JR在来線（2）。

尾山台
type: Concept
alternative label: 尾山台（東急電鉄 大井町線）
broader: g004205
in scheme: scheme
notation: 004205
scope note: 運営会社: 東急電鉄。路線名: 大井町線。鉄道区分: 普通鉄道（12）。事業者種別: 民営鉄道（4）。

相原
type: Concept
alternative label: 相原（東日本旅客鉄道 横浜線）
broader: g004206
in scheme: scheme
notation: 004206
scope note: 運営会社: 東日本旅客鉄道。路線名: 横浜線。鉄道区分: 普通鉄道JR（11）。事業者種別: JR在来線（2）。

大井町
type: Concept
alternative label: 大井町（東日本旅客鉄道 東海道線）
broader: g004197
in scheme: scheme
notation: 004207
scope note: 運営会社: 東日本旅客鉄道。路線名: 東海道線。鉄道区分: 普通鉄道JR（11）。事業者種別: JR在来線（2）。

かぶと山
type: Concept
alternative label: かぶと山（WILLER TRAINS 宮津線）
broader: g004208
in scheme: scheme
notation: 004208
scope note: 運営会社: WILLER TRAINS。路線名: 宮津線。鉄道区分: 普通鉄道（12）。事業者種別: 第三セクター（5）。

千葉みなと
type: Concept
alternative label: 千葉みなと（東日本旅客鉄道 京葉線）
broader: g004201
in scheme: scheme
notation: 004209
scope note: 運営会社: 東日本旅客鉄道。路線名: 京葉線。鉄道区分: 普通鉄道JR（11）。事業者種別: JR在来線（2）。

緑が丘
type: Concept
alternative label: 緑が丘（東急電鉄 大井町線）
broader: g004210
in scheme: scheme
notation: 004210
scope note: 運営会社: 東急電鉄。路線名: 大井町線。鉄道区分: 普通鉄道（12）。事業者種別: 民営鉄道（4）。

木尾
type: Concept
alternative label: 木尾（長良川鉄道 越美南線）
broader: g004211
in scheme: scheme
notation: 004211
scope note: 運営会社: 長良川鉄道。路線名: 越美南線。鉄道区分: 普通鉄道（12）。事業者種別: 第三セクター（5）。

北千束
type: Concept
alternative label: 北千束（東急電鉄 大井町線）
broader: g004212
in scheme: scheme
notation: 004212
scope note: 運営会社: 東急電鉄。路線名: 大井町線。鉄道区分: 普通鉄道（12）。事業者種別: 民営鉄道（4）。

梁川
type: Concept
alternative label: 梁川（東日本旅客鉄道 中央線）
broader: g004213
in scheme: scheme
notation: 004213
scope note: 運営会社: 東日本旅客鉄道。路線名: 中央線。鉄道区分: 普通鉄道JR（11）。事業者種別: JR在来線（2）。

栗平
type: Concept
alternative label: 栗平（小田急電鉄 多摩線）
broader: g004214
in scheme: scheme
notation: 004214
scope note: 運営会社: 小田急電鉄。路線名: 多摩線。鉄道区分: 普通鉄道（12）。事業者種別: 民営鉄道（4）。

中延
type: Concept
alternative label: 中延（東急電鉄 大井町線）
broader: g004215
in scheme: scheme
notation: 004215
scope note: 運営会社: 東急電鉄。路線名: 大井町線。鉄道区分: 普通鉄道（12）。事業者種別: 民営鉄道（4）。

九品仏
type: Concept
alternative label: 九品仏（東急電鉄 大井町線）
broader: g004216
in scheme: scheme
notation: 004216
scope note: 運営会社: 東急電鉄。路線名: 大井町線。鉄道区分: 普通鉄道（12）。事業者種別: 民営鉄道（4）。

美浜
type: Concept
alternative label: 美浜（西日本旅客鉄道 小浜線）
broader: g004217
in scheme: scheme
notation: 004217
scope note: 運営会社: 西日本旅客鉄道。路線名: 小浜線。鉄道区分: 普通鉄道JR（11）。事業者種別: JR在来線（2）。

中延
type: Concept
alternative label: 中延（東京都 1号線浅草線）
broader: g004215
in scheme: scheme
notation: 004218
scope note: 運営会社: 東京都。路線名: 1号線浅草線。鉄道区分: 普通鉄道（12）。事業者種別: 公営鉄道（3）。

旗の台
type: Concept
alternative label: 旗の台（東急電鉄 池上線）
broader: g004219
in scheme: scheme
notation: 004219
scope note: 運営会社: 東急電鉄。路線名: 池上線。鉄道区分: 普通鉄道（12）。事業者種別: 民営鉄道（4）。

鮫洲
type: Concept
alternative label: 鮫洲（京浜急行電鉄 本線）
broader: g004220
in scheme: scheme
notation: 004220
scope note: 運営会社: 京浜急行電鉄。路線名: 本線。鉄道区分: 普通鉄道（12）。事業者種別: 民営鉄道（4）。

旗の台
type: Concept
alternative label: 旗の台（東急電鉄 大井町線）
broader: g004219
in scheme: scheme
notation: 004221
scope note: 運営会社: 東急電鉄。路線名: 大井町線。鉄道区分: 普通鉄道（12）。事業者種別: 民営鉄道（4）。

小井川
type: Concept
alternative label: 小井川（東海旅客鉄道 身延線）
broader: g004222
in scheme: scheme
notation: 004222
scope note: 運営会社: 東海旅客鉄道。路線名: 身延線。鉄道区分: 普通鉄道JR（11）。事業者種別: JR在来線（2）。

奥沢
type: Concept
alternative label: 奥沢（東急電鉄 目黒線）
broader: g004223
in scheme: scheme
notation: 004223
scope note: 運営会社: 東急電鉄。路線名: 目黒線。鉄道区分: 普通鉄道（12）。事業者種別: 民営鉄道（4）。

笹子
type: Concept
alternative label: 笹子（東日本旅客鉄道 中央線）
broader: g004224
in scheme: scheme
notation: 004224
scope note: 運営会社: 東日本旅客鉄道。路線名: 中央線。鉄道区分: 普通鉄道JR（11）。事業者種別: JR在来線（2）。

荏原町
type: Concept
alternative label: 荏原町（東急電鉄 大井町線）
broader: g004225
in scheme: scheme
notation: 004225
scope note: 運営会社: 東急電鉄。路線名: 大井町線。鉄道区分: 普通鉄道（12）。事業者種別: 民営鉄道（4）。

県庁前
type: Concept
alternative label: 県庁前（千葉都市モノレール 1号線）
broader: g004226
in scheme: scheme
notation: 004226
scope note: 運営会社: 千葉都市モノレール。路線名: 1号線。鉄道区分: 懸垂式モノレール（22）。事業者種別: 第三セクター（5）。

新百合ヶ丘
type: Concept
alternative label: 新百合ヶ丘（小田急電鉄 小田原線）
broader: g004227
in scheme: scheme
notation: 004227
scope note: 運営会社: 小田急電鉄。路線名: 小田原線。鉄道区分: 普通鉄道（12）。事業者種別: 民営鉄道（4）。

新百合ヶ丘
type: Concept
alternative label: 新百合ヶ丘（小田急電鉄 多摩線）
broader: g004227
in scheme: scheme
notation: 004228
scope note: 運営会社: 小田急電鉄。路線名: 多摩線。鉄道区分: 普通鉄道（12）。事業者種別: 民営鉄道（4）。

津田山
type: Concept
alternative label: 津田山（東日本旅客鉄道 南武線）
broader: g004229
in scheme: scheme
notation: 004229
scope note: 運営会社: 東日本旅客鉄道。路線名: 南武線。鉄道区分: 普通鉄道JR（11）。事業者種別: JR在来線（2）。

高津
type: Concept
alternative label: 高津（東急電鉄 田園都市線）
broader: g004230
in scheme: scheme
notation: 004230
scope note: 運営会社: 東急電鉄。路線名: 田園都市線。鉄道区分: 普通鉄道（12）。事業者種別: 民営鉄道（4）。

久美浜
type: Concept
alternative label: 久美浜（WILLER TRAINS 宮津線）
broader: g004231
in scheme: scheme
notation: 004231
scope note: 運営会社: WILLER TRAINS。路線名: 宮津線。鉄道区分: 普通鉄道（12）。事業者種別: 第三セクター（5）。

長原
type: Concept
alternative label: 長原（東急電鉄 池上線）
broader: g004232
in scheme: scheme
notation: 004232
scope note: 運営会社: 東急電鉄。路線名: 池上線。鉄道区分: 普通鉄道（12）。事業者種別: 民営鉄道（4）。

高尾
type: Concept
alternative label: 高尾（樽見鉄道 樽見線）
broader: g004233
in scheme: scheme
notation: 004233
scope note: 運営会社: 樽見鉄道。路線名: 樽見線。鉄道区分: 普通鉄道（12）。事業者種別: 第三セクター（5）。

多摩境
type: Concept
alternative label: 多摩境（京王電鉄 相模原線）
broader: g004234
in scheme: scheme
notation: 004234
scope note: 運営会社: 京王電鉄。路線名: 相模原線。鉄道区分: 普通鉄道（12）。事業者種別: 民営鉄道（4）。

西大井
type: Concept
alternative label: 西大井（東日本旅客鉄道 東海道線）
broader: g004235
in scheme: scheme
notation: 004235
scope note: 運営会社: 東日本旅客鉄道。路線名: 東海道線。鉄道区分: 普通鉄道JR（11）。事業者種別: JR在来線（2）。

本千葉
type: Concept
alternative label: 本千葉（東日本旅客鉄道 外房線）
broader: g004236
in scheme: scheme
notation: 004236
scope note: 運営会社: 東日本旅客鉄道。路線名: 外房線。鉄道区分: 普通鉄道JR（11）。事業者種別: JR在来線（2）。

五月台
type: Concept
alternative label: 五月台（小田急電鉄 多摩線）
broader: g004237
in scheme: scheme
notation: 004237
scope note: 運営会社: 小田急電鉄。路線名: 多摩線。鉄道区分: 普通鉄道（12）。事業者種別: 民営鉄道（4）。

溝の口
type: Concept
alternative label: 溝の口（東急電鉄 田園都市線）
broader: g004238
in scheme: scheme
notation: 004238
scope note: 運営会社: 東急電鉄。路線名: 田園都市線。鉄道区分: 普通鉄道（12）。事業者種別: 民営鉄道（4）。

洗足池
type: Concept
alternative label: 洗足池（東急電鉄 池上線）
broader: g004239
in scheme: scheme
notation: 004239
scope note: 運営会社: 東急電鉄。路線名: 池上線。鉄道区分: 普通鉄道（12）。事業者種別: 民営鉄道（4）。

東浜
type: Concept
alternative label: 東浜（西日本旅客鉄道 山陰線）
broader: g004240
in scheme: scheme
notation: 004240
scope note: 運営会社: 西日本旅客鉄道。路線名: 山陰線。鉄道区分: 普通鉄道JR（11）。事業者種別: JR在来線（2）。

南木曽
type: Concept
alternative label: 南木曽（東海旅客鉄道 中央線）
broader: g004241
in scheme: scheme
notation: 004241
scope note: 運営会社: 東海旅客鉄道。路線名: 中央線。鉄道区分: 普通鉄道JR（11）。事業者種別: JR在来線（2）。

武蔵溝ノ口
type: Concept
alternative label: 武蔵溝ノ口（東日本旅客鉄道 南武線）
broader: g004242
in scheme: scheme
notation: 004242
scope note: 運営会社: 東日本旅客鉄道。路線名: 南武線。鉄道区分: 普通鉄道JR（11）。事業者種別: JR在来線（2）。

母野
type: Concept
alternative label: 母野（長良川鉄道 越美南線）
broader: g004243
in scheme: scheme
notation: 004243
scope note: 運営会社: 長良川鉄道。路線名: 越美南線。鉄道区分: 普通鉄道（12）。事業者種別: 第三セクター（5）。

立会川
type: Concept
alternative label: 立会川（京浜急行電鉄 本線）
broader: g004244
in scheme: scheme
notation: 004244
scope note: 運営会社: 京浜急行電鉄。路線名: 本線。鉄道区分: 普通鉄道（12）。事業者種別: 民営鉄道（4）。

田園調布
type: Concept
alternative label: 田園調布（東急電鉄 東横線）
broader: g004245
in scheme: scheme
notation: 004245
scope note: 運営会社: 東急電鉄。路線名: 東横線。鉄道区分: 普通鉄道（12）。事業者種別: 民営鉄道（4）。

田園調布
type: Concept
alternative label: 田園調布（東急電鉄 目黒線）
broader: g004245
in scheme: scheme
notation: 004246
scope note: 運営会社: 東急電鉄。路線名: 目黒線。鉄道区分: 普通鉄道（12）。事業者種別: 民営鉄道（4）。

石川台
type: Concept
alternative label: 石川台（東急電鉄 池上線）
broader: g004247
in scheme: scheme
notation: 004247
scope note: 運営会社: 東急電鉄。路線名: 池上線。鉄道区分: 普通鉄道（12）。事業者種別: 民営鉄道（4）。

馬込
type: Concept
alternative label: 馬込（東京都 1号線浅草線）
broader: g004248
in scheme: scheme
notation: 004248
scope note: 運営会社: 東京都。路線名: 1号線浅草線。鉄道区分: 普通鉄道（12）。事業者種別: 公営鉄道（3）。

伊那大島
type: Concept
alternative label: 伊那大島（東海旅客鉄道 飯田線）
broader: g004249
in scheme: scheme
notation: 004249
scope note: 運営会社: 東海旅客鉄道。路線名: 飯田線。鉄道区分: 普通鉄道JR（11）。事業者種別: JR在来線（2）。

橋本
type: Concept
alternative label: 橋本（京王電鉄 相模原線）
broader: g004253
in scheme: scheme
notation: 004250
scope note: 運営会社: 京王電鉄。路線名: 相模原線。鉄道区分: 普通鉄道（12）。事業者種別: 民営鉄道（4）。

大井競馬場前
type: Concept
alternative label: 大井競馬場前（東京モノレール 東京モノレール羽田空港線）
broader: g004251
in scheme: scheme
notation: 004251
scope note: 運営会社: 東京モノレール。路線名: 東京モノレール羽田空港線。鉄道区分: 跨座式鉄道（15）。事業者種別: 民営鉄道（4）。

東花輪
type: Concept
alternative label: 東花輪（東海旅客鉄道 身延線）
broader: g004252
in scheme: scheme
notation: 004252
scope note: 運営会社: 東海旅客鉄道。路線名: 身延線。鉄道区分: 普通鉄道JR（11）。事業者種別: JR在来線（2）。

橋本
type: Concept
alternative label: 橋本（東日本旅客鉄道 横浜線）
broader: g004253
in scheme: scheme
notation: 004253
scope note: 運営会社: 東日本旅客鉄道。路線名: 横浜線。鉄道区分: 普通鉄道JR（11）。事業者種別: JR在来線（2）。

橋本
type: Concept
alternative label: 橋本（東日本旅客鉄道 相模線）
broader: g004253
in scheme: scheme
notation: 004254
scope note: 運営会社: 東日本旅客鉄道。路線名: 相模線。鉄道区分: 普通鉄道JR（11）。事業者種別: JR在来線（2）。

初狩
type: Concept
alternative label: 初狩（東日本旅客鉄道 中央線）
broader: g004255
in scheme: scheme
notation: 004255
scope note: 運営会社: 東日本旅客鉄道。路線名: 中央線。鉄道区分: 普通鉄道JR（11）。事業者種別: JR在来線（2）。

新疋田
type: Concept
alternative label: 新疋田（西日本旅客鉄道 北陸線）
broader: g004256
in scheme: scheme
notation: 004256
scope note: 運営会社: 西日本旅客鉄道。路線名: 北陸線。鉄道区分: 普通鉄道JR（11）。事業者種別: JR在来線（2）。

梶が谷
type: Concept
alternative label: 梶が谷（東急電鉄 田園都市線）
broader: g004257
in scheme: scheme
notation: 004257
scope note: 運営会社: 東急電鉄。路線名: 田園都市線。鉄道区分: 普通鉄道（12）。事業者種別: 民営鉄道（4）。

田野倉
type: Concept
alternative label: 田野倉（富士山麓電気鉄道 大月線）
broader: g004258
in scheme: scheme
notation: 004258
scope note: 運営会社: 富士山麓電気鉄道。路線名: 大月線。鉄道区分: 普通鉄道（12）。事業者種別: 民営鉄道（4）。

雪が谷大塚
type: Concept
alternative label: 雪が谷大塚（東急電鉄 池上線）
broader: g004259
in scheme: scheme
notation: 004259
scope note: 運営会社: 東急電鉄。路線名: 池上線。鉄道区分: 普通鉄道（12）。事業者種別: 民営鉄道（4）。

千葉寺
type: Concept
alternative label: 千葉寺（京成電鉄 千原線）
broader: g004260
in scheme: scheme
notation: 004260
scope note: 運営会社: 京成電鉄。路線名: 千原線。鉄道区分: 普通鉄道（12）。事業者種別: 民営鉄道（4）。

多摩川
type: Concept
alternative label: 多摩川（東急電鉄 東急多摩川線）
broader: g004261
in scheme: scheme
notation: 004261
scope note: 運営会社: 東急電鉄。路線名: 東急多摩川線。鉄道区分: 普通鉄道（12）。事業者種別: 民営鉄道（4）。

多摩川
type: Concept
alternative label: 多摩川（東急電鉄 東横線）
broader: g004261
in scheme: scheme
notation: 004262
scope note: 運営会社: 東急電鉄。路線名: 東横線。鉄道区分: 普通鉄道（12）。事業者種別: 民営鉄道（4）。

柿生
type: Concept
alternative label: 柿生（小田急電鉄 小田原線）
broader: g004263
in scheme: scheme
notation: 004263
scope note: 運営会社: 小田急電鉄。路線名: 小田原線。鉄道区分: 普通鉄道（12）。事業者種別: 民営鉄道（4）。

大森
type: Concept
alternative label: 大森（東日本旅客鉄道 東海道線）
broader: g004264
in scheme: scheme
notation: 004264
scope note: 運営会社: 東日本旅客鉄道。路線名: 東海道線。鉄道区分: 普通鉄道JR（11）。事業者種別: JR在来線（2）。

洲原
type: Concept
alternative label: 洲原（長良川鉄道 越美南線）
broader: g004265
in scheme: scheme
notation: 004265
scope note: 運営会社: 長良川鉄道。路線名: 越美南線。鉄道区分: 普通鉄道（12）。事業者種別: 第三セクター（5）。

玄武洞
type: Concept
alternative label: 玄武洞（西日本旅客鉄道 山陰線）
broader: g004266
in scheme: scheme
notation: 004266
scope note: 運営会社: 西日本旅客鉄道。路線名: 山陰線。鉄道区分: 普通鉄道JR（11）。事業者種別: JR在来線（2）。

田立
type: Concept
alternative label: 田立（東海旅客鉄道 中央線）
broader: g004267
in scheme: scheme
notation: 004267
scope note: 運営会社: 東海旅客鉄道。路線名: 中央線。鉄道区分: 普通鉄道JR（11）。事業者種別: JR在来線（2）。

大森海岸
type: Concept
alternative label: 大森海岸（京浜急行電鉄 本線）
broader: g004268
in scheme: scheme
notation: 004268
scope note: 運営会社: 京浜急行電鉄。路線名: 本線。鉄道区分: 普通鉄道（12）。事業者種別: 民営鉄道（4）。

武蔵新城
type: Concept
alternative label: 武蔵新城（東日本旅客鉄道 南武線）
broader: g004269
in scheme: scheme
notation: 004269
scope note: 運営会社: 東日本旅客鉄道。路線名: 南武線。鉄道区分: 普通鉄道JR（11）。事業者種別: JR在来線（2）。

西馬込
type: Concept
alternative label: 西馬込（東京都 1号線浅草線）
broader: g004270
in scheme: scheme
notation: 004270
scope note: 運営会社: 東京都。路線名: 1号線浅草線。鉄道区分: 普通鉄道（12）。事業者種別: 公営鉄道（3）。

宮崎台
type: Concept
alternative label: 宮崎台（東急電鉄 田園都市線）
broader: g004271
in scheme: scheme
notation: 004271
scope note: 運営会社: 東急電鉄。路線名: 田園都市線。鉄道区分: 普通鉄道（12）。事業者種別: 民営鉄道（4）。

傘松
type: Concept
alternative label: 傘松（丹後海陸交通 天橋立鋼索鉄道）
broader: g004272
in scheme: scheme
notation: 004272
scope note: 運営会社: 丹後海陸交通。路線名: 天橋立鋼索鉄道。鉄道区分: 鋼索鉄道（13）。事業者種別: 民営鉄道（4）。

御嶽山
type: Concept
alternative label: 御嶽山（東急電鉄 池上線）
broader: g004273
in scheme: scheme
notation: 004273
scope note: 運営会社: 東急電鉄。路線名: 池上線。鉄道区分: 普通鉄道（12）。事業者種別: 民営鉄道（4）。

宮前平
type: Concept
alternative label: 宮前平（東急電鉄 田園都市線）
broader: g004274
in scheme: scheme
notation: 004274
scope note: 運営会社: 東急電鉄。路線名: 田園都市線。鉄道区分: 普通鉄道（12）。事業者種別: 民営鉄道（4）。

気山
type: Concept
alternative label: 気山（西日本旅客鉄道 小浜線）
broader: g004275
in scheme: scheme
notation: 004275
scope note: 運営会社: 西日本旅客鉄道。路線名: 小浜線。鉄道区分: 普通鉄道JR（11）。事業者種別: JR在来線（2）。

大森台
type: Concept
alternative label: 大森台（京成電鉄 千原線）
broader: g004276
in scheme: scheme
notation: 004276
scope note: 運営会社: 京成電鉄。路線名: 千原線。鉄道区分: 普通鉄道（12）。事業者種別: 民営鉄道（4）。

府中
type: Concept
alternative label: 府中（丹後海陸交通 天橋立鋼索鉄道）
broader: g004277
in scheme: scheme
notation: 004277
scope note: 運営会社: 丹後海陸交通。路線名: 天橋立鋼索鉄道。鉄道区分: 鋼索鉄道（13）。事業者種別: 民営鉄道（4）。

鶴川
type: Concept
alternative label: 鶴川（小田急電鉄 小田原線）
broader: g004278
in scheme: scheme
notation: 004278
scope note: 運営会社: 小田急電鉄。路線名: 小田原線。鉄道区分: 普通鉄道（12）。事業者種別: 民営鉄道（4）。

沼部
type: Concept
alternative label: 沼部（東急電鉄 東急多摩川線）
broader: g004279
in scheme: scheme
notation: 004279
scope note: 運営会社: 東急電鉄。路線名: 東急多摩川線。鉄道区分: 普通鉄道（12）。事業者種別: 民営鉄道（4）。

日当
type: Concept
alternative label: 日当（樽見鉄道 樽見線）
broader: g004280
in scheme: scheme
notation: 004280
scope note: 運営会社: 樽見鉄道。路線名: 樽見線。鉄道区分: 普通鉄道（12）。事業者種別: 第三セクター（5）。

蘇我
type: Concept
alternative label: 蘇我（東日本旅客鉄道 外房線）
broader: g004281
in scheme: scheme
notation: 004281
scope note: 運営会社: 東日本旅客鉄道。路線名: 外房線。鉄道区分: 普通鉄道JR（11）。事業者種別: JR在来線（2）。

蘇我
type: Concept
alternative label: 蘇我（東日本旅客鉄道 京葉線）
broader: g004281
in scheme: scheme
notation: 004282
scope note: 運営会社: 東日本旅客鉄道。路線名: 京葉線。鉄道区分: 普通鉄道JR（11）。事業者種別: JR在来線（2）。

蘇我
type: Concept
alternative label: 蘇我（東日本旅客鉄道 内房線）
broader: g004281
in scheme: scheme
notation: 004283
scope note: 運営会社: 東日本旅客鉄道。路線名: 内房線。鉄道区分: 普通鉄道JR（11）。事業者種別: JR在来線（2）。

相模原
type: Concept
alternative label: 相模原（東日本旅客鉄道 横浜線）
broader: g004284
in scheme: scheme
notation: 004284
scope note: 運営会社: 東日本旅客鉄道。路線名: 横浜線。鉄道区分: 普通鉄道JR（11）。事業者種別: JR在来線（2）。

流通センター
type: Concept
alternative label: 流通センター（東京モノレール 東京モノレール羽田空港線）
broader: g004285
in scheme: scheme
notation: 004285
scope note: 運営会社: 東京モノレール。路線名: 東京モノレール羽田空港線。鉄道区分: 跨座式鉄道（15）。事業者種別: 民営鉄道（4）。

武蔵中原
type: Concept
alternative label: 武蔵中原（東日本旅客鉄道 南武線）
broader: g004286
in scheme: scheme
notation: 004286
scope note: 運営会社: 東日本旅客鉄道。路線名: 南武線。鉄道区分: 普通鉄道JR（11）。事業者種別: JR在来線（2）。

新丸子
type: Concept
alternative label: 新丸子（東急電鉄 東横線）
broader: g004287
in scheme: scheme
notation: 004287
scope note: 運営会社: 東急電鉄。路線名: 東横線。鉄道区分: 普通鉄道（12）。事業者種別: 民営鉄道（4）。

南橋本
type: Concept
alternative label: 南橋本（東日本旅客鉄道 相模線）
broader: g004288
in scheme: scheme
notation: 004288
scope note: 運営会社: 東日本旅客鉄道。路線名: 相模線。鉄道区分: 普通鉄道JR（11）。事業者種別: JR在来線（2）。

求名
type: Concept
alternative label: 求名（東日本旅客鉄道 東金線）
broader: g004289
in scheme: scheme
notation: 004289
scope note: 運営会社: 東日本旅客鉄道。路線名: 東金線。鉄道区分: 普通鉄道JR（11）。事業者種別: JR在来線（2）。

鷺沼
type: Concept
alternative label: 鷺沼（東急電鉄 田園都市線）
broader: g004290
in scheme: scheme
notation: 004290
scope note: 運営会社: 東急電鉄。路線名: 田園都市線。鉄道区分: 普通鉄道（12）。事業者種別: 民営鉄道（4）。

京丹後大宮
type: Concept
alternative label: 京丹後大宮（WILLER TRAINS 宮津線）
broader: g004291
in scheme: scheme
notation: 004291
scope note: 運営会社: WILLER TRAINS。路線名: 宮津線。鉄道区分: 普通鉄道（12）。事業者種別: 第三セクター（5）。

久が原
type: Concept
alternative label: 久が原（東急電鉄 池上線）
broader: g004292
in scheme: scheme
notation: 004292
scope note: 運営会社: 東急電鉄。路線名: 池上線。鉄道区分: 普通鉄道（12）。事業者種別: 民営鉄道（4）。

白川口
type: Concept
alternative label: 白川口（東海旅客鉄道 高山線）
broader: g004293
in scheme: scheme
notation: 004293
scope note: 運営会社: 東海旅客鉄道。路線名: 高山線。鉄道区分: 普通鉄道JR（11）。事業者種別: JR在来線（2）。

平和島
type: Concept
alternative label: 平和島（京浜急行電鉄 本線）
broader: g004294
in scheme: scheme
notation: 004294
scope note: 運営会社: 京浜急行電鉄。路線名: 本線。鉄道区分: 普通鉄道（12）。事業者種別: 民営鉄道（4）。

山吹
type: Concept
alternative label: 山吹（東海旅客鉄道 飯田線）
broader: g004295
in scheme: scheme
notation: 004295
scope note: 運営会社: 東海旅客鉄道。路線名: 飯田線。鉄道区分: 普通鉄道JR（11）。事業者種別: JR在来線（2）。

たまプラーザ
type: Concept
alternative label: たまプラーザ（東急電鉄 田園都市線）
broader: g004296
in scheme: scheme
notation: 004296
scope note: 運営会社: 東急電鉄。路線名: 田園都市線。鉄道区分: 普通鉄道（12）。事業者種別: 民営鉄道（4）。

武蔵小杉
type: Concept
alternative label: 武蔵小杉（東日本旅客鉄道 南武線）
broader: g004297
in scheme: scheme
notation: 004297
scope note: 運営会社: 東日本旅客鉄道。路線名: 南武線。鉄道区分: 普通鉄道JR（11）。事業者種別: JR在来線（2）。

武蔵小杉
type: Concept
alternative label: 武蔵小杉（東急電鉄 東横線）
broader: g004297
in scheme: scheme
notation: 004298
scope note: 運営会社: 東急電鉄。路線名: 東横線。鉄道区分: 普通鉄道（12）。事業者種別: 民営鉄道（4）。

鵜の木
type: Concept
alternative label: 鵜の木（東急電鉄 東急多摩川線）
broader: g004299
in scheme: scheme
notation: 004299
scope note: 運営会社: 東急電鉄。路線名: 東急多摩川線。鉄道区分: 普通鉄道（12）。事業者種別: 民営鉄道（4）。

禾生
type: Concept
alternative label: 禾生（富士山麓電気鉄道 大月線）
broader: g004300
in scheme: scheme
notation: 004300
scope note: 運営会社: 富士山麓電気鉄道。路線名: 大月線。鉄道区分: 普通鉄道（12）。事業者種別: 民営鉄道（4）。

武蔵小杉
type: Concept
alternative label: 武蔵小杉（東日本旅客鉄道 東海道線）
broader: g004301
in scheme: scheme
notation: 004301
scope note: 運営会社: 東日本旅客鉄道。路線名: 東海道線。鉄道区分: 普通鉄道JR（11）。事業者種別: JR在来線（2）。

坂下
type: Concept
alternative label: 坂下（東海旅客鉄道 中央線）
broader: g004302
in scheme: scheme
notation: 004302
scope note: 運営会社: 東海旅客鉄道。路線名: 中央線。鉄道区分: 普通鉄道JR（11）。事業者種別: JR在来線（2）。

岩美
type: Concept
alternative label: 岩美（西日本旅客鉄道 山陰線）
broader: g004303
in scheme: scheme
notation: 004303
scope note: 運営会社: 西日本旅客鉄道。路線名: 山陰線。鉄道区分: 普通鉄道JR（11）。事業者種別: JR在来線（2）。

矢部
type: Concept
alternative label: 矢部（東日本旅客鉄道 横浜線）
broader: g004304
in scheme: scheme
notation: 004304
scope note: 運営会社: 東日本旅客鉄道。路線名: 横浜線。鉄道区分: 普通鉄道JR（11）。事業者種別: JR在来線（2）。

千鳥町
type: Concept
alternative label: 千鳥町（東急電鉄 池上線）
broader: g004305
in scheme: scheme
notation: 004305
scope note: 運営会社: 東急電鉄。路線名: 池上線。鉄道区分: 普通鉄道（12）。事業者種別: 民営鉄道（4）。

下平
type: Concept
alternative label: 下平（東海旅客鉄道 飯田線）
broader: g004306
in scheme: scheme
notation: 004306
scope note: 運営会社: 東海旅客鉄道。路線名: 飯田線。鉄道区分: 普通鉄道JR（11）。事業者種別: JR在来線（2）。

大森町
type: Concept
alternative label: 大森町（京浜急行電鉄 本線）
broader: g004307
in scheme: scheme
notation: 004307
scope note: 運営会社: 京浜急行電鉄。路線名: 本線。鉄道区分: 普通鉄道（12）。事業者種別: 民営鉄道（4）。

向河原
type: Concept
alternative label: 向河原（東日本旅客鉄道 南武線）
broader: g004308
in scheme: scheme
notation: 004308
scope note: 運営会社: 東日本旅客鉄道。路線名: 南武線。鉄道区分: 普通鉄道JR（11）。事業者種別: JR在来線（2）。

池上
type: Concept
alternative label: 池上（東急電鉄 池上線）
broader: g004309
in scheme: scheme
notation: 004309
scope note: 運営会社: 東急電鉄。路線名: 池上線。鉄道区分: 普通鉄道（12）。事業者種別: 民営鉄道（4）。

下丸子
type: Concept
alternative label: 下丸子（東急電鉄 東急多摩川線）
broader: g004310
in scheme: scheme
notation: 004310
scope note: 運営会社: 東急電鉄。路線名: 東急多摩川線。鉄道区分: 普通鉄道（12）。事業者種別: 民営鉄道（4）。

湯の洞温泉口
type: Concept
alternative label: 湯の洞温泉口（長良川鉄道 越美南線）
broader: g004311
in scheme: scheme
notation: 004311
scope note: 運営会社: 長良川鉄道。路線名: 越美南線。鉄道区分: 普通鉄道（12）。事業者種別: 第三セクター（5）。

昭和島
type: Concept
alternative label: 昭和島（東京モノレール 東京モノレール羽田空港線）
broader: g004312
in scheme: scheme
notation: 004312
scope note: 運営会社: 東京モノレール。路線名: 東京モノレール羽田空港線。鉄道区分: 跨座式鉄道（15）。事業者種別: 民営鉄道（4）。

甲斐上野
type: Concept
alternative label: 甲斐上野（東海旅客鉄道 身延線）
broader: g004313
in scheme: scheme
notation: 004313
scope note: 運営会社: 東海旅客鉄道。路線名: 身延線。鉄道区分: 普通鉄道JR（11）。事業者種別: JR在来線（2）。

あざみ野
type: Concept
alternative label: あざみ野（東急電鉄 田園都市線）
broader: g004314
in scheme: scheme
notation: 004314
scope note: 運営会社: 東急電鉄。路線名: 田園都市線。鉄道区分: 普通鉄道（12）。事業者種別: 民営鉄道（4）。

淵野辺
type: Concept
alternative label: 淵野辺（東日本旅客鉄道 横浜線）
broader: g004315
in scheme: scheme
notation: 004315
scope note: 運営会社: 東日本旅客鉄道。路線名: 横浜線。鉄道区分: 普通鉄道JR（11）。事業者種別: JR在来線（2）。

あざみ野
type: Concept
alternative label: あざみ野（横浜市 3号線）
broader: g004314
in scheme: scheme
notation: 004316
scope note: 運営会社: 横浜市。路線名: 3号線。鉄道区分: 普通鉄道（12）。事業者種別: 公営鉄道（3）。

武蔵新田
type: Concept
alternative label: 武蔵新田（東急電鉄 東急多摩川線）
broader: g004317
in scheme: scheme
notation: 004317
scope note: 運営会社: 東急電鉄。路線名: 東急多摩川線。鉄道区分: 普通鉄道（12）。事業者種別: 民営鉄道（4）。

大岩
type: Concept
alternative label: 大岩（西日本旅客鉄道 山陰線）
broader: g004318
in scheme: scheme
notation: 004318
scope note: 運営会社: 西日本旅客鉄道。路線名: 山陰線。鉄道区分: 普通鉄道JR（11）。事業者種別: JR在来線（2）。

梅屋敷
type: Concept
alternative label: 梅屋敷（京浜急行電鉄 本線）
broader: g004319
in scheme: scheme
notation: 004319
scope note: 運営会社: 京浜急行電鉄。路線名: 本線。鉄道区分: 普通鉄道（12）。事業者種別: 民営鉄道（4）。

赤坂
type: Concept
alternative label: 赤坂（富士山麓電気鉄道 大月線）
broader: g004320
in scheme: scheme
notation: 004320
scope note: 運営会社: 富士山麓電気鉄道。路線名: 大月線。鉄道区分: 普通鉄道（12）。事業者種別: 民営鉄道（4）。

鍋原
type: Concept
alternative label: 鍋原（樽見鉄道 樽見線）
broader: g004321
in scheme: scheme
notation: 004321
scope note: 運営会社: 樽見鉄道。路線名: 樽見線。鉄道区分: 普通鉄道（12）。事業者種別: 第三セクター（5）。

元住吉
type: Concept
alternative label: 元住吉（東急電鉄 東横線）
broader: g004322
in scheme: scheme
notation: 004322
scope note: 運営会社: 東急電鉄。路線名: 東横線。鉄道区分: 普通鉄道（12）。事業者種別: 民営鉄道（4）。

蓮沼
type: Concept
alternative label: 蓮沼（東急電鉄 池上線）
broader: g004323
in scheme: scheme
notation: 004323
scope note: 運営会社: 東急電鉄。路線名: 池上線。鉄道区分: 普通鉄道（12）。事業者種別: 民営鉄道（4）。

玉川学園前
type: Concept
alternative label: 玉川学園前（小田急電鉄 小田原線）
broader: g004324
in scheme: scheme
notation: 004324
scope note: 運営会社: 小田急電鉄。路線名: 小田原線。鉄道区分: 普通鉄道（12）。事業者種別: 民営鉄道（4）。

中川
type: Concept
alternative label: 中川（横浜市 3号線）
broader: g004325
in scheme: scheme
notation: 004325
scope note: 運営会社: 横浜市。路線名: 3号線。鉄道区分: 普通鉄道（12）。事業者種別: 公営鉄道（3）。

芦川
type: Concept
alternative label: 芦川（東海旅客鉄道 身延線）
broader: g004326
in scheme: scheme
notation: 004326
scope note: 運営会社: 東海旅客鉄道。路線名: 身延線。鉄道区分: 普通鉄道JR（11）。事業者種別: JR在来線（2）。

鎌取
type: Concept
alternative label: 鎌取（東日本旅客鉄道 外房線）
broader: g004327
in scheme: scheme
notation: 004327
scope note: 運営会社: 東日本旅客鉄道。路線名: 外房線。鉄道区分: 普通鉄道JR（11）。事業者種別: JR在来線（2）。

蒲田
type: Concept
alternative label: 蒲田（東日本旅客鉄道 東海道線）
broader: g004330
in scheme: scheme
notation: 004328
scope note: 運営会社: 東日本旅客鉄道。路線名: 東海道線。鉄道区分: 普通鉄道JR（11）。事業者種別: JR在来線（2）。

矢口渡
type: Concept
alternative label: 矢口渡（東急電鉄 東急多摩川線）
broader: g004329
in scheme: scheme
notation: 004329
scope note: 運営会社: 東急電鉄。路線名: 東急多摩川線。鉄道区分: 普通鉄道（12）。事業者種別: 民営鉄道（4）。

蒲田
type: Concept
alternative label: 蒲田（東急電鉄 池上線）
broader: g004330
in scheme: scheme
notation: 004330
scope note: 運営会社: 東急電鉄。路線名: 池上線。鉄道区分: 普通鉄道（12）。事業者種別: 民営鉄道（4）。

京急蒲田
type: Concept
alternative label: 京急蒲田（京浜急行電鉄 空港線）
broader: g004331
in scheme: scheme
notation: 004331
scope note: 運営会社: 京浜急行電鉄。路線名: 空港線。鉄道区分: 普通鉄道（12）。事業者種別: 民営鉄道（4）。

京急蒲田
type: Concept
alternative label: 京急蒲田（京浜急行電鉄 本線）
broader: g004331
in scheme: scheme
notation: 004332
scope note: 運営会社: 京浜急行電鉄。路線名: 本線。鉄道区分: 普通鉄道（12）。事業者種別: 民営鉄道（4）。

蒲田
type: Concept
alternative label: 蒲田（東急電鉄 東急多摩川線）
broader: g004330
in scheme: scheme
notation: 004333
scope note: 運営会社: 東急電鉄。路線名: 東急多摩川線。鉄道区分: 普通鉄道（12）。事業者種別: 民営鉄道（4）。

北山田
type: Concept
alternative label: 北山田（横浜市 4号線）
broader: g004334
in scheme: scheme
notation: 004334
scope note: 運営会社: 横浜市。路線名: 4号線。鉄道区分: 普通鉄道（12）。事業者種別: 公営鉄道（3）。

市川本町
type: Concept
alternative label: 市川本町（東海旅客鉄道 身延線）
broader: g004335
in scheme: scheme
notation: 004335
scope note: 運営会社: 東海旅客鉄道。路線名: 身延線。鉄道区分: 普通鉄道JR（11）。事業者種別: JR在来線（2）。

平間
type: Concept
alternative label: 平間（東日本旅客鉄道 南武線）
broader: g004336
in scheme: scheme
notation: 004336
scope note: 運営会社: 東日本旅客鉄道。路線名: 南武線。鉄道区分: 普通鉄道JR（11）。事業者種別: JR在来線（2）。

市川大門
type: Concept
alternative label: 市川大門（東海旅客鉄道 身延線）
broader: g004337
in scheme: scheme
notation: 004337
scope note: 運営会社: 東海旅客鉄道。路線名: 身延線。鉄道区分: 普通鉄道JR（11）。事業者種別: JR在来線（2）。

学園前
type: Concept
alternative label: 学園前（京成電鉄 千原線）
broader: g004338
in scheme: scheme
notation: 004338
scope note: 運営会社: 京成電鉄。路線名: 千原線。鉄道区分: 普通鉄道（12）。事業者種別: 民営鉄道（4）。

東金
type: Concept
alternative label: 東金（東日本旅客鉄道 東金線）
broader: g004339
in scheme: scheme
notation: 004339
scope note: 運営会社: 東日本旅客鉄道。路線名: 東金線。鉄道区分: 普通鉄道JR（11）。事業者種別: JR在来線（2）。

江田
type: Concept
alternative label: 江田（東急電鉄 田園都市線）
broader: g004340
in scheme: scheme
notation: 004340
scope note: 運営会社: 東急電鉄。路線名: 田園都市線。鉄道区分: 普通鉄道（12）。事業者種別: 民営鉄道（4）。

こどもの国
type: Concept
alternative label: こどもの国（東急電鉄 こどもの国線）
broader: g004341
in scheme: scheme
notation: 004341
scope note: 運営会社: 東急電鉄。路線名: こどもの国線。鉄道区分: 普通鉄道（12）。事業者種別: 民営鉄道（4）。

上溝
type: Concept
alternative label: 上溝（東日本旅客鉄道 相模線）
broader: g004342
in scheme: scheme
notation: 004342
scope note: 運営会社: 東日本旅客鉄道。路線名: 相模線。鉄道区分: 普通鉄道JR（11）。事業者種別: JR在来線（2）。

天橋立
type: Concept
alternative label: 天橋立（WILLER TRAINS 宮津線）
broader: g004343
in scheme: scheme
notation: 004343
scope note: 運営会社: WILLER TRAINS。路線名: 宮津線。鉄道区分: 普通鉄道（12）。事業者種別: 第三セクター（5）。

都留市
type: Concept
alternative label: 都留市（富士山麓電気鉄道 大月線）
broader: g004344
in scheme: scheme
notation: 004344
scope note: 運営会社: 富士山麓電気鉄道。路線名: 大月線。鉄道区分: 普通鉄道（12）。事業者種別: 民営鉄道（4）。

古淵
type: Concept
alternative label: 古淵（東日本旅客鉄道 横浜線）
broader: g004345
in scheme: scheme
notation: 004345
scope note: 運営会社: 東日本旅客鉄道。路線名: 横浜線。鉄道区分: 普通鉄道JR（11）。事業者種別: JR在来線（2）。

高科
type: Concept
alternative label: 高科（樽見鉄道 樽見線）
broader: g004346
in scheme: scheme
notation: 004346
scope note: 運営会社: 樽見鉄道。路線名: 樽見線。鉄道区分: 普通鉄道（12）。事業者種別: 第三セクター（5）。

三方
type: Concept
alternative label: 三方（西日本旅客鉄道 小浜線）
broader: g004347
in scheme: scheme
notation: 004347
scope note: 運営会社: 西日本旅客鉄道。路線名: 小浜線。鉄道区分: 普通鉄道JR（11）。事業者種別: JR在来線（2）。

整備場
type: Concept
alternative label: 整備場（東京モノレール 東京モノレール羽田空港線）
broader: g004348
in scheme: scheme
notation: 004348
scope note: 運営会社: 東京モノレール。路線名: 東京モノレール羽田空港線。鉄道区分: 跨座式鉄道（15）。事業者種別: 民営鉄道（4）。

糀谷
type: Concept
alternative label: 糀谷（京浜急行電鉄 空港線）
broader: g004349
in scheme: scheme
notation: 004349
scope note: 運営会社: 京浜急行電鉄。路線名: 空港線。鉄道区分: 普通鉄道（12）。事業者種別: 民営鉄道（4）。

東山田
type: Concept
alternative label: 東山田（横浜市 4号線）
broader: g004350
in scheme: scheme
notation: 004350
scope note: 運営会社: 横浜市。路線名: 4号線。鉄道区分: 普通鉄道（12）。事業者種別: 公営鉄道（3）。

日吉
type: Concept
alternative label: 日吉（東急電鉄 東横線）
broader: g004351
in scheme: scheme
notation: 004351
scope note: 運営会社: 東急電鉄。路線名: 東横線。鉄道区分: 普通鉄道（12）。事業者種別: 民営鉄道（4）。

日吉
type: Concept
alternative label: 日吉（横浜市 4号線）
broader: g004351
in scheme: scheme
notation: 004352
scope note: 運営会社: 横浜市。路線名: 4号線。鉄道区分: 普通鉄道（12）。事業者種別: 公営鉄道（3）。

センター北
type: Concept
alternative label: センター北（横浜市 3号線）
broader: g004353
in scheme: scheme
notation: 004353
scope note: 運営会社: 横浜市。路線名: 3号線。鉄道区分: 普通鉄道（12）。事業者種別: 公営鉄道（3）。

センター北
type: Concept
alternative label: センター北（横浜市 4号線）
broader: g004353
in scheme: scheme
notation: 004354
scope note: 運営会社: 横浜市。路線名: 4号線。鉄道区分: 普通鉄道（12）。事業者種別: 公営鉄道（3）。

コウノトリの郷
type: Concept
alternative label: コウノトリの郷（WILLER TRAINS 宮津線）
broader: g004355
in scheme: scheme
notation: 004355
scope note: 運営会社: WILLER TRAINS。路線名: 宮津線。鉄道区分: 普通鉄道（12）。事業者種別: 第三セクター（5）。

大鳥居
type: Concept
alternative label: 大鳥居（京浜急行電鉄 空港線）
broader: g004356
in scheme: scheme
notation: 004356
scope note: 運営会社: 京浜急行電鉄。路線名: 空港線。鉄道区分: 普通鉄道（12）。事業者種別: 民営鉄道（4）。

浜野
type: Concept
alternative label: 浜野（東日本旅客鉄道 内房線）
broader: g004357
in scheme: scheme
notation: 004357
scope note: 運営会社: 東日本旅客鉄道。路線名: 内房線。鉄道区分: 普通鉄道JR（11）。事業者種別: JR在来線（2）。

新川崎
type: Concept
alternative label: 新川崎（東日本旅客鉄道 東海道線）
broader: g004358
in scheme: scheme
notation: 004358
scope note: 運営会社: 東日本旅客鉄道。路線名: 東海道線。鉄道区分: 普通鉄道JR（11）。事業者種別: JR在来線（2）。

鹿島田
type: Concept
alternative label: 鹿島田（東日本旅客鉄道 南武線）
broader: g004359
in scheme: scheme
notation: 004359
scope note: 運営会社: 東日本旅客鉄道。路線名: 南武線。鉄道区分: 普通鉄道JR（11）。事業者種別: JR在来線（2）。

市が尾
type: Concept
alternative label: 市が尾（東急電鉄 田園都市線）
broader: g004360
in scheme: scheme
notation: 004360
scope note: 運営会社: 東急電鉄。路線名: 田園都市線。鉄道区分: 普通鉄道（12）。事業者種別: 民営鉄道（4）。

羽田空港第2ターミナル
type: Concept
alternative label: 羽田空港第2ターミナル（東京モノレール 東京モノレール羽田空港線）
broader: g004361
in scheme: scheme
notation: 004361
scope note: 運営会社: 東京モノレール。路線名: 東京モノレール羽田空港線。鉄道区分: 跨座式鉄道（15）。事業者種別: 民営鉄道（4）。

谷村町
type: Concept
alternative label: 谷村町（富士山麓電気鉄道 大月線）
broader: g004362
in scheme: scheme
notation: 004362
scope note: 運営会社: 富士山麓電気鉄道。路線名: 大月線。鉄道区分: 普通鉄道（12）。事業者種別: 民営鉄道（4）。

岩滝口
type: Concept
alternative label: 岩滝口（WILLER TRAINS 宮津線）
broader: g004363
in scheme: scheme
notation: 004363
scope note: 運営会社: WILLER TRAINS。路線名: 宮津線。鉄道区分: 普通鉄道（12）。事業者種別: 第三セクター（5）。

穴守稲荷
type: Concept
alternative label: 穴守稲荷（京浜急行電鉄 空港線）
broader: g004364
in scheme: scheme
notation: 004364
scope note: 運営会社: 京浜急行電鉄。路線名: 空港線。鉄道区分: 普通鉄道（12）。事業者種別: 民営鉄道（4）。

おゆみ野
type: Concept
alternative label: おゆみ野（京成電鉄 千原線）
broader: g004365
in scheme: scheme
notation: 004365
scope note: 運営会社: 京成電鉄。路線名: 千原線。鉄道区分: 普通鉄道（12）。事業者種別: 民営鉄道（4）。

日吉本町
type: Concept
alternative label: 日吉本町（横浜市 4号線）
broader: g004366
in scheme: scheme
notation: 004366
scope note: 運営会社: 横浜市。路線名: 4号線。鉄道区分: 普通鉄道（12）。事業者種別: 公営鉄道（3）。

雑色
type: Concept
alternative label: 雑色（京浜急行電鉄 本線）
broader: g004367
in scheme: scheme
notation: 004367
scope note: 運営会社: 京浜急行電鉄。路線名: 本線。鉄道区分: 普通鉄道（12）。事業者種別: 民営鉄道（4）。

羽田空港第1・第2ターミナル
type: Concept
alternative label: 羽田空港第1・第2ターミナル（京浜急行電鉄 空港線）
broader: g004368
in scheme: scheme
notation: 004368
scope note: 運営会社: 京浜急行電鉄。路線名: 空港線。鉄道区分: 普通鉄道（12）。事業者種別: 民営鉄道（4）。

梅山
type: Concept
alternative label: 梅山（長良川鉄道 越美南線）
broader: g004369
in scheme: scheme
notation: 004369
scope note: 運営会社: 長良川鉄道。路線名: 越美南線。鉄道区分: 普通鉄道（12）。事業者種別: 第三セクター（5）。

高田
type: Concept
alternative label: 高田（横浜市 4号線）
broader: g004370
in scheme: scheme
notation: 004370
scope note: 運営会社: 横浜市。路線名: 4号線。鉄道区分: 普通鉄道（12）。事業者種別: 公営鉄道（3）。

市田
type: Concept
alternative label: 市田（東海旅客鉄道 飯田線）
broader: g004371
in scheme: scheme
notation: 004371
scope note: 運営会社: 東海旅客鉄道。路線名: 飯田線。鉄道区分: 普通鉄道JR（11）。事業者種別: JR在来線（2）。

羽田空港第1ターミナル
type: Concept
alternative label: 羽田空港第1ターミナル（東京モノレール 東京モノレール羽田空港線）
broader: g004372
in scheme: scheme
notation: 004372
scope note: 運営会社: 東京モノレール。路線名: 東京モノレール羽田空港線。鉄道区分: 跨座式鉄道（15）。事業者種別: 民営鉄道（4）。

天空橋
type: Concept
alternative label: 天空橋（東京モノレール 東京モノレール羽田空港線）
broader: g004373
in scheme: scheme
notation: 004373
scope note: 運営会社: 東京モノレール。路線名: 東京モノレール羽田空港線。鉄道区分: 跨座式鉄道（15）。事業者種別: 民営鉄道（4）。

天空橋
type: Concept
alternative label: 天空橋（京浜急行電鉄 空港線）
broader: g004373
in scheme: scheme
notation: 004374
scope note: 運営会社: 京浜急行電鉄。路線名: 空港線。鉄道区分: 普通鉄道（12）。事業者種別: 民営鉄道（4）。

誉田
type: Concept
alternative label: 誉田（東日本旅客鉄道 外房線）
broader: g004375
in scheme: scheme
notation: 004375
scope note: 運営会社: 東日本旅客鉄道。路線名: 外房線。鉄道区分: 普通鉄道JR（11）。事業者種別: JR在来線（2）。

福俵
type: Concept
alternative label: 福俵（東日本旅客鉄道 東金線）
broader: g004376
in scheme: scheme
notation: 004376
scope note: 運営会社: 東日本旅客鉄道。路線名: 東金線。鉄道区分: 普通鉄道JR（11）。事業者種別: JR在来線（2）。

恩田
type: Concept
alternative label: 恩田（東急電鉄 こどもの国線）
broader: g004377
in scheme: scheme
notation: 004377
scope note: 運営会社: 東急電鉄。路線名: こどもの国線。鉄道区分: 普通鉄道（12）。事業者種別: 民営鉄道（4）。

福部
type: Concept
alternative label: 福部（西日本旅客鉄道 山陰線）
broader: g004378
in scheme: scheme
notation: 004378
scope note: 運営会社: 西日本旅客鉄道。路線名: 山陰線。鉄道区分: 普通鉄道JR（11）。事業者種別: JR在来線（2）。

番田
type: Concept
alternative label: 番田（東日本旅客鉄道 相模線）
broader: g004379
in scheme: scheme
notation: 004379
scope note: 運営会社: 東日本旅客鉄道。路線名: 相模線。鉄道区分: 普通鉄道JR（11）。事業者種別: JR在来線（2）。

センター南
type: Concept
alternative label: センター南（横浜市 3号線）
broader: g004380
in scheme: scheme
notation: 004380
scope note: 運営会社: 横浜市。路線名: 3号線。鉄道区分: 普通鉄道（12）。事業者種別: 公営鉄道（3）。

センター南
type: Concept
alternative label: センター南（横浜市 4号線）
broader: g004380
in scheme: scheme
notation: 004381
scope note: 運営会社: 横浜市。路線名: 4号線。鉄道区分: 普通鉄道（12）。事業者種別: 公営鉄道（3）。

羽田空港第3ターミナル
type: Concept
alternative label: 羽田空港第3ターミナル（京浜急行電鉄 空港線）
broader: g004382
in scheme: scheme
notation: 004382
scope note: 運営会社: 京浜急行電鉄。路線名: 空港線。鉄道区分: 普通鉄道（12）。事業者種別: 民営鉄道（4）。

豊岡
type: Concept
alternative label: 豊岡（WILLER TRAINS 宮津線）
broader: g004383
in scheme: scheme
notation: 004383
scope note: 運営会社: WILLER TRAINS。路線名: 宮津線。鉄道区分: 普通鉄道（12）。事業者種別: 第三セクター（5）。

境港
type: Concept
alternative label: 境港（西日本旅客鉄道 境線）
broader: g004384
in scheme: scheme
notation: 004384
scope note: 運営会社: 西日本旅客鉄道。路線名: 境線。鉄道区分: 普通鉄道JR（11）。事業者種別: JR在来線（2）。

下市田
type: Concept
alternative label: 下市田（東海旅客鉄道 飯田線）
broader: g004385
in scheme: scheme
notation: 004385
scope note: 運営会社: 東海旅客鉄道。路線名: 飯田線。鉄道区分: 普通鉄道JR（11）。事業者種別: JR在来線（2）。

豊岡
type: Concept
alternative label: 豊岡（西日本旅客鉄道 山陰線）
broader: g004383
in scheme: scheme
notation: 004386
scope note: 運営会社: 西日本旅客鉄道。路線名: 山陰線。鉄道区分: 普通鉄道JR（11）。事業者種別: JR在来線（2）。

町田
type: Concept
alternative label: 町田（小田急電鉄 小田原線）
broader: g004387
in scheme: scheme
notation: 004387
scope note: 運営会社: 小田急電鉄。路線名: 小田原線。鉄道区分: 普通鉄道（12）。事業者種別: 民営鉄道（4）。

羽田空港第3ターミナル
type: Concept
alternative label: 羽田空港第3ターミナル（東京モノレール 東京モノレール羽田空港線）
broader: g004382
in scheme: scheme
notation: 004388
scope note: 運営会社: 東京モノレール。路線名: 東京モノレール羽田空港線。鉄道区分: 跨座式鉄道（15）。事業者種別: 民営鉄道（4）。

栗田
type: Concept
alternative label: 栗田（WILLER TRAINS 宮津線）
broader: g004389
in scheme: scheme
notation: 004389
scope note: 運営会社: WILLER TRAINS。路線名: 宮津線。鉄道区分: 普通鉄道（12）。事業者種別: 第三セクター（5）。

与謝野
type: Concept
alternative label: 与謝野（WILLER TRAINS 宮津線）
broader: g004390
in scheme: scheme
notation: 004390
scope note: 運営会社: WILLER TRAINS。路線名: 宮津線。鉄道区分: 普通鉄道（12）。事業者種別: 第三セクター（5）。

藤が丘
type: Concept
alternative label: 藤が丘（東急電鉄 田園都市線）
broader: g004391
in scheme: scheme
notation: 004391
scope note: 運営会社: 東急電鉄。路線名: 田園都市線。鉄道区分: 普通鉄道（12）。事業者種別: 民営鉄道（4）。

青葉台
type: Concept
alternative label: 青葉台（東急電鉄 田園都市線）
broader: g004392
in scheme: scheme
notation: 004392
scope note: 運営会社: 東急電鉄。路線名: 田園都市線。鉄道区分: 普通鉄道（12）。事業者種別: 民営鉄道（4）。

新整備場
type: Concept
alternative label: 新整備場（東京モノレール 東京モノレール羽田空港線）
broader: g004393
in scheme: scheme
notation: 004393
scope note: 運営会社: 東京モノレール。路線名: 東京モノレール羽田空港線。鉄道区分: 跨座式鉄道（15）。事業者種別: 民営鉄道（4）。

神海
type: Concept
alternative label: 神海（樽見鉄道 樽見線）
broader: g004394
in scheme: scheme
notation: 004394
scope note: 運営会社: 樽見鉄道。路線名: 樽見線。鉄道区分: 普通鉄道（12）。事業者種別: 第三セクター（5）。

都留文科大学前
type: Concept
alternative label: 都留文科大学前（富士山麓電気鉄道 大月線）
broader: g004395
in scheme: scheme
notation: 004395
scope note: 運営会社: 富士山麓電気鉄道。路線名: 大月線。鉄道区分: 普通鉄道（12）。事業者種別: 民営鉄道（4）。

町田
type: Concept
alternative label: 町田（東日本旅客鉄道 横浜線）
broader: g004387
in scheme: scheme
notation: 004396
scope note: 運営会社: 東日本旅客鉄道。路線名: 横浜線。鉄道区分: 普通鉄道JR（11）。事業者種別: JR在来線（2）。

鰍沢口
type: Concept
alternative label: 鰍沢口（東海旅客鉄道 身延線）
broader: g004397
in scheme: scheme
notation: 004397
scope note: 運営会社: 東海旅客鉄道。路線名: 身延線。鉄道区分: 普通鉄道JR（11）。事業者種別: JR在来線（2）。

上麻生
type: Concept
alternative label: 上麻生（東海旅客鉄道 高山線）
broader: g004398
in scheme: scheme
notation: 004398
scope note: 運営会社: 東海旅客鉄道。路線名: 高山線。鉄道区分: 普通鉄道JR（11）。事業者種別: JR在来線（2）。

六郷土手
type: Concept
alternative label: 六郷土手（京浜急行電鉄 本線）
broader: g004399
in scheme: scheme
notation: 004399
scope note: 運営会社: 京浜急行電鉄。路線名: 本線。鉄道区分: 普通鉄道（12）。事業者種別: 民営鉄道（4）。

近江塩津
type: Concept
alternative label: 近江塩津（西日本旅客鉄道 湖西線）
broader: g004400
in scheme: scheme
notation: 004400
scope note: 運営会社: 西日本旅客鉄道。路線名: 湖西線。鉄道区分: 普通鉄道JR（11）。事業者種別: JR在来線（2）。

近江塩津
type: Concept
alternative label: 近江塩津（西日本旅客鉄道 北陸線）
broader: g004400
in scheme: scheme
notation: 004401
scope note: 運営会社: 西日本旅客鉄道。路線名: 北陸線。鉄道区分: 普通鉄道JR（11）。事業者種別: JR在来線（2）。

美濃市
type: Concept
alternative label: 美濃市（長良川鉄道 越美南線）
broader: g004402
in scheme: scheme
notation: 004402
scope note: 運営会社: 長良川鉄道。路線名: 越美南線。鉄道区分: 普通鉄道（12）。事業者種別: 第三セクター（5）。

矢向
type: Concept
alternative label: 矢向（東日本旅客鉄道 南武線）
broader: g004403
in scheme: scheme
notation: 004403
scope note: 運営会社: 東日本旅客鉄道。路線名: 南武線。鉄道区分: 普通鉄道JR（11）。事業者種別: JR在来線（2）。

十日市場
type: Concept
alternative label: 十日市場（富士山麓電気鉄道 大月線）
broader: g004404
in scheme: scheme
notation: 004404
scope note: 運営会社: 富士山麓電気鉄道。路線名: 大月線。鉄道区分: 普通鉄道（12）。事業者種別: 民営鉄道（4）。

馬場崎町
type: Concept
alternative label: 馬場崎町（西日本旅客鉄道 境線）
broader: g004405
in scheme: scheme
notation: 004405
scope note: 運営会社: 西日本旅客鉄道。路線名: 境線。鉄道区分: 普通鉄道JR（11）。事業者種別: JR在来線（2）。

綱島
type: Concept
alternative label: 綱島（東急電鉄 東横線）
broader: g004406
in scheme: scheme
notation: 004406
scope note: 運営会社: 東急電鉄。路線名: 東横線。鉄道区分: 普通鉄道（12）。事業者種別: 民営鉄道（4）。

大師橋
type: Concept
alternative label: 大師橋（京浜急行電鉄 大師線）
broader: g004407
in scheme: scheme
notation: 004407
scope note: 運営会社: 京浜急行電鉄。路線名: 大師線。鉄道区分: 普通鉄道（12）。事業者種別: 民営鉄道（4）。

東門前
type: Concept
alternative label: 東門前（京浜急行電鉄 大師線）
broader: g004408
in scheme: scheme
notation: 004408
scope note: 運営会社: 京浜急行電鉄。路線名: 大師線。鉄道区分: 普通鉄道（12）。事業者種別: 民営鉄道（4）。

都筑ふれあいの丘
type: Concept
alternative label: 都筑ふれあいの丘（横浜市 4号線）
broader: g004409
in scheme: scheme
notation: 004409
scope note: 運営会社: 横浜市。路線名: 4号線。鉄道区分: 普通鉄道（12）。事業者種別: 公営鉄道（3）。

東桂
type: Concept
alternative label: 東桂（富士山麓電気鉄道 大月線）
broader: g004410
in scheme: scheme
notation: 004410
scope note: 運営会社: 富士山麓電気鉄道。路線名: 大月線。鉄道区分: 普通鉄道（12）。事業者種別: 民営鉄道（4）。

八幡宿
type: Concept
alternative label: 八幡宿（東日本旅客鉄道 内房線）
broader: g004411
in scheme: scheme
notation: 004411
scope note: 運営会社: 東日本旅客鉄道。路線名: 内房線。鉄道区分: 普通鉄道JR（11）。事業者種別: JR在来線（2）。

田奈
type: Concept
alternative label: 田奈（東急電鉄 田園都市線）
broader: g004412
in scheme: scheme
notation: 004412
scope note: 運営会社: 東急電鉄。路線名: 田園都市線。鉄道区分: 普通鉄道（12）。事業者種別: 民営鉄道（4）。

川崎大師
type: Concept
alternative label: 川崎大師（京浜急行電鉄 大師線）
broader: g004413
in scheme: scheme
notation: 004413
scope note: 運営会社: 京浜急行電鉄。路線名: 大師線。鉄道区分: 普通鉄道（12）。事業者種別: 民営鉄道（4）。

成瀬
type: Concept
alternative label: 成瀬（東日本旅客鉄道 横浜線）
broader: g004414
in scheme: scheme
notation: 004414
scope note: 運営会社: 東日本旅客鉄道。路線名: 横浜線。鉄道区分: 普通鉄道JR（11）。事業者種別: JR在来線（2）。

鈴木町
type: Concept
alternative label: 鈴木町（京浜急行電鉄 大師線）
broader: g004415
in scheme: scheme
notation: 004415
scope note: 運営会社: 京浜急行電鉄。路線名: 大師線。鉄道区分: 普通鉄道（12）。事業者種別: 民営鉄道（4）。

仲町台
type: Concept
alternative label: 仲町台（横浜市 3号線）
broader: g004416
in scheme: scheme
notation: 004416
scope note: 運営会社: 横浜市。路線名: 3号線。鉄道区分: 普通鉄道（12）。事業者種別: 公営鉄道（3）。

港町
type: Concept
alternative label: 港町（京浜急行電鉄 大師線）
broader: g004417
in scheme: scheme
notation: 004417
scope note: 運営会社: 京浜急行電鉄。路線名: 大師線。鉄道区分: 普通鉄道（12）。事業者種別: 民営鉄道（4）。

小島新田
type: Concept
alternative label: 小島新田（京浜急行電鉄 大師線）
broader: g004418
in scheme: scheme
notation: 004418
scope note: 運営会社: 京浜急行電鉄。路線名: 大師線。鉄道区分: 普通鉄道（12）。事業者種別: 民営鉄道（4）。

宮津
type: Concept
alternative label: 宮津（WILLER TRAINS 宮津線）
broader: g004419
in scheme: scheme
notation: 004419
scope note: 運営会社: WILLER TRAINS。路線名: 宮津線。鉄道区分: 普通鉄道（12）。事業者種別: 第三セクター（5）。

宮津
type: Concept
alternative label: 宮津（WILLER TRAINS 宮福線）
broader: g004419
in scheme: scheme
notation: 004420
scope note: 運営会社: WILLER TRAINS。路線名: 宮福線。鉄道区分: 普通鉄道（12）。事業者種別: 第三セクター（5）。

余呉
type: Concept
alternative label: 余呉（西日本旅客鉄道 北陸線）
broader: g004421
in scheme: scheme
notation: 004421
scope note: 運営会社: 西日本旅客鉄道。路線名: 北陸線。鉄道区分: 普通鉄道JR（11）。事業者種別: JR在来線（2）。

元善光寺
type: Concept
alternative label: 元善光寺（東海旅客鉄道 飯田線）
broader: g004422
in scheme: scheme
notation: 004422
scope note: 運営会社: 東海旅客鉄道。路線名: 飯田線。鉄道区分: 普通鉄道JR（11）。事業者種別: JR在来線（2）。

ちはら台
type: Concept
alternative label: ちはら台（京成電鉄 千原線）
broader: g004423
in scheme: scheme
notation: 004423
scope note: 運営会社: 京成電鉄。路線名: 千原線。鉄道区分: 普通鉄道（12）。事業者種別: 民営鉄道（4）。

京急川崎
type: Concept
alternative label: 京急川崎（京浜急行電鉄 大師線）
broader: g004424
in scheme: scheme
notation: 004424
scope note: 運営会社: 京浜急行電鉄。路線名: 大師線。鉄道区分: 普通鉄道（12）。事業者種別: 民営鉄道（4）。

京急川崎
type: Concept
alternative label: 京急川崎（京浜急行電鉄 本線）
broader: g004424
in scheme: scheme
notation: 004425
scope note: 運営会社: 京浜急行電鉄。路線名: 本線。鉄道区分: 普通鉄道（12）。事業者種別: 民営鉄道（4）。

相模大野
type: Concept
alternative label: 相模大野（小田急電鉄 江ノ島線）
broader: g004426
in scheme: scheme
notation: 004426
scope note: 運営会社: 小田急電鉄。路線名: 江ノ島線。鉄道区分: 普通鉄道（12）。事業者種別: 民営鉄道（4）。

相模大野
type: Concept
alternative label: 相模大野（小田急電鉄 小田原線）
broader: g004426
in scheme: scheme
notation: 004427
scope note: 運営会社: 小田急電鉄。路線名: 小田原線。鉄道区分: 普通鉄道（12）。事業者種別: 民営鉄道（4）。

藤井
type: Concept
alternative label: 藤井（西日本旅客鉄道 小浜線）
broader: g004428
in scheme: scheme
notation: 004428
scope note: 運営会社: 西日本旅客鉄道。路線名: 小浜線。鉄道区分: 普通鉄道JR（11）。事業者種別: JR在来線（2）。

長津田
type: Concept
alternative label: 長津田（東急電鉄 こどもの国線）
broader: g004430
in scheme: scheme
notation: 004429
scope note: 運営会社: 東急電鉄。路線名: こどもの国線。鉄道区分: 普通鉄道（12）。事業者種別: 民営鉄道（4）。

長津田
type: Concept
alternative label: 長津田（東急電鉄 田園都市線）
broader: g004430
in scheme: scheme
notation: 004430
scope note: 運営会社: 東急電鉄。路線名: 田園都市線。鉄道区分: 普通鉄道（12）。事業者種別: 民営鉄道（4）。

長津田
type: Concept
alternative label: 長津田（東日本旅客鉄道 横浜線）
broader: g004430
in scheme: scheme
notation: 004431
scope note: 運営会社: 東日本旅客鉄道。路線名: 横浜線。鉄道区分: 普通鉄道JR（11）。事業者種別: JR在来線（2）。

川崎
type: Concept
alternative label: 川崎（東日本旅客鉄道 東海道線）
broader: g004432
in scheme: scheme
notation: 004432
scope note: 運営会社: 東日本旅客鉄道。路線名: 東海道線。鉄道区分: 普通鉄道JR（11）。事業者種別: JR在来線（2）。

川崎
type: Concept
alternative label: 川崎（東日本旅客鉄道 南武線）
broader: g004432
in scheme: scheme
notation: 004433
scope note: 運営会社: 東日本旅客鉄道。路線名: 南武線。鉄道区分: 普通鉄道JR（11）。事業者種別: JR在来線（2）。

上道
type: Concept
alternative label: 上道（西日本旅客鉄道 境線）
broader: g004434
in scheme: scheme
notation: 004434
scope note: 運営会社: 西日本旅客鉄道。路線名: 境線。鉄道区分: 普通鉄道JR（11）。事業者種別: JR在来線（2）。

尻手
type: Concept
alternative label: 尻手（東日本旅客鉄道 南武線）
broader: g004435
in scheme: scheme
notation: 004435
scope note: 運営会社: 東日本旅客鉄道。路線名: 南武線。鉄道区分: 普通鉄道JR（11）。事業者種別: JR在来線（2）。

土気
type: Concept
alternative label: 土気（東日本旅客鉄道 外房線）
broader: g004436
in scheme: scheme
notation: 004436
scope note: 運営会社: 東日本旅客鉄道。路線名: 外房線。鉄道区分: 普通鉄道JR（11）。事業者種別: JR在来線（2）。

原当麻
type: Concept
alternative label: 原当麻（東日本旅客鉄道 相模線）
broader: g004437
in scheme: scheme
notation: 004437
scope note: 運営会社: 東日本旅客鉄道。路線名: 相模線。鉄道区分: 普通鉄道JR（11）。事業者種別: JR在来線（2）。

川和町
type: Concept
alternative label: 川和町（横浜市 4号線）
broader: g004438
in scheme: scheme
notation: 004438
scope note: 運営会社: 横浜市。路線名: 4号線。鉄道区分: 普通鉄道（12）。事業者種別: 公営鉄道（3）。

新羽
type: Concept
alternative label: 新羽（横浜市 3号線）
broader: g004439
in scheme: scheme
notation: 004439
scope note: 運営会社: 横浜市。路線名: 3号線。鉄道区分: 普通鉄道（12）。事業者種別: 公営鉄道（3）。

谷汲口
type: Concept
alternative label: 谷汲口（樽見鉄道 樽見線）
broader: g004440
in scheme: scheme
notation: 004440
scope note: 運営会社: 樽見鉄道。路線名: 樽見線。鉄道区分: 普通鉄道（12）。事業者種別: 第三セクター（5）。

つくし野
type: Concept
alternative label: つくし野（東急電鉄 田園都市線）
broader: g004441
in scheme: scheme
notation: 004441
scope note: 運営会社: 東急電鉄。路線名: 田園都市線。鉄道区分: 普通鉄道（12）。事業者種別: 民営鉄道（4）。

松森
type: Concept
alternative label: 松森（長良川鉄道 越美南線）
broader: g004442
in scheme: scheme
notation: 004442
scope note: 運営会社: 長良川鉄道。路線名: 越美南線。鉄道区分: 普通鉄道（12）。事業者種別: 第三セクター（5）。

十日市場
type: Concept
alternative label: 十日市場（東日本旅客鉄道 横浜線）
broader: g004443
in scheme: scheme
notation: 004443
scope note: 運営会社: 東日本旅客鉄道。路線名: 横浜線。鉄道区分: 普通鉄道JR（11）。事業者種別: JR在来線（2）。

落合川
type: Concept
alternative label: 落合川（東海旅客鉄道 中央線）
broader: g004444
in scheme: scheme
notation: 004444
scope note: 運営会社: 東海旅客鉄道。路線名: 中央線。鉄道区分: 普通鉄道JR（11）。事業者種別: JR在来線（2）。

三つ峠
type: Concept
alternative label: 三つ峠（富士山麓電気鉄道 大月線）
broader: g004445
in scheme: scheme
notation: 004445
scope note: 運営会社: 富士山麓電気鉄道。路線名: 大月線。鉄道区分: 普通鉄道（12）。事業者種別: 民営鉄道（4）。

末恒
type: Concept
alternative label: 末恒（西日本旅客鉄道 山陰線）
broader: g004446
in scheme: scheme
notation: 004446
scope note: 運営会社: 西日本旅客鉄道。路線名: 山陰線。鉄道区分: 普通鉄道JR（11）。事業者種別: JR在来線（2）。

宮村
type: Concept
alternative label: 宮村（WILLER TRAINS 宮福線）
broader: g004447
in scheme: scheme
notation: 004447
scope note: 運営会社: WILLER TRAINS。路線名: 宮福線。鉄道区分: 普通鉄道（12）。事業者種別: 第三セクター（5）。

八丁畷
type: Concept
alternative label: 八丁畷（東日本旅客鉄道 南武線）
broader: g004448
in scheme: scheme
notation: 004448
scope note: 運営会社: 東日本旅客鉄道。路線名: 南武線。鉄道区分: 普通鉄道JR（11）。事業者種別: JR在来線（2）。

八丁畷
type: Concept
alternative label: 八丁畷（京浜急行電鉄 本線）
broader: g004448
in scheme: scheme
notation: 004449
scope note: 運営会社: 京浜急行電鉄。路線名: 本線。鉄道区分: 普通鉄道（12）。事業者種別: 民営鉄道（4）。

大網
type: Concept
alternative label: 大網（東日本旅客鉄道 東金線）
broader: g004450
in scheme: scheme
notation: 004450
scope note: 運営会社: 東日本旅客鉄道。路線名: 東金線。鉄道区分: 普通鉄道JR（11）。事業者種別: JR在来線（2）。

大網
type: Concept
alternative label: 大網（東日本旅客鉄道 外房線）
broader: g004450
in scheme: scheme
notation: 004451
scope note: 運営会社: 東日本旅客鉄道。路線名: 外房線。鉄道区分: 普通鉄道JR（11）。事業者種別: JR在来線（2）。

大倉山
type: Concept
alternative label: 大倉山（東急電鉄 東横線）
broader: g004452
in scheme: scheme
notation: 004452
scope note: 運営会社: 東急電鉄。路線名: 東横線。鉄道区分: 普通鉄道（12）。事業者種別: 民営鉄道（4）。

桜町
type: Concept
alternative label: 桜町（東海旅客鉄道 飯田線）
broader: g004453
in scheme: scheme
notation: 004453
scope note: 運営会社: 東海旅客鉄道。路線名: 飯田線。鉄道区分: 普通鉄道JR（11）。事業者種別: JR在来線（2）。

余子
type: Concept
alternative label: 余子（西日本旅客鉄道 境線）
broader: g004454
in scheme: scheme
notation: 004454
scope note: 運営会社: 西日本旅客鉄道。路線名: 境線。鉄道区分: 普通鉄道JR（11）。事業者種別: JR在来線（2）。

中山口
type: Concept
alternative label: 中山口（西日本旅客鉄道 山陰線）
broader: g004455
in scheme: scheme
notation: 004455
scope note: 運営会社: 西日本旅客鉄道。路線名: 山陰線。鉄道区分: 普通鉄道JR（11）。事業者種別: JR在来線（2）。

伊那上郷
type: Concept
alternative label: 伊那上郷（東海旅客鉄道 飯田線）
broader: g004456
in scheme: scheme
notation: 004456
scope note: 運営会社: 東海旅客鉄道。路線名: 飯田線。鉄道区分: 普通鉄道JR（11）。事業者種別: JR在来線（2）。

東林間
type: Concept
alternative label: 東林間（小田急電鉄 江ノ島線）
broader: g004457
in scheme: scheme
notation: 004457
scope note: 運営会社: 小田急電鉄。路線名: 江ノ島線。鉄道区分: 普通鉄道（12）。事業者種別: 民営鉄道（4）。

飯田
type: Concept
alternative label: 飯田（東海旅客鉄道 飯田線）
broader: g004458
in scheme: scheme
notation: 004458
scope note: 運営会社: 東海旅客鉄道。路線名: 飯田線。鉄道区分: 普通鉄道JR（11）。事業者種別: JR在来線（2）。

北新横浜
type: Concept
alternative label: 北新横浜（横浜市 3号線）
broader: g004459
in scheme: scheme
notation: 004459
scope note: 運営会社: 横浜市。路線名: 3号線。鉄道区分: 普通鉄道（12）。事業者種別: 公営鉄道（3）。

下市
type: Concept
alternative label: 下市（西日本旅客鉄道 山陰線）
broader: g004460
in scheme: scheme
notation: 004460
scope note: 運営会社: 西日本旅客鉄道。路線名: 山陰線。鉄道区分: 普通鉄道JR（11）。事業者種別: JR在来線（2）。

川崎新町
type: Concept
alternative label: 川崎新町（東日本旅客鉄道 南武線）
broader: g004461
in scheme: scheme
notation: 004461
scope note: 運営会社: 東日本旅客鉄道。路線名: 南武線。鉄道区分: 普通鉄道JR（11）。事業者種別: JR在来線（2）。

下溝
type: Concept
alternative label: 下溝（東日本旅客鉄道 相模線）
broader: g004462
in scheme: scheme
notation: 004462
scope note: 運営会社: 東日本旅客鉄道。路線名: 相模線。鉄道区分: 普通鉄道JR（11）。事業者種別: JR在来線（2）。

鳥取大学前
type: Concept
alternative label: 鳥取大学前（西日本旅客鉄道 山陰線）
broader: g004463
in scheme: scheme
notation: 004463
scope note: 運営会社: 西日本旅客鉄道。路線名: 山陰線。鉄道区分: 普通鉄道JR（11）。事業者種別: JR在来線（2）。

木知原
type: Concept
alternative label: 木知原（樽見鉄道 樽見線）
broader: g004464
in scheme: scheme
notation: 004464
scope note: 運営会社: 樽見鉄道。路線名: 樽見線。鉄道区分: 普通鉄道（12）。事業者種別: 第三セクター（5）。

鶴見市場
type: Concept
alternative label: 鶴見市場（京浜急行電鉄 本線）
broader: g004465
in scheme: scheme
notation: 004465
scope note: 運営会社: 京浜急行電鉄。路線名: 本線。鉄道区分: 普通鉄道（12）。事業者種別: 民営鉄道（4）。

すずかけ台
type: Concept
alternative label: すずかけ台（東急電鉄 田園都市線）
broader: g004466
in scheme: scheme
notation: 004466
scope note: 運営会社: 東急電鉄。路線名: 田園都市線。鉄道区分: 普通鉄道（12）。事業者種別: 民営鉄道（4）。

青谷
type: Concept
alternative label: 青谷（西日本旅客鉄道 山陰線）
broader: g004467
in scheme: scheme
notation: 004467
scope note: 運営会社: 西日本旅客鉄道。路線名: 山陰線。鉄道区分: 普通鉄道JR（11）。事業者種別: JR在来線（2）。

十村
type: Concept
alternative label: 十村（西日本旅客鉄道 小浜線）
broader: g004468
in scheme: scheme
notation: 004468
scope note: 運営会社: 西日本旅客鉄道。路線名: 小浜線。鉄道区分: 普通鉄道JR（11）。事業者種別: JR在来線（2）。

丹後由良
type: Concept
alternative label: 丹後由良（WILLER TRAINS 宮津線）
broader: g004469
in scheme: scheme
notation: 004469
scope note: 運営会社: WILLER TRAINS。路線名: 宮津線。鉄道区分: 普通鉄道（12）。事業者種別: 第三セクター（5）。

小田急相模原
type: Concept
alternative label: 小田急相模原（小田急電鉄 小田原線）
broader: g004470
in scheme: scheme
notation: 004470
scope note: 運営会社: 小田急電鉄。路線名: 小田原線。鉄道区分: 普通鉄道（12）。事業者種別: 民営鉄道（4）。

高松町
type: Concept
alternative label: 高松町（西日本旅客鉄道 境線）
broader: g004471
in scheme: scheme
notation: 004471
scope note: 運営会社: 西日本旅客鉄道。路線名: 境線。鉄道区分: 普通鉄道JR（11）。事業者種別: JR在来線（2）。

下麻生
type: Concept
alternative label: 下麻生（東海旅客鉄道 高山線）
broader: g004472
in scheme: scheme
notation: 004472
scope note: 運営会社: 東海旅客鉄道。路線名: 高山線。鉄道区分: 普通鉄道JR（11）。事業者種別: JR在来線（2）。

中山
type: Concept
alternative label: 中山（東日本旅客鉄道 横浜線）
broader: g004473
in scheme: scheme
notation: 004473
scope note: 運営会社: 東日本旅客鉄道。路線名: 横浜線。鉄道区分: 普通鉄道JR（11）。事業者種別: JR在来線（2）。

中山
type: Concept
alternative label: 中山（横浜市 4号線）
broader: g004473
in scheme: scheme
notation: 004474
scope note: 運営会社: 横浜市。路線名: 4号線。鉄道区分: 普通鉄道（12）。事業者種別: 公営鉄道（3）。

小田栄
type: Concept
alternative label: 小田栄（東日本旅客鉄道 南武線）
broader: g004475
in scheme: scheme
notation: 004475
scope note: 運営会社: 東日本旅客鉄道。路線名: 南武線。鉄道区分: 普通鉄道JR（11）。事業者種別: JR在来線（2）。

宝木
type: Concept
alternative label: 宝木（西日本旅客鉄道 山陰線）
broader: g004476
in scheme: scheme
notation: 004476
scope note: 運営会社: 西日本旅客鉄道。路線名: 山陰線。鉄道区分: 普通鉄道JR（11）。事業者種別: JR在来線（2）。

関下有知
type: Concept
alternative label: 関下有知（長良川鉄道 越美南線）
broader: g004477
in scheme: scheme
notation: 004477
scope note: 運営会社: 長良川鉄道。路線名: 越美南線。鉄道区分: 普通鉄道（12）。事業者種別: 第三セクター（5）。

湖山
type: Concept
alternative label: 湖山（西日本旅客鉄道 山陰線）
broader: g004478
in scheme: scheme
notation: 004478
scope note: 運営会社: 西日本旅客鉄道。路線名: 山陰線。鉄道区分: 普通鉄道JR（11）。事業者種別: JR在来線（2）。

五井
type: Concept
alternative label: 五井（東日本旅客鉄道 内房線）
broader: g004479
in scheme: scheme
notation: 004479
scope note: 運営会社: 東日本旅客鉄道。路線名: 内房線。鉄道区分: 普通鉄道JR（11）。事業者種別: JR在来線（2）。

五井
type: Concept
alternative label: 五井（小湊鐵道 小湊鐵道線）
broader: g004479
in scheme: scheme
notation: 004480
scope note: 運営会社: 小湊鐵道。路線名: 小湊鐵道線。鉄道区分: 普通鉄道（12）。事業者種別: 民営鉄道（4）。

切石
type: Concept
alternative label: 切石（東海旅客鉄道 飯田線）
broader: g004481
in scheme: scheme
notation: 004481
scope note: 運営会社: 東海旅客鉄道。路線名: 飯田線。鉄道区分: 普通鉄道JR（11）。事業者種別: JR在来線（2）。

赤碕
type: Concept
alternative label: 赤碕（西日本旅客鉄道 山陰線）
broader: g004482
in scheme: scheme
notation: 004482
scope note: 運営会社: 西日本旅客鉄道。路線名: 山陰線。鉄道区分: 普通鉄道JR（11）。事業者種別: JR在来線（2）。

御来屋
type: Concept
alternative label: 御来屋（西日本旅客鉄道 山陰線）
broader: g004483
in scheme: scheme
notation: 004483
scope note: 運営会社: 西日本旅客鉄道。路線名: 山陰線。鉄道区分: 普通鉄道JR（11）。事業者種別: JR在来線（2）。

南町田グランベリーパーク
type: Concept
alternative label: 南町田グランベリーパーク（東急電鉄 田園都市線）
broader: g004484
in scheme: scheme
notation: 004484
scope note: 運営会社: 東急電鉄。路線名: 田園都市線。鉄道区分: 普通鉄道（12）。事業者種別: 民営鉄道（4）。

鴨居
type: Concept
alternative label: 鴨居（東日本旅客鉄道 横浜線）
broader: g004485
in scheme: scheme
notation: 004485
scope note: 運営会社: 東日本旅客鉄道。路線名: 横浜線。鉄道区分: 普通鉄道JR（11）。事業者種別: JR在来線（2）。

つきみ野
type: Concept
alternative label: つきみ野（東急電鉄 田園都市線）
broader: g004486
in scheme: scheme
notation: 004486
scope note: 運営会社: 東急電鉄。路線名: 田園都市線。鉄道区分: 普通鉄道（12）。事業者種別: 民営鉄道（4）。

菊名
type: Concept
alternative label: 菊名（東急電鉄 東横線）
broader: g004487
in scheme: scheme
notation: 004487
scope note: 運営会社: 東急電鉄。路線名: 東横線。鉄道区分: 普通鉄道（12）。事業者種別: 民営鉄道（4）。

浜川崎
type: Concept
alternative label: 浜川崎（東日本旅客鉄道 南武線）
broader: g004488
in scheme: scheme
notation: 004488
scope note: 運営会社: 東日本旅客鉄道。路線名: 南武線。鉄道区分: 普通鉄道JR（11）。事業者種別: JR在来線（2）。

浜川崎
type: Concept
alternative label: 浜川崎（東日本旅客鉄道 鶴見線）
broader: g004488
in scheme: scheme
notation: 004489
scope note: 運営会社: 東日本旅客鉄道。路線名: 鶴見線。鉄道区分: 普通鉄道JR（11）。事業者種別: JR在来線（2）。

菊名
type: Concept
alternative label: 菊名（東日本旅客鉄道 横浜線）
broader: g004487
in scheme: scheme
notation: 004490
scope note: 運営会社: 東日本旅客鉄道。路線名: 横浜線。鉄道区分: 普通鉄道JR（11）。事業者種別: JR在来線（2）。

浜村
type: Concept
alternative label: 浜村（西日本旅客鉄道 山陰線）
broader: g004491
in scheme: scheme
notation: 004491
scope note: 運営会社: 西日本旅客鉄道。路線名: 山陰線。鉄道区分: 普通鉄道JR（11）。事業者種別: JR在来線（2）。

喜多
type: Concept
alternative label: 喜多（WILLER TRAINS 宮福線）
broader: g004492
in scheme: scheme
notation: 004492
scope note: 運営会社: WILLER TRAINS。路線名: 宮福線。鉄道区分: 普通鉄道（12）。事業者種別: 第三セクター（5）。

新横浜
type: Concept
alternative label: 新横浜（横浜市 3号線）
broader: g004501
in scheme: scheme
notation: 004493
scope note: 運営会社: 横浜市。路線名: 3号線。鉄道区分: 普通鉄道（12）。事業者種別: 公営鉄道（3）。

泊
type: Concept
alternative label: 泊（西日本旅客鉄道 山陰線）
broader: g004494
in scheme: scheme
notation: 004494
scope note: 運営会社: 西日本旅客鉄道。路線名: 山陰線。鉄道区分: 普通鉄道JR（11）。事業者種別: JR在来線（2）。

小机
type: Concept
alternative label: 小机（東日本旅客鉄道 横浜線）
broader: g004495
in scheme: scheme
notation: 004495
scope note: 運営会社: 東日本旅客鉄道。路線名: 横浜線。鉄道区分: 普通鉄道JR（11）。事業者種別: JR在来線（2）。

鶴見
type: Concept
alternative label: 鶴見（東日本旅客鉄道 東海道線）
broader: g004496
in scheme: scheme
notation: 004496
scope note: 運営会社: 東日本旅客鉄道。路線名: 東海道線。鉄道区分: 普通鉄道JR（11）。事業者種別: JR在来線（2）。

寿
type: Concept
alternative label: 寿（富士山麓電気鉄道 大月線）
broader: g004497
in scheme: scheme
notation: 004497
scope note: 運営会社: 富士山麓電気鉄道。路線名: 大月線。鉄道区分: 普通鉄道（12）。事業者種別: 民営鉄道（4）。

中央林間
type: Concept
alternative label: 中央林間（小田急電鉄 江ノ島線）
broader: g004498
in scheme: scheme
notation: 004498
scope note: 運営会社: 小田急電鉄。路線名: 江ノ島線。鉄道区分: 普通鉄道（12）。事業者種別: 民営鉄道（4）。

鶴見
type: Concept
alternative label: 鶴見（東日本旅客鉄道 鶴見線）
broader: g004496
in scheme: scheme
notation: 004499
scope note: 運営会社: 東日本旅客鉄道。路線名: 鶴見線。鉄道区分: 普通鉄道JR（11）。事業者種別: JR在来線（2）。

中央林間
type: Concept
alternative label: 中央林間（東急電鉄 田園都市線）
broader: g004498
in scheme: scheme
notation: 004500
scope note: 運営会社: 東急電鉄。路線名: 田園都市線。鉄道区分: 普通鉄道（12）。事業者種別: 民営鉄道（4）。

新横浜
type: Concept
alternative label: 新横浜（東海旅客鉄道 東海道新幹線）
broader: g004501
in scheme: scheme
notation: 004501
scope note: 運営会社: 東海旅客鉄道。路線名: 東海道新幹線。鉄道区分: 普通鉄道JR（11）。事業者種別: JRの新幹線（1）。

名和
type: Concept
alternative label: 名和（西日本旅客鉄道 山陰線）
broader: g004502
in scheme: scheme
notation: 004502
scope note: 運営会社: 西日本旅客鉄道。路線名: 山陰線。鉄道区分: 普通鉄道JR（11）。事業者種別: JR在来線（2）。

昭和
type: Concept
alternative label: 昭和（東日本旅客鉄道 鶴見線）
broader: g004503
in scheme: scheme
notation: 004503
scope note: 運営会社: 東日本旅客鉄道。路線名: 鶴見線。鉄道区分: 普通鉄道JR（11）。事業者種別: JR在来線（2）。

新横浜
type: Concept
alternative label: 新横浜（東日本旅客鉄道 横浜線）
broader: g004501
in scheme: scheme
notation: 004504
scope note: 運営会社: 東日本旅客鉄道。路線名: 横浜線。鉄道区分: 普通鉄道JR（11）。事業者種別: JR在来線（2）。

鼎
type: Concept
alternative label: 鼎（東海旅客鉄道 飯田線）
broader: g004505
in scheme: scheme
notation: 004505
scope note: 運営会社: 東海旅客鉄道。路線名: 飯田線。鉄道区分: 普通鉄道JR（11）。事業者種別: JR在来線（2）。

京急鶴見
type: Concept
alternative label: 京急鶴見（京浜急行電鉄 本線）
broader: g004506
in scheme: scheme
notation: 004506
scope note: 運営会社: 京浜急行電鉄。路線名: 本線。鉄道区分: 普通鉄道（12）。事業者種別: 民営鉄道（4）。

丹後神崎
type: Concept
alternative label: 丹後神崎（WILLER TRAINS 宮津線）
broader: g004507
in scheme: scheme
notation: 004507
scope note: 運営会社: WILLER TRAINS。路線名: 宮津線。鉄道区分: 普通鉄道（12）。事業者種別: 第三セクター（5）。

中浜
type: Concept
alternative label: 中浜（西日本旅客鉄道 境線）
broader: g004508
in scheme: scheme
notation: 004508
scope note: 運営会社: 西日本旅客鉄道。路線名: 境線。鉄道区分: 普通鉄道JR（11）。事業者種別: JR在来線（2）。

木ノ本
type: Concept
alternative label: 木ノ本（西日本旅客鉄道 北陸線）
broader: g004509
in scheme: scheme
notation: 004509
scope note: 運営会社: 西日本旅客鉄道。路線名: 北陸線。鉄道区分: 普通鉄道JR（11）。事業者種別: JR在来線（2）。

大鳥羽
type: Concept
alternative label: 大鳥羽（西日本旅客鉄道 小浜線）
broader: g004510
in scheme: scheme
notation: 004510
scope note: 運営会社: 西日本旅客鉄道。路線名: 小浜線。鉄道区分: 普通鉄道JR（11）。事業者種別: JR在来線（2）。

下山村
type: Concept
alternative label: 下山村（東海旅客鉄道 飯田線）
broader: g004511
in scheme: scheme
notation: 004511
scope note: 運営会社: 東海旅客鉄道。路線名: 飯田線。鉄道区分: 普通鉄道JR（11）。事業者種別: JR在来線（2）。

落居
type: Concept
alternative label: 落居（東海旅客鉄道 身延線）
broader: g004512
in scheme: scheme
notation: 004512
scope note: 運営会社: 東海旅客鉄道。路線名: 身延線。鉄道区分: 普通鉄道JR（11）。事業者種別: JR在来線（2）。

永田
type: Concept
alternative label: 永田（東日本旅客鉄道 外房線）
broader: g004513
in scheme: scheme
notation: 004513
scope note: 運営会社: 東日本旅客鉄道。路線名: 外房線。鉄道区分: 普通鉄道JR（11）。事業者種別: JR在来線（2）。

八橋
type: Concept
alternative label: 八橋（西日本旅客鉄道 山陰線）
broader: g004514
in scheme: scheme
notation: 004514
scope note: 運営会社: 西日本旅客鉄道。路線名: 山陰線。鉄道区分: 普通鉄道JR（11）。事業者種別: JR在来線（2）。

葭池温泉前
type: Concept
alternative label: 葭池温泉前（富士山麓電気鉄道 大月線）
broader: g004515
in scheme: scheme
notation: 004515
scope note: 運営会社: 富士山麓電気鉄道。路線名: 大月線。鉄道区分: 普通鉄道（12）。事業者種別: 民営鉄道（4）。

米子空港
type: Concept
alternative label: 米子空港（西日本旅客鉄道 境線）
broader: g004516
in scheme: scheme
notation: 004516
scope note: 運営会社: 西日本旅客鉄道。路線名: 境線。鉄道区分: 普通鉄道JR（11）。事業者種別: JR在来線（2）。

武蔵白石
type: Concept
alternative label: 武蔵白石（東日本旅客鉄道 鶴見線）
broader: g004517
in scheme: scheme
notation: 004517
scope note: 運営会社: 東日本旅客鉄道。路線名: 鶴見線。鉄道区分: 普通鉄道JR（11）。事業者種別: JR在来線（2）。

扇町
type: Concept
alternative label: 扇町（東日本旅客鉄道 鶴見線）
broader: g004518
in scheme: scheme
notation: 004518
scope note: 運営会社: 東日本旅客鉄道。路線名: 鶴見線。鉄道区分: 普通鉄道JR（11）。事業者種別: JR在来線（2）。

国道
type: Concept
alternative label: 国道（東日本旅客鉄道 鶴見線）
broader: g004519
in scheme: scheme
notation: 004519
scope note: 運営会社: 東日本旅客鉄道。路線名: 鶴見線。鉄道区分: 普通鉄道JR（11）。事業者種別: JR在来線（2）。

花月総持寺
type: Concept
alternative label: 花月総持寺（京浜急行電鉄 本線）
broader: g004520
in scheme: scheme
notation: 004520
scope note: 運営会社: 京浜急行電鉄。路線名: 本線。鉄道区分: 普通鉄道（12）。事業者種別: 民営鉄道（4）。

中津川
type: Concept
alternative label: 中津川（東海旅客鉄道 中央線）
broader: g004521
in scheme: scheme
notation: 004521
scope note: 運営会社: 東海旅客鉄道。路線名: 中央線。鉄道区分: 普通鉄道JR（11）。事業者種別: JR在来線（2）。

安善
type: Concept
alternative label: 安善（東日本旅客鉄道 鶴見線）
broader: g004522
in scheme: scheme
notation: 004522
scope note: 運営会社: 東日本旅客鉄道。路線名: 鶴見線。鉄道区分: 普通鉄道JR（11）。事業者種別: JR在来線（2）。

浦安
type: Concept
alternative label: 浦安（西日本旅客鉄道 山陰線）
broader: g004523
in scheme: scheme
notation: 004523
scope note: 運営会社: 西日本旅客鉄道。路線名: 山陰線。鉄道区分: 普通鉄道JR（11）。事業者種別: JR在来線（2）。

織部
type: Concept
alternative label: 織部（樽見鉄道 樽見線）
broader: g004524
in scheme: scheme
notation: 004524
scope note: 運営会社: 樽見鉄道。路線名: 樽見線。鉄道区分: 普通鉄道（12）。事業者種別: 第三セクター（5）。

相武台前
type: Concept
alternative label: 相武台前（小田急電鉄 小田原線）
broader: g004525
in scheme: scheme
notation: 004525
scope note: 運営会社: 小田急電鉄。路線名: 小田原線。鉄道区分: 普通鉄道（12）。事業者種別: 民営鉄道（4）。

関市役所前
type: Concept
alternative label: 関市役所前（長良川鉄道 越美南線）
broader: g004526
in scheme: scheme
notation: 004526
scope note: 運営会社: 長良川鉄道。路線名: 越美南線。鉄道区分: 普通鉄道（12）。事業者種別: 第三セクター（5）。

永原
type: Concept
alternative label: 永原（西日本旅客鉄道 湖西線）
broader: g004527
in scheme: scheme
notation: 004527
scope note: 運営会社: 西日本旅客鉄道。路線名: 湖西線。鉄道区分: 普通鉄道JR（11）。事業者種別: JR在来線（2）。

妙蓮寺
type: Concept
alternative label: 妙蓮寺（東急電鉄 東横線）
broader: g004528
in scheme: scheme
notation: 004528
scope note: 運営会社: 東急電鉄。路線名: 東横線。鉄道区分: 普通鉄道（12）。事業者種別: 民営鉄道（4）。

河口湖
type: Concept
alternative label: 河口湖（富士山麓電気鉄道 河口湖線）
broader: g004529
in scheme: scheme
notation: 004529
scope note: 運営会社: 富士山麓電気鉄道。路線名: 河口湖線。鉄道区分: 普通鉄道（12）。事業者種別: 民営鉄道（4）。

下吉田
type: Concept
alternative label: 下吉田（富士山麓電気鉄道 大月線）
broader: g004530
in scheme: scheme
notation: 004530
scope note: 運営会社: 富士山麓電気鉄道。路線名: 大月線。鉄道区分: 普通鉄道（12）。事業者種別: 民営鉄道（4）。

浅野
type: Concept
alternative label: 浅野（東日本旅客鉄道 鶴見線）
broader: g004531
in scheme: scheme
notation: 004531
scope note: 運営会社: 東日本旅客鉄道。路線名: 鶴見線。鉄道区分: 普通鉄道JR（11）。事業者種別: JR在来線（2）。

鶴見小野
type: Concept
alternative label: 鶴見小野（東日本旅客鉄道 鶴見線）
broader: g004532
in scheme: scheme
notation: 004532
scope note: 運営会社: 東日本旅客鉄道。路線名: 鶴見線。鉄道区分: 普通鉄道JR（11）。事業者種別: JR在来線（2）。

伊那八幡
type: Concept
alternative label: 伊那八幡（東海旅客鉄道 飯田線）
broader: g004533
in scheme: scheme
notation: 004533
scope note: 運営会社: 東海旅客鉄道。路線名: 飯田線。鉄道区分: 普通鉄道JR（11）。事業者種別: JR在来線（2）。

国府
type: Concept
alternative label: 国府（西日本旅客鉄道 山陰線）
broader: g004534
in scheme: scheme
notation: 004534
scope note: 運営会社: 西日本旅客鉄道。路線名: 山陰線。鉄道区分: 普通鉄道JR（11）。事業者種別: JR在来線（2）。

上総村上
type: Concept
alternative label: 上総村上（小湊鐵道 小湊鐵道線）
broader: g004535
in scheme: scheme
notation: 004535
scope note: 運営会社: 小湊鐵道。路線名: 小湊鐵道線。鉄道区分: 普通鉄道（12）。事業者種別: 民営鉄道（4）。

弁天橋
type: Concept
alternative label: 弁天橋（東日本旅客鉄道 鶴見線）
broader: g004536
in scheme: scheme
notation: 004536
scope note: 運営会社: 東日本旅客鉄道。路線名: 鶴見線。鉄道区分: 普通鉄道JR（11）。事業者種別: JR在来線（2）。

南林間
type: Concept
alternative label: 南林間（小田急電鉄 江ノ島線）
broader: g004537
in scheme: scheme
notation: 004537
scope note: 運営会社: 小田急電鉄。路線名: 江ノ島線。鉄道区分: 普通鉄道（12）。事業者種別: 民営鉄道（4）。

生麦
type: Concept
alternative label: 生麦（京浜急行電鉄 本線）
broader: g004538
in scheme: scheme
notation: 004538
scope note: 運営会社: 京浜急行電鉄。路線名: 本線。鉄道区分: 普通鉄道（12）。事業者種別: 民営鉄道（4）。

岸根公園
type: Concept
alternative label: 岸根公園（横浜市 3号線）
broader: g004539
in scheme: scheme
notation: 004539
scope note: 運営会社: 横浜市。路線名: 3号線。鉄道区分: 普通鉄道（12）。事業者種別: 公営鉄道（3）。

大川
type: Concept
alternative label: 大川（東日本旅客鉄道 鶴見線）
broader: g004540
in scheme: scheme
notation: 004540
scope note: 運営会社: 東日本旅客鉄道。路線名: 鶴見線。鉄道区分: 普通鉄道JR（11）。事業者種別: JR在来線（2）。

鳥取
type: Concept
alternative label: 鳥取（西日本旅客鉄道 因美線）
broader: g004541
in scheme: scheme
notation: 004541
scope note: 運営会社: 西日本旅客鉄道。路線名: 因美線。鉄道区分: 普通鉄道JR（11）。事業者種別: JR在来線（2）。

鳥取
type: Concept
alternative label: 鳥取（西日本旅客鉄道 山陰線）
broader: g004541
in scheme: scheme
notation: 004542
scope note: 運営会社: 西日本旅客鉄道。路線名: 山陰線。鉄道区分: 普通鉄道JR（11）。事業者種別: JR在来線（2）。

月江寺
type: Concept
alternative label: 月江寺（富士山麓電気鉄道 大月線）
broader: g004543
in scheme: scheme
notation: 004543
scope note: 運営会社: 富士山麓電気鉄道。路線名: 大月線。鉄道区分: 普通鉄道（12）。事業者種別: 民営鉄道（4）。

相武台下
type: Concept
alternative label: 相武台下（東日本旅客鉄道 相模線）
broader: g004544
in scheme: scheme
notation: 004544
scope note: 運営会社: 東日本旅客鉄道。路線名: 相模線。鉄道区分: 普通鉄道JR（11）。事業者種別: JR在来線（2）。

甲斐岩間
type: Concept
alternative label: 甲斐岩間（東海旅客鉄道 身延線）
broader: g004545
in scheme: scheme
notation: 004545
scope note: 運営会社: 東海旅客鉄道。路線名: 身延線。鉄道区分: 普通鉄道JR（11）。事業者種別: JR在来線（2）。

大口
type: Concept
alternative label: 大口（東日本旅客鉄道 横浜線）
broader: g004546
in scheme: scheme
notation: 004546
scope note: 運営会社: 東日本旅客鉄道。路線名: 横浜線。鉄道区分: 普通鉄道JR（11）。事業者種別: JR在来線（2）。

新芝浦
type: Concept
alternative label: 新芝浦（東日本旅客鉄道 鶴見線）
broader: g004547
in scheme: scheme
notation: 004547
scope note: 運営会社: 東日本旅客鉄道。路線名: 鶴見線。鉄道区分: 普通鉄道JR（11）。事業者種別: JR在来線（2）。

小浜
type: Concept
alternative label: 小浜（西日本旅客鉄道 小浜線）
broader: g004548
in scheme: scheme
notation: 004548
scope note: 運営会社: 西日本旅客鉄道。路線名: 小浜線。鉄道区分: 普通鉄道JR（11）。事業者種別: JR在来線（2）。

鶴間
type: Concept
alternative label: 鶴間（小田急電鉄 江ノ島線）
broader: g004549
in scheme: scheme
notation: 004549
scope note: 運営会社: 小田急電鉄。路線名: 江ノ島線。鉄道区分: 普通鉄道（12）。事業者種別: 民営鉄道（4）。

由良
type: Concept
alternative label: 由良（西日本旅客鉄道 山陰線）
broader: g004550
in scheme: scheme
notation: 004550
scope note: 運営会社: 西日本旅客鉄道。路線名: 山陰線。鉄道区分: 普通鉄道JR（11）。事業者種別: JR在来線（2）。

片倉町
type: Concept
alternative label: 片倉町（横浜市 3号線）
broader: g004551
in scheme: scheme
notation: 004551
scope note: 運営会社: 横浜市。路線名: 3号線。鉄道区分: 普通鉄道（12）。事業者種別: 公営鉄道（3）。

関
type: Concept
alternative label: 関（長良川鉄道 越美南線）
broader: g004552
in scheme: scheme
notation: 004552
scope note: 運営会社: 長良川鉄道。路線名: 越美南線。鉄道区分: 普通鉄道（12）。事業者種別: 第三セクター（5）。

富士急ハイランド
type: Concept
alternative label: 富士急ハイランド（富士山麓電気鉄道 河口湖線）
broader: g004553
in scheme: scheme
notation: 004553
scope note: 運営会社: 富士山麓電気鉄道。路線名: 河口湖線。鉄道区分: 普通鉄道（12）。事業者種別: 民営鉄道（4）。

白楽
type: Concept
alternative label: 白楽（東急電鉄 東横線）
broader: g004554
in scheme: scheme
notation: 004554
scope note: 運営会社: 東急電鉄。路線名: 東横線。鉄道区分: 普通鉄道（12）。事業者種別: 民営鉄道（4）。

大篠津町
type: Concept
alternative label: 大篠津町（西日本旅客鉄道 境線）
broader: g004555
in scheme: scheme
notation: 004555
scope note: 運営会社: 西日本旅客鉄道。路線名: 境線。鉄道区分: 普通鉄道JR（11）。事業者種別: JR在来線（2）。

三松
type: Concept
alternative label: 三松（西日本旅客鉄道 小浜線）
broader: g004556
in scheme: scheme
notation: 004556
scope note: 運営会社: 西日本旅客鉄道。路線名: 小浜線。鉄道区分: 普通鉄道JR（11）。事業者種別: JR在来線（2）。

若狭和田
type: Concept
alternative label: 若狭和田（西日本旅客鉄道 小浜線）
broader: g004557
in scheme: scheme
notation: 004557
scope note: 運営会社: 西日本旅客鉄道。路線名: 小浜線。鉄道区分: 普通鉄道JR（11）。事業者種別: JR在来線（2）。

本巣
type: Concept
alternative label: 本巣（樽見鉄道 樽見線）
broader: g004558
in scheme: scheme
notation: 004558
scope note: 運営会社: 樽見鉄道。路線名: 樽見線。鉄道区分: 普通鉄道（12）。事業者種別: 第三セクター（5）。

毛賀
type: Concept
alternative label: 毛賀（東海旅客鉄道 飯田線）
broader: g004559
in scheme: scheme
notation: 004559
scope note: 運営会社: 東海旅客鉄道。路線名: 飯田線。鉄道区分: 普通鉄道JR（11）。事業者種別: JR在来線（2）。

京急新子安
type: Concept
alternative label: 京急新子安（京浜急行電鉄 本線）
broader: g004560
in scheme: scheme
notation: 004560
scope note: 運営会社: 京浜急行電鉄。路線名: 本線。鉄道区分: 普通鉄道（12）。事業者種別: 民営鉄道（4）。

中川辺
type: Concept
alternative label: 中川辺（東海旅客鉄道 高山線）
broader: g004561
in scheme: scheme
notation: 004561
scope note: 運営会社: 東海旅客鉄道。路線名: 高山線。鉄道区分: 普通鉄道JR（11）。事業者種別: JR在来線（2）。

新子安
type: Concept
alternative label: 新子安（東日本旅客鉄道 東海道線）
broader: g004562
in scheme: scheme
notation: 004562
scope note: 運営会社: 東日本旅客鉄道。路線名: 東海道線。鉄道区分: 普通鉄道JR（11）。事業者種別: JR在来線（2）。

若狭高浜
type: Concept
alternative label: 若狭高浜（西日本旅客鉄道 小浜線）
broader: g004563
in scheme: scheme
notation: 004563
scope note: 運営会社: 西日本旅客鉄道。路線名: 小浜線。鉄道区分: 普通鉄道JR（11）。事業者種別: JR在来線（2）。

海芝浦
type: Concept
alternative label: 海芝浦（東日本旅客鉄道 鶴見線）
broader: g004564
in scheme: scheme
notation: 004564
scope note: 運営会社: 東日本旅客鉄道。路線名: 鶴見線。鉄道区分: 普通鉄道JR（11）。事業者種別: JR在来線（2）。

松尾寺
type: Concept
alternative label: 松尾寺（西日本旅客鉄道 小浜線）
broader: g004565
in scheme: scheme
notation: 004565
scope note: 運営会社: 西日本旅客鉄道。路線名: 小浜線。鉄道区分: 普通鉄道JR（11）。事業者種別: JR在来線（2）。

若狭有田
type: Concept
alternative label: 若狭有田（西日本旅客鉄道 小浜線）
broader: g004566
in scheme: scheme
notation: 004566
scope note: 運営会社: 西日本旅客鉄道。路線名: 小浜線。鉄道区分: 普通鉄道JR（11）。事業者種別: JR在来線（2）。

東小浜
type: Concept
alternative label: 東小浜（西日本旅客鉄道 小浜線）
broader: g004567
in scheme: scheme
notation: 004567
scope note: 運営会社: 西日本旅客鉄道。路線名: 小浜線。鉄道区分: 普通鉄道JR（11）。事業者種別: JR在来線（2）。

大山口
type: Concept
alternative label: 大山口（西日本旅客鉄道 山陰線）
broader: g004568
in scheme: scheme
notation: 004568
scope note: 運営会社: 西日本旅客鉄道。路線名: 山陰線。鉄道区分: 普通鉄道JR（11）。事業者種別: JR在来線（2）。

子安
type: Concept
alternative label: 子安（京浜急行電鉄 本線）
broader: g004569
in scheme: scheme
notation: 004569
scope note: 運営会社: 京浜急行電鉄。路線名: 本線。鉄道区分: 普通鉄道（12）。事業者種別: 民営鉄道（4）。

富士山
type: Concept
alternative label: 富士山（富士山麓電気鉄道 河口湖線）
broader: g004570
in scheme: scheme
notation: 004570
scope note: 運営会社: 富士山麓電気鉄道。路線名: 河口湖線。鉄道区分: 普通鉄道（12）。事業者種別: 民営鉄道（4）。

富士山
type: Concept
alternative label: 富士山（富士山麓電気鉄道 大月線）
broader: g004570
in scheme: scheme
notation: 004571
scope note: 運営会社: 富士山麓電気鉄道。路線名: 大月線。鉄道区分: 普通鉄道（12）。事業者種別: 民営鉄道（4）。

東白楽
type: Concept
alternative label: 東白楽（東急電鉄 東横線）
broader: g004572
in scheme: scheme
notation: 004572
scope note: 運営会社: 東急電鉄。路線名: 東横線。鉄道区分: 普通鉄道（12）。事業者種別: 民営鉄道（4）。

せきてらす前
type: Concept
alternative label: せきてらす前（長良川鉄道 越美南線）
broader: g004573
in scheme: scheme
notation: 004573
scope note: 運営会社: 長良川鉄道。路線名: 越美南線。鉄道区分: 普通鉄道（12）。事業者種別: 第三セクター（5）。

若狭本郷
type: Concept
alternative label: 若狭本郷（西日本旅客鉄道 小浜線）
broader: g004574
in scheme: scheme
notation: 004574
scope note: 運営会社: 西日本旅客鉄道。路線名: 小浜線。鉄道区分: 普通鉄道JR（11）。事業者種別: JR在来線（2）。

本納
type: Concept
alternative label: 本納（東日本旅客鉄道 外房線）
broader: g004575
in scheme: scheme
notation: 004575
scope note: 運営会社: 東日本旅客鉄道。路線名: 外房線。鉄道区分: 普通鉄道JR（11）。事業者種別: JR在来線（2）。

下北条
type: Concept
alternative label: 下北条（西日本旅客鉄道 山陰線）
broader: g004576
in scheme: scheme
notation: 004576
scope note: 運営会社: 西日本旅客鉄道。路線名: 山陰線。鉄道区分: 普通鉄道JR（11）。事業者種別: JR在来線（2）。

海士有木
type: Concept
alternative label: 海士有木（小湊鐵道 小湊鐵道線）
broader: g004577
in scheme: scheme
notation: 004577
scope note: 運営会社: 小湊鐵道。路線名: 小湊鐵道線。鉄道区分: 普通鉄道（12）。事業者種別: 民営鉄道（4）。

青郷
type: Concept
alternative label: 青郷（西日本旅客鉄道 小浜線）
broader: g004578
in scheme: scheme
notation: 004578
scope note: 運営会社: 西日本旅客鉄道。路線名: 小浜線。鉄道区分: 普通鉄道JR（11）。事業者種別: JR在来線（2）。

神奈川新町
type: Concept
alternative label: 神奈川新町（京浜急行電鉄 本線）
broader: g004579
in scheme: scheme
notation: 004579
scope note: 運営会社: 京浜急行電鉄。路線名: 本線。鉄道区分: 普通鉄道（12）。事業者種別: 民営鉄道（4）。

久那土
type: Concept
alternative label: 久那土（東海旅客鉄道 身延線）
broader: g004580
in scheme: scheme
notation: 004580
scope note: 運営会社: 東海旅客鉄道。路線名: 身延線。鉄道区分: 普通鉄道JR（11）。事業者種別: JR在来線（2）。

羽沢横浜国大
type: Concept
alternative label: 羽沢横浜国大（東日本旅客鉄道 東海道線）
broader: g004581
in scheme: scheme
notation: 004581
scope note: 運営会社: 東日本旅客鉄道。路線名: 東海道線。鉄道区分: 普通鉄道JR（11）。事業者種別: JR在来線（2）。

羽沢横浜国大
type: Concept
alternative label: 羽沢横浜国大（相模鉄道 相鉄新横浜線）
broader: g004581
in scheme: scheme
notation: 004582
scope note: 運営会社: 相模鉄道。路線名: 相鉄新横浜線。鉄道区分: 普通鉄道（12）。事業者種別: 民営鉄道（4）。

勢浜
type: Concept
alternative label: 勢浜（西日本旅客鉄道 小浜線）
broader: g004583
in scheme: scheme
notation: 004583
scope note: 運営会社: 西日本旅客鉄道。路線名: 小浜線。鉄道区分: 普通鉄道JR（11）。事業者種別: JR在来線（2）。

座間
type: Concept
alternative label: 座間（小田急電鉄 小田原線）
broader: g004584
in scheme: scheme
notation: 004584
scope note: 運営会社: 小田急電鉄。路線名: 小田原線。鉄道区分: 普通鉄道（12）。事業者種別: 民営鉄道（4）。

朝日ヶ丘
type: Concept
alternative label: 朝日ヶ丘（一畑電車 北松江線）
broader: g004585
in scheme: scheme
notation: 004585
scope note: 運営会社: 一畑電車。路線名: 北松江線。鉄道区分: 普通鉄道（12）。事業者種別: 民営鉄道（4）。

加斗
type: Concept
alternative label: 加斗（西日本旅客鉄道 小浜線）
broader: g004586
in scheme: scheme
notation: 004586
scope note: 運営会社: 西日本旅客鉄道。路線名: 小浜線。鉄道区分: 普通鉄道JR（11）。事業者種別: JR在来線（2）。

和田浜
type: Concept
alternative label: 和田浜（西日本旅客鉄道 境線）
broader: g004587
in scheme: scheme
notation: 004587
scope note: 運営会社: 西日本旅客鉄道。路線名: 境線。鉄道区分: 普通鉄道JR（11）。事業者種別: JR在来線（2）。

関口
type: Concept
alternative label: 関口（長良川鉄道 越美南線）
broader: g004588
in scheme: scheme
notation: 004588
scope note: 運営会社: 長良川鉄道。路線名: 越美南線。鉄道区分: 普通鉄道（12）。事業者種別: 第三セクター（5）。

長江
type: Concept
alternative label: 長江（一畑電車 北松江線）
broader: g004589
in scheme: scheme
notation: 004589
scope note: 運営会社: 一畑電車。路線名: 北松江線。鉄道区分: 普通鉄道（12）。事業者種別: 民営鉄道（4）。

美乃坂本
type: Concept
alternative label: 美乃坂本（東海旅客鉄道 中央線）
broader: g004590
in scheme: scheme
notation: 004590
scope note: 運営会社: 東海旅客鉄道。路線名: 中央線。鉄道区分: 普通鉄道JR（11）。事業者種別: JR在来線（2）。

姉ヶ崎
type: Concept
alternative label: 姉ヶ崎（東日本旅客鉄道 内房線）
broader: g004591
in scheme: scheme
notation: 004591
scope note: 運営会社: 東日本旅客鉄道。路線名: 内房線。鉄道区分: 普通鉄道JR（11）。事業者種別: JR在来線（2）。

関富岡
type: Concept
alternative label: 関富岡（長良川鉄道 越美南線）
broader: g004592
in scheme: scheme
notation: 004592
scope note: 運営会社: 長良川鉄道。路線名: 越美南線。鉄道区分: 普通鉄道（12）。事業者種別: 第三セクター（5）。

入谷
type: Concept
alternative label: 入谷（東日本旅客鉄道 相模線）
broader: g004593
in scheme: scheme
notation: 004593
scope note: 運営会社: 東日本旅客鉄道。路線名: 相模線。鉄道区分: 普通鉄道JR（11）。事業者種別: JR在来線（2）。

西谷
type: Concept
alternative label: 西谷（相模鉄道 相鉄新横浜線）
broader: g004594
in scheme: scheme
notation: 004594
scope note: 運営会社: 相模鉄道。路線名: 相鉄新横浜線。鉄道区分: 普通鉄道（12）。事業者種別: 民営鉄道（4）。

西谷
type: Concept
alternative label: 西谷（相模鉄道 相鉄本線）
broader: g004594
in scheme: scheme
notation: 004595
scope note: 運営会社: 相模鉄道。路線名: 相鉄本線。鉄道区分: 普通鉄道（12）。事業者種別: 民営鉄道（4）。

東神奈川
type: Concept
alternative label: 東神奈川（東日本旅客鉄道 横浜線）
broader: g004596
in scheme: scheme
notation: 004596
scope note: 運営会社: 東日本旅客鉄道。路線名: 横浜線。鉄道区分: 普通鉄道JR（11）。事業者種別: JR在来線（2）。

東神奈川
type: Concept
alternative label: 東神奈川（東日本旅客鉄道 東海道線）
broader: g004596
in scheme: scheme
notation: 004597
scope note: 運営会社: 東日本旅客鉄道。路線名: 東海道線。鉄道区分: 普通鉄道JR（11）。事業者種別: JR在来線（2）。

京急東神奈川
type: Concept
alternative label: 京急東神奈川（京浜急行電鉄 本線）
broader: g004598
in scheme: scheme
notation: 004598
scope note: 運営会社: 京浜急行電鉄。路線名: 本線。鉄道区分: 普通鉄道（12）。事業者種別: 民営鉄道（4）。

松江イングリッシュガーデン前
type: Concept
alternative label: 松江イングリッシュガーデン前（一畑電車 北松江線）
broader: g004599
in scheme: scheme
notation: 004599
scope note: 運営会社: 一畑電車。路線名: 北松江線。鉄道区分: 普通鉄道（12）。事業者種別: 民営鉄道（4）。

秋鹿町
type: Concept
alternative label: 秋鹿町（一畑電車 北松江線）
broader: g004600
in scheme: scheme
notation: 004600
scope note: 運営会社: 一畑電車。路線名: 北松江線。鉄道区分: 普通鉄道（12）。事業者種別: 民営鉄道（4）。

三ツ沢下町
type: Concept
alternative label: 三ツ沢下町（横浜市 3号線）
broader: g004601
in scheme: scheme
notation: 004601
scope note: 運営会社: 横浜市。路線名: 3号線。鉄道区分: 普通鉄道（12）。事業者種別: 公営鉄道（3）。

三ツ沢上町
type: Concept
alternative label: 三ツ沢上町（横浜市 3号線）
broader: g004602
in scheme: scheme
notation: 004602
scope note: 運営会社: 横浜市。路線名: 3号線。鉄道区分: 普通鉄道（12）。事業者種別: 公営鉄道（3）。

駄科
type: Concept
alternative label: 駄科（東海旅客鉄道 飯田線）
broader: g004603
in scheme: scheme
notation: 004603
scope note: 運営会社: 東海旅客鉄道。路線名: 飯田線。鉄道区分: 普通鉄道JR（11）。事業者種別: JR在来線（2）。

鶴ヶ峰
type: Concept
alternative label: 鶴ヶ峰（相模鉄道 相鉄本線）
broader: g004604
in scheme: scheme
notation: 004604
scope note: 運営会社: 相模鉄道。路線名: 相鉄本線。鉄道区分: 普通鉄道（12）。事業者種別: 民営鉄道（4）。

富加
type: Concept
alternative label: 富加（長良川鉄道 越美南線）
broader: g004605
in scheme: scheme
notation: 004605
scope note: 運営会社: 長良川鉄道。路線名: 越美南線。鉄道区分: 普通鉄道（12）。事業者種別: 第三セクター（5）。

東雲
type: Concept
alternative label: 東雲（WILLER TRAINS 宮津線）
broader: g004606
in scheme: scheme
notation: 004606
scope note: 運営会社: WILLER TRAINS。路線名: 宮津線。鉄道区分: 普通鉄道（12）。事業者種別: 第三セクター（5）。

松江フォーゲルパーク
type: Concept
alternative label: 松江フォーゲルパーク（一畑電車 北松江線）
broader: g004607
in scheme: scheme
notation: 004607
scope note: 運営会社: 一畑電車。路線名: 北松江線。鉄道区分: 普通鉄道（12）。事業者種別: 民営鉄道（4）。

反町
type: Concept
alternative label: 反町（東急電鉄 東横線）
broader: g004608
in scheme: scheme
notation: 004608
scope note: 運営会社: 東急電鉄。路線名: 東横線。鉄道区分: 普通鉄道（12）。事業者種別: 民営鉄道（4）。

新平野
type: Concept
alternative label: 新平野（西日本旅客鉄道 小浜線）
broader: g004609
in scheme: scheme
notation: 004609
scope note: 運営会社: 西日本旅客鉄道。路線名: 小浜線。鉄道区分: 普通鉄道JR（11）。事業者種別: JR在来線（2）。

高ノ宮
type: Concept
alternative label: 高ノ宮（一畑電車 北松江線）
broader: g004610
in scheme: scheme
notation: 004610
scope note: 運営会社: 一畑電車。路線名: 北松江線。鉄道区分: 普通鉄道（12）。事業者種別: 民営鉄道（4）。

さがみ野
type: Concept
alternative label: さがみ野（相模鉄道 相鉄本線）
broader: g004611
in scheme: scheme
notation: 004611
scope note: 運営会社: 相模鉄道。路線名: 相鉄本線。鉄道区分: 普通鉄道（12）。事業者種別: 民営鉄道（4）。

神奈川
type: Concept
alternative label: 神奈川（京浜急行電鉄 本線）
broader: g004612
in scheme: scheme
notation: 004612
scope note: 運営会社: 京浜急行電鉄。路線名: 本線。鉄道区分: 普通鉄道（12）。事業者種別: 民営鉄道（4）。

高月
type: Concept
alternative label: 高月（西日本旅客鉄道 北陸線）
broader: g004613
in scheme: scheme
notation: 004613
scope note: 運営会社: 西日本旅客鉄道。路線名: 北陸線。鉄道区分: 普通鉄道JR（11）。事業者種別: JR在来線（2）。

相模大塚
type: Concept
alternative label: 相模大塚（相模鉄道 相鉄本線）
broader: g004614
in scheme: scheme
notation: 004614
scope note: 運営会社: 相模鉄道。路線名: 相鉄本線。鉄道区分: 普通鉄道（12）。事業者種別: 民営鉄道（4）。

瀬谷
type: Concept
alternative label: 瀬谷（相模鉄道 相鉄本線）
broader: g004615
in scheme: scheme
notation: 004615
scope note: 運営会社: 相模鉄道。路線名: 相鉄本線。鉄道区分: 普通鉄道（12）。事業者種別: 民営鉄道（4）。

揖斐
type: Concept
alternative label: 揖斐（養老鉄道 養老線）
broader: g004616
in scheme: scheme
notation: 004616
scope note: 運営会社: 養老鉄道。路線名: 養老線。鉄道区分: 普通鉄道（12）。事業者種別: 民営鉄道（4）。

大和
type: Concept
alternative label: 大和（相模鉄道 相鉄本線）
broader: g004617
in scheme: scheme
notation: 004617
scope note: 運営会社: 相模鉄道。路線名: 相鉄本線。鉄道区分: 普通鉄道（12）。事業者種別: 民営鉄道（4）。

大和
type: Concept
alternative label: 大和（小田急電鉄 江ノ島線）
broader: g004617
in scheme: scheme
notation: 004618
scope note: 運営会社: 小田急電鉄。路線名: 江ノ島線。鉄道区分: 普通鉄道（12）。事業者種別: 民営鉄道（4）。

江原
type: Concept
alternative label: 江原（西日本旅客鉄道 山陰線）
broader: g004619
in scheme: scheme
notation: 004619
scope note: 運営会社: 西日本旅客鉄道。路線名: 山陰線。鉄道区分: 普通鉄道JR（11）。事業者種別: JR在来線（2）。

松崎
type: Concept
alternative label: 松崎（西日本旅客鉄道 山陰線）
broader: g004620
in scheme: scheme
notation: 004620
scope note: 運営会社: 西日本旅客鉄道。路線名: 山陰線。鉄道区分: 普通鉄道JR（11）。事業者種別: JR在来線（2）。

東舞鶴
type: Concept
alternative label: 東舞鶴（西日本旅客鉄道 小浜線）
broader: g004621
in scheme: scheme
notation: 004621
scope note: 運営会社: 西日本旅客鉄道。路線名: 小浜線。鉄道区分: 普通鉄道JR（11）。事業者種別: JR在来線（2）。

東舞鶴
type: Concept
alternative label: 東舞鶴（西日本旅客鉄道 舞鶴線）
broader: g004621
in scheme: scheme
notation: 004622
scope note: 運営会社: 西日本旅客鉄道。路線名: 舞鶴線。鉄道区分: 普通鉄道JR（11）。事業者種別: JR在来線（2）。

三ツ境
type: Concept
alternative label: 三ツ境（相模鉄道 相鉄本線）
broader: g004623
in scheme: scheme
notation: 004623
scope note: 運営会社: 相模鉄道。路線名: 相鉄本線。鉄道区分: 普通鉄道（12）。事業者種別: 民営鉄道（4）。

上星川
type: Concept
alternative label: 上星川（相模鉄道 相鉄本線）
broader: g004624
in scheme: scheme
notation: 004624
scope note: 運営会社: 相模鉄道。路線名: 相鉄本線。鉄道区分: 普通鉄道（12）。事業者種別: 民営鉄道（4）。

松江しんじ湖温泉
type: Concept
alternative label: 松江しんじ湖温泉（一畑電車 北松江線）
broader: g004625
in scheme: scheme
notation: 004625
scope note: 運営会社: 一畑電車。路線名: 北松江線。鉄道区分: 普通鉄道（12）。事業者種別: 民営鉄道（4）。

かしわ台
type: Concept
alternative label: かしわ台（相模鉄道 相鉄本線）
broader: g004626
in scheme: scheme
notation: 004626
scope note: 運営会社: 相模鉄道。路線名: 相鉄本線。鉄道区分: 普通鉄道（12）。事業者種別: 民営鉄道（4）。

弓ヶ浜
type: Concept
alternative label: 弓ヶ浜（西日本旅客鉄道 境線）
broader: g004627
in scheme: scheme
notation: 004627
scope note: 運営会社: 西日本旅客鉄道。路線名: 境線。鉄道区分: 普通鉄道JR（11）。事業者種別: JR在来線（2）。

横浜
type: Concept
alternative label: 横浜（東急電鉄 東横線）
broader: g004633
in scheme: scheme
notation: 004628
scope note: 運営会社: 東急電鉄。路線名: 東横線。鉄道区分: 普通鉄道（12）。事業者種別: 民営鉄道（4）。

横浜
type: Concept
alternative label: 横浜（横浜高速鉄道 みなとみらい21線）
broader: g004633
in scheme: scheme
notation: 004629
scope note: 運営会社: 横浜高速鉄道。路線名: みなとみらい21線。鉄道区分: 普通鉄道（12）。事業者種別: 第三セクター（5）。

津ノ森
type: Concept
alternative label: 津ノ森（一畑電車 北松江線）
broader: g004630
in scheme: scheme
notation: 004630
scope note: 運営会社: 一畑電車。路線名: 北松江線。鉄道区分: 普通鉄道（12）。事業者種別: 民営鉄道（4）。

横浜
type: Concept
alternative label: 横浜（京浜急行電鉄 本線）
broader: g004633
in scheme: scheme
notation: 004631
scope note: 運営会社: 京浜急行電鉄。路線名: 本線。鉄道区分: 普通鉄道（12）。事業者種別: 民営鉄道（4）。

上総三又
type: Concept
alternative label: 上総三又（小湊鐵道 小湊鐵道線）
broader: g004632
in scheme: scheme
notation: 004632
scope note: 運営会社: 小湊鐵道。路線名: 小湊鐵道線。鉄道区分: 普通鉄道（12）。事業者種別: 民営鉄道（4）。

横浜
type: Concept
alternative label: 横浜（相模鉄道 相鉄本線）
broader: g004633
in scheme: scheme
notation: 004633
scope note: 運営会社: 相模鉄道。路線名: 相鉄本線。鉄道区分: 普通鉄道（12）。事業者種別: 民営鉄道（4）。

横浜
type: Concept
alternative label: 横浜（東日本旅客鉄道 東海道線）
broader: g004633
in scheme: scheme
notation: 004634
scope note: 運営会社: 東日本旅客鉄道。路線名: 東海道線。鉄道区分: 普通鉄道JR（11）。事業者種別: JR在来線（2）。

横浜
type: Concept
alternative label: 横浜（東日本旅客鉄道 根岸線）
broader: g004633
in scheme: scheme
notation: 004635
scope note: 運営会社: 東日本旅客鉄道。路線名: 根岸線。鉄道区分: 普通鉄道JR（11）。事業者種別: JR在来線（2）。

横浜
type: Concept
alternative label: 横浜（横浜市 3号線）
broader: g004633
in scheme: scheme
notation: 004636
scope note: 運営会社: 横浜市。路線名: 3号線。鉄道区分: 普通鉄道（12）。事業者種別: 公営鉄道（3）。

一畑口
type: Concept
alternative label: 一畑口（一畑電車 北松江線）
broader: g004637
in scheme: scheme
notation: 004637
scope note: 運営会社: 一畑電車。路線名: 北松江線。鉄道区分: 普通鉄道（12）。事業者種別: 民営鉄道（4）。

松江
type: Concept
alternative label: 松江（西日本旅客鉄道 山陰線）
broader: g004638
in scheme: scheme
notation: 004638
scope note: 運営会社: 西日本旅客鉄道。路線名: 山陰線。鉄道区分: 普通鉄道JR（11）。事業者種別: JR在来線（2）。

時又
type: Concept
alternative label: 時又（東海旅客鉄道 飯田線）
broader: g004639
in scheme: scheme
notation: 004639
scope note: 運営会社: 東海旅客鉄道。路線名: 飯田線。鉄道区分: 普通鉄道JR（11）。事業者種別: JR在来線（2）。

和田町
type: Concept
alternative label: 和田町（相模鉄道 相鉄本線）
broader: g004640
in scheme: scheme
notation: 004640
scope note: 運営会社: 相模鉄道。路線名: 相鉄本線。鉄道区分: 普通鉄道（12）。事業者種別: 民営鉄道（4）。

上中
type: Concept
alternative label: 上中（西日本旅客鉄道 小浜線）
broader: g004641
in scheme: scheme
notation: 004641
scope note: 運営会社: 西日本旅客鉄道。路線名: 小浜線。鉄道区分: 普通鉄道JR（11）。事業者種別: JR在来線（2）。

二俣川
type: Concept
alternative label: 二俣川（相模鉄道 相鉄いずみ野線）
broader: g004642
in scheme: scheme
notation: 004642
scope note: 運営会社: 相模鉄道。路線名: 相鉄いずみ野線。鉄道区分: 普通鉄道（12）。事業者種別: 民営鉄道（4）。

二俣川
type: Concept
alternative label: 二俣川（相模鉄道 相鉄本線）
broader: g004642
in scheme: scheme
notation: 004643
scope note: 運営会社: 相模鉄道。路線名: 相鉄本線。鉄道区分: 普通鉄道（12）。事業者種別: 民営鉄道（4）。

糸貫
type: Concept
alternative label: 糸貫（樽見鉄道 樽見線）
broader: g004644
in scheme: scheme
notation: 004644
scope note: 運営会社: 樽見鉄道。路線名: 樽見線。鉄道区分: 普通鉄道（12）。事業者種別: 第三セクター（5）。

辛皮
type: Concept
alternative label: 辛皮（WILLER TRAINS 宮福線）
broader: g004645
in scheme: scheme
notation: 004645
scope note: 運営会社: WILLER TRAINS。路線名: 宮福線。鉄道区分: 普通鉄道（12）。事業者種別: 第三セクター（5）。

市ノ瀬
type: Concept
alternative label: 市ノ瀬（東海旅客鉄道 身延線）
broader: g004646
in scheme: scheme
notation: 004646
scope note: 運営会社: 東海旅客鉄道。路線名: 身延線。鉄道区分: 普通鉄道JR（11）。事業者種別: JR在来線（2）。

新高島
type: Concept
alternative label: 新高島（横浜高速鉄道 みなとみらい21線）
broader: g004647
in scheme: scheme
notation: 004647
scope note: 運営会社: 横浜高速鉄道。路線名: みなとみらい21線。鉄道区分: 普通鉄道（12）。事業者種別: 第三セクター（5）。

伊野灘
type: Concept
alternative label: 伊野灘（一畑電車 北松江線）
broader: g004648
in scheme: scheme
notation: 004648
scope note: 運営会社: 一畑電車。路線名: 北松江線。鉄道区分: 普通鉄道（12）。事業者種別: 民営鉄道（4）。

マキノ
type: Concept
alternative label: マキノ（西日本旅客鉄道 湖西線）
broader: g004649
in scheme: scheme
notation: 004649
scope note: 運営会社: 西日本旅客鉄道。路線名: 湖西線。鉄道区分: 普通鉄道JR（11）。事業者種別: JR在来線（2）。

津ノ井
type: Concept
alternative label: 津ノ井（西日本旅客鉄道 因美線）
broader: g004650
in scheme: scheme
notation: 004650
scope note: 運営会社: 西日本旅客鉄道。路線名: 因美線。鉄道区分: 普通鉄道JR（11）。事業者種別: JR在来線（2）。

加茂野
type: Concept
alternative label: 加茂野（長良川鉄道 越美南線）
broader: g004651
in scheme: scheme
notation: 004651
scope note: 運営会社: 長良川鉄道。路線名: 越美南線。鉄道区分: 普通鉄道（12）。事業者種別: 第三セクター（5）。

希望ヶ丘
type: Concept
alternative label: 希望ヶ丘（相模鉄道 相鉄本線）
broader: g004652
in scheme: scheme
notation: 004652
scope note: 運営会社: 相模鉄道。路線名: 相鉄本線。鉄道区分: 普通鉄道（12）。事業者種別: 民営鉄道（4）。

平沼橋
type: Concept
alternative label: 平沼橋（相模鉄道 相鉄本線）
broader: g004653
in scheme: scheme
notation: 004653
scope note: 運営会社: 相模鉄道。路線名: 相鉄本線。鉄道区分: 普通鉄道（12）。事業者種別: 民営鉄道（4）。

高島町
type: Concept
alternative label: 高島町（横浜市 3号線）
broader: g004654
in scheme: scheme
notation: 004654
scope note: 運営会社: 横浜市。路線名: 3号線。鉄道区分: 普通鉄道（12）。事業者種別: 公営鉄道（3）。

星川
type: Concept
alternative label: 星川（相模鉄道 相鉄本線）
broader: g004655
in scheme: scheme
notation: 004655
scope note: 運営会社: 相模鉄道。路線名: 相鉄本線。鉄道区分: 普通鉄道（12）。事業者種別: 民営鉄道（4）。

みなとみらい
type: Concept
alternative label: みなとみらい（横浜高速鉄道 みなとみらい21線）
broader: g004656
in scheme: scheme
notation: 004656
scope note: 運営会社: 横浜高速鉄道。路線名: みなとみらい21線。鉄道区分: 普通鉄道（12）。事業者種別: 第三セクター（5）。

古井
type: Concept
alternative label: 古井（東海旅客鉄道 高山線）
broader: g004657
in scheme: scheme
notation: 004657
scope note: 運営会社: 東海旅客鉄道。路線名: 高山線。鉄道区分: 普通鉄道JR（11）。事業者種別: JR在来線（2）。

淀江
type: Concept
alternative label: 淀江（西日本旅客鉄道 山陰線）
broader: g004658
in scheme: scheme
notation: 004658
scope note: 運営会社: 西日本旅客鉄道。路線名: 山陰線。鉄道区分: 普通鉄道JR（11）。事業者種別: JR在来線（2）。

河崎口
type: Concept
alternative label: 河崎口（西日本旅客鉄道 境線）
broader: g004659
in scheme: scheme
notation: 004659
scope note: 運営会社: 西日本旅客鉄道。路線名: 境線。鉄道区分: 普通鉄道JR（11）。事業者種別: JR在来線（2）。

戸部
type: Concept
alternative label: 戸部（京浜急行電鉄 本線）
broader: g004660
in scheme: scheme
notation: 004660
scope note: 運営会社: 京浜急行電鉄。路線名: 本線。鉄道区分: 普通鉄道（12）。事業者種別: 民営鉄道（4）。

園
type: Concept
alternative label: 園（一畑電車 北松江線）
broader: g004661
in scheme: scheme
notation: 004661
scope note: 運営会社: 一畑電車。路線名: 北松江線。鉄道区分: 普通鉄道（12）。事業者種別: 民営鉄道（4）。

恵那
type: Concept
alternative label: 恵那（東海旅客鉄道 中央線）
broader: g004662
in scheme: scheme
notation: 004662
scope note: 運営会社: 東海旅客鉄道。路線名: 中央線。鉄道区分: 普通鉄道JR（11）。事業者種別: JR在来線（2）。

恵那
type: Concept
alternative label: 恵那（明知鉄道 明知線）
broader: g004662
in scheme: scheme
notation: 004663
scope note: 運営会社: 明知鉄道。路線名: 明知線。鉄道区分: 普通鉄道（12）。事業者種別: 第三セクター（5）。

モレラ岐阜
type: Concept
alternative label: モレラ岐阜（樽見鉄道 樽見線）
broader: g004664
in scheme: scheme
notation: 004664
scope note: 運営会社: 樽見鉄道。路線名: 樽見線。鉄道区分: 普通鉄道（12）。事業者種別: 第三セクター（5）。

倉吉
type: Concept
alternative label: 倉吉（西日本旅客鉄道 山陰線）
broader: g004665
in scheme: scheme
notation: 004665
scope note: 運営会社: 西日本旅客鉄道。路線名: 山陰線。鉄道区分: 普通鉄道JR（11）。事業者種別: JR在来線（2）。

海老名
type: Concept
alternative label: 海老名（東日本旅客鉄道 相模線）
broader: g004672
in scheme: scheme
notation: 004666
scope note: 運営会社: 東日本旅客鉄道。路線名: 相模線。鉄道区分: 普通鉄道JR（11）。事業者種別: JR在来線（2）。

上総山田
type: Concept
alternative label: 上総山田（小湊鐵道 小湊鐵道線）
broader: g004667
in scheme: scheme
notation: 004667
scope note: 運営会社: 小湊鐵道。路線名: 小湊鐵道線。鉄道区分: 普通鉄道（12）。事業者種別: 民営鉄道（4）。

天王町
type: Concept
alternative label: 天王町（相模鉄道 相鉄本線）
broader: g004668
in scheme: scheme
notation: 004668
scope note: 運営会社: 相模鉄道。路線名: 相鉄本線。鉄道区分: 普通鉄道（12）。事業者種別: 民営鉄道（4）。

西横浜
type: Concept
alternative label: 西横浜（相模鉄道 相鉄本線）
broader: g004669
in scheme: scheme
notation: 004669
scope note: 運営会社: 相模鉄道。路線名: 相鉄本線。鉄道区分: 普通鉄道（12）。事業者種別: 民営鉄道（4）。

海老名
type: Concept
alternative label: 海老名（相模鉄道 相鉄本線）
broader: g004672
in scheme: scheme
notation: 004670
scope note: 運営会社: 相模鉄道。路線名: 相鉄本線。鉄道区分: 普通鉄道（12）。事業者種別: 民営鉄道（4）。

川路
type: Concept
alternative label: 川路（東海旅客鉄道 飯田線）
broader: g004671
in scheme: scheme
notation: 004671
scope note: 運営会社: 東海旅客鉄道。路線名: 飯田線。鉄道区分: 普通鉄道JR（11）。事業者種別: JR在来線（2）。

海老名
type: Concept
alternative label: 海老名（小田急電鉄 小田原線）
broader: g004672
in scheme: scheme
notation: 004672
scope note: 運営会社: 小田急電鉄。路線名: 小田原線。鉄道区分: 普通鉄道（12）。事業者種別: 民営鉄道（4）。

湖遊館新駅
type: Concept
alternative label: 湖遊館新駅（一畑電車 北松江線）
broader: g004673
in scheme: scheme
notation: 004673
scope note: 運営会社: 一畑電車。路線名: 北松江線。鉄道区分: 普通鉄道（12）。事業者種別: 民営鉄道（4）。

南万騎が原
type: Concept
alternative label: 南万騎が原（相模鉄道 相鉄いずみ野線）
broader: g004674
in scheme: scheme
notation: 004674
scope note: 運営会社: 相模鉄道。路線名: 相鉄いずみ野線。鉄道区分: 普通鉄道（12）。事業者種別: 民営鉄道（4）。

桜木町
type: Concept
alternative label: 桜木町（東日本旅客鉄道 根岸線）
broader: g004675
in scheme: scheme
notation: 004675
scope note: 運営会社: 東日本旅客鉄道。路線名: 根岸線。鉄道区分: 普通鉄道JR（11）。事業者種別: JR在来線（2）。

桜ヶ丘
type: Concept
alternative label: 桜ヶ丘（小田急電鉄 江ノ島線）
broader: g004676
in scheme: scheme
notation: 004676
scope note: 運営会社: 小田急電鉄。路線名: 江ノ島線。鉄道区分: 普通鉄道（12）。事業者種別: 民営鉄道（4）。

長浦
type: Concept
alternative label: 長浦（東日本旅客鉄道 内房線）
broader: g004677
in scheme: scheme
notation: 004677
scope note: 運営会社: 東日本旅客鉄道。路線名: 内房線。鉄道区分: 普通鉄道JR（11）。事業者種別: JR在来線（2）。

布崎
type: Concept
alternative label: 布崎（一畑電車 北松江線）
broader: g004678
in scheme: scheme
notation: 004678
scope note: 運営会社: 一畑電車。路線名: 北松江線。鉄道区分: 普通鉄道（12）。事業者種別: 民営鉄道（4）。

馬車道
type: Concept
alternative label: 馬車道（横浜高速鉄道 みなとみらい21線）
broader: g004679
in scheme: scheme
notation: 004679
scope note: 運営会社: 横浜高速鉄道。路線名: みなとみらい21線。鉄道区分: 普通鉄道（12）。事業者種別: 第三セクター（5）。

美濃本郷
type: Concept
alternative label: 美濃本郷（養老鉄道 養老線）
broader: g004680
in scheme: scheme
notation: 004680
scope note: 運営会社: 養老鉄道。路線名: 養老線。鉄道区分: 普通鉄道（12）。事業者種別: 民営鉄道（4）。

前平公園
type: Concept
alternative label: 前平公園（長良川鉄道 越美南線）
broader: g004681
in scheme: scheme
notation: 004681
scope note: 運営会社: 長良川鉄道。路線名: 越美南線。鉄道区分: 普通鉄道（12）。事業者種別: 第三セクター（5）。

桜木町
type: Concept
alternative label: 桜木町（横浜市 3号線）
broader: g004675
in scheme: scheme
notation: 004682
scope note: 運営会社: 横浜市。路線名: 3号線。鉄道区分: 普通鉄道（12）。事業者種別: 公営鉄道（3）。

新茂原
type: Concept
alternative label: 新茂原（東日本旅客鉄道 外房線）
broader: g004683
in scheme: scheme
notation: 004683
scope note: 運営会社: 東日本旅客鉄道。路線名: 外房線。鉄道区分: 普通鉄道JR（11）。事業者種別: JR在来線（2）。

河毛
type: Concept
alternative label: 河毛（西日本旅客鉄道 北陸線）
broader: g004684
in scheme: scheme
notation: 004684
scope note: 運営会社: 西日本旅客鉄道。路線名: 北陸線。鉄道区分: 普通鉄道JR（11）。事業者種別: JR在来線（2）。

保土ヶ谷
type: Concept
alternative label: 保土ヶ谷（東日本旅客鉄道 東海道線）
broader: g004685
in scheme: scheme
notation: 004685
scope note: 運営会社: 東日本旅客鉄道。路線名: 東海道線。鉄道区分: 普通鉄道JR（11）。事業者種別: JR在来線（2）。

日本大通り
type: Concept
alternative label: 日本大通り（横浜高速鉄道 みなとみらい21線）
broader: g004686
in scheme: scheme
notation: 004686
scope note: 運営会社: 横浜高速鉄道。路線名: みなとみらい21線。鉄道区分: 普通鉄道（12）。事業者種別: 第三セクター（5）。

東野
type: Concept
alternative label: 東野（明知鉄道 明知線）
broader: g004687
in scheme: scheme
notation: 004687
scope note: 運営会社: 明知鉄道。路線名: 明知線。鉄道区分: 普通鉄道（12）。事業者種別: 第三セクター（5）。

三本松口
type: Concept
alternative label: 三本松口（西日本旅客鉄道 境線）
broader: g004688
in scheme: scheme
notation: 004688
scope note: 運営会社: 西日本旅客鉄道。路線名: 境線。鉄道区分: 普通鉄道JR（11）。事業者種別: JR在来線（2）。

四所
type: Concept
alternative label: 四所（WILLER TRAINS 宮津線）
broader: g004689
in scheme: scheme
notation: 004689
scope note: 運営会社: WILLER TRAINS。路線名: 宮津線。鉄道区分: 普通鉄道（12）。事業者種別: 第三セクター（5）。

乃木
type: Concept
alternative label: 乃木（西日本旅客鉄道 山陰線）
broader: g004690
in scheme: scheme
notation: 004690
scope note: 運営会社: 西日本旅客鉄道。路線名: 山陰線。鉄道区分: 普通鉄道JR（11）。事業者種別: JR在来線（2）。

関内
type: Concept
alternative label: 関内（横浜市 1号線）
broader: g004691
in scheme: scheme
notation: 004691
scope note: 運営会社: 横浜市。路線名: 1号線。鉄道区分: 普通鉄道（12）。事業者種別: 公営鉄道（3）。

関内
type: Concept
alternative label: 関内（横浜市 3号線）
broader: g004691
in scheme: scheme
notation: 004692
scope note: 運営会社: 横浜市。路線名: 3号線。鉄道区分: 普通鉄道（12）。事業者種別: 公営鉄道（3）。

美濃太田
type: Concept
alternative label: 美濃太田（東海旅客鉄道 高山線）
broader: g004693
in scheme: scheme
notation: 004693
scope note: 運営会社: 東海旅客鉄道。路線名: 高山線。鉄道区分: 普通鉄道JR（11）。事業者種別: JR在来線（2）。

美濃太田
type: Concept
alternative label: 美濃太田（東海旅客鉄道 太多線）
broader: g004693
in scheme: scheme
notation: 004694
scope note: 運営会社: 東海旅客鉄道。路線名: 太多線。鉄道区分: 普通鉄道JR（11）。事業者種別: JR在来線（2）。

美濃太田
type: Concept
alternative label: 美濃太田（長良川鉄道 越美南線）
broader: g004693
in scheme: scheme
notation: 004695
scope note: 運営会社: 長良川鉄道。路線名: 越美南線。鉄道区分: 普通鉄道（12）。事業者種別: 第三セクター（5）。

日ノ出町
type: Concept
alternative label: 日ノ出町（京浜急行電鉄 本線）
broader: g004696
in scheme: scheme
notation: 004696
scope note: 運営会社: 京浜急行電鉄。路線名: 本線。鉄道区分: 普通鉄道（12）。事業者種別: 民営鉄道（4）。

東松江
type: Concept
alternative label: 東松江（西日本旅客鉄道 山陰線）
broader: g004697
in scheme: scheme
notation: 004697
scope note: 運営会社: 西日本旅客鉄道。路線名: 山陰線。鉄道区分: 普通鉄道JR（11）。事業者種別: JR在来線（2）。

甲斐常葉
type: Concept
alternative label: 甲斐常葉（東海旅客鉄道 身延線）
broader: g004698
in scheme: scheme
notation: 004698
scope note: 運営会社: 東海旅客鉄道。路線名: 身延線。鉄道区分: 普通鉄道JR（11）。事業者種別: JR在来線（2）。

関内
type: Concept
alternative label: 関内（東日本旅客鉄道 根岸線）
broader: g004691
in scheme: scheme
notation: 004699
scope note: 運営会社: 東日本旅客鉄道。路線名: 根岸線。鉄道区分: 普通鉄道JR（11）。事業者種別: JR在来線（2）。

美濃川合
type: Concept
alternative label: 美濃川合（東海旅客鉄道 太多線）
broader: g004700
in scheme: scheme
notation: 004700
scope note: 運営会社: 東海旅客鉄道。路線名: 太多線。鉄道区分: 普通鉄道JR（11）。事業者種別: JR在来線（2）。

厚木
type: Concept
alternative label: 厚木（東日本旅客鉄道 相模線）
broader: g004701
in scheme: scheme
notation: 004701
scope note: 運営会社: 東日本旅客鉄道。路線名: 相模線。鉄道区分: 普通鉄道JR（11）。事業者種別: JR在来線（2）。

北池野
type: Concept
alternative label: 北池野（養老鉄道 養老線）
broader: g004702
in scheme: scheme
notation: 004702
scope note: 運営会社: 養老鉄道。路線名: 養老線。鉄道区分: 普通鉄道（12）。事業者種別: 民営鉄道（4）。

厚木
type: Concept
alternative label: 厚木（小田急電鉄 小田原線）
broader: g004701
in scheme: scheme
notation: 004703
scope note: 運営会社: 小田急電鉄。路線名: 小田原線。鉄道区分: 普通鉄道（12）。事業者種別: 民営鉄道（4）。

元町・中華街
type: Concept
alternative label: 元町・中華街（横浜高速鉄道 みなとみらい21線）
broader: g004704
in scheme: scheme
notation: 004704
scope note: 運営会社: 横浜高速鉄道。路線名: みなとみらい21線。鉄道区分: 普通鉄道（12）。事業者種別: 第三セクター（5）。

西舞鶴
type: Concept
alternative label: 西舞鶴（西日本旅客鉄道 舞鶴線）
broader: g004705
in scheme: scheme
notation: 004705
scope note: 運営会社: 西日本旅客鉄道。路線名: 舞鶴線。鉄道区分: 普通鉄道JR（11）。事業者種別: JR在来線（2）。

西舞鶴
type: Concept
alternative label: 西舞鶴（WILLER TRAINS 宮津線）
broader: g004705
in scheme: scheme
notation: 004706
scope note: 運営会社: WILLER TRAINS。路線名: 宮津線。鉄道区分: 普通鉄道（12）。事業者種別: 第三セクター（5）。

天竜峡
type: Concept
alternative label: 天竜峡（東海旅客鉄道 飯田線）
broader: g004707
in scheme: scheme
notation: 004707
scope note: 運営会社: 東海旅客鉄道。路線名: 飯田線。鉄道区分: 普通鉄道JR（11）。事業者種別: JR在来線（2）。

伊勢佐木長者町
type: Concept
alternative label: 伊勢佐木長者町（横浜市 1号線）
broader: g004708
in scheme: scheme
notation: 004708
scope note: 運営会社: 横浜市。路線名: 1号線。鉄道区分: 普通鉄道（12）。事業者種別: 公営鉄道（3）。

近江中庄
type: Concept
alternative label: 近江中庄（西日本旅客鉄道 湖西線）
broader: g004709
in scheme: scheme
notation: 004709
scope note: 運営会社: 西日本旅客鉄道。路線名: 湖西線。鉄道区分: 普通鉄道JR（11）。事業者種別: JR在来線（2）。

後藤
type: Concept
alternative label: 後藤（西日本旅客鉄道 境線）
broader: g004710
in scheme: scheme
notation: 004710
scope note: 運営会社: 西日本旅客鉄道。路線名: 境線。鉄道区分: 普通鉄道JR（11）。事業者種別: JR在来線（2）。

北方真桑
type: Concept
alternative label: 北方真桑（樽見鉄道 樽見線）
broader: g004711
in scheme: scheme
notation: 004711
scope note: 運営会社: 樽見鉄道。路線名: 樽見線。鉄道区分: 普通鉄道（12）。事業者種別: 第三セクター（5）。

黄金町
type: Concept
alternative label: 黄金町（京浜急行電鉄 本線）
broader: g004712
in scheme: scheme
notation: 004712
scope note: 運営会社: 京浜急行電鉄。路線名: 本線。鉄道区分: 普通鉄道（12）。事業者種別: 民営鉄道（4）。

光風台
type: Concept
alternative label: 光風台（小湊鐵道 小湊鐵道線）
broader: g004713
in scheme: scheme
notation: 004713
scope note: 運営会社: 小湊鐵道。路線名: 小湊鐵道線。鉄道区分: 普通鉄道（12）。事業者種別: 民営鉄道（4）。

緑園都市
type: Concept
alternative label: 緑園都市（相模鉄道 相鉄いずみ野線）
broader: g004714
in scheme: scheme
notation: 004714
scope note: 運営会社: 相模鉄道。路線名: 相鉄いずみ野線。鉄道区分: 普通鉄道（12）。事業者種別: 民営鉄道（4）。

本厚木
type: Concept
alternative label: 本厚木（小田急電鉄 小田原線）
broader: g004715
in scheme: scheme
notation: 004715
scope note: 運営会社: 小田急電鉄。路線名: 小田原線。鉄道区分: 普通鉄道（12）。事業者種別: 民営鉄道（4）。

石川町
type: Concept
alternative label: 石川町（東日本旅客鉄道 根岸線）
broader: g004716
in scheme: scheme
notation: 004716
scope note: 運営会社: 東日本旅客鉄道。路線名: 根岸線。鉄道区分: 普通鉄道JR（11）。事業者種別: JR在来線（2）。

武並
type: Concept
alternative label: 武並（東海旅客鉄道 中央線）
broader: g004717
in scheme: scheme
notation: 004717
scope note: 運営会社: 東海旅客鉄道。路線名: 中央線。鉄道区分: 普通鉄道JR（11）。事業者種別: JR在来線（2）。

阪東橋
type: Concept
alternative label: 阪東橋（横浜市 1号線）
broader: g004718
in scheme: scheme
notation: 004718
scope note: 運営会社: 横浜市。路線名: 1号線。鉄道区分: 普通鉄道（12）。事業者種別: 公営鉄道（3）。

南太田
type: Concept
alternative label: 南太田（京浜急行電鉄 本線）
broader: g004719
in scheme: scheme
notation: 004719
scope note: 運営会社: 京浜急行電鉄。路線名: 本線。鉄道区分: 普通鉄道（12）。事業者種別: 民営鉄道（4）。

池野
type: Concept
alternative label: 池野（養老鉄道 養老線）
broader: g004720
in scheme: scheme
notation: 004720
scope note: 運営会社: 養老鉄道。路線名: 養老線。鉄道区分: 普通鉄道（12）。事業者種別: 民営鉄道（4）。

吉野町
type: Concept
alternative label: 吉野町（横浜市 1号線）
broader: g004721
in scheme: scheme
notation: 004721
scope note: 運営会社: 横浜市。路線名: 1号線。鉄道区分: 普通鉄道（12）。事業者種別: 公営鉄道（3）。

富士見町
type: Concept
alternative label: 富士見町（西日本旅客鉄道 境線）
broader: g004722
in scheme: scheme
notation: 004722
scope note: 運営会社: 西日本旅客鉄道。路線名: 境線。鉄道区分: 普通鉄道JR（11）。事業者種別: JR在来線（2）。

顔戸
type: Concept
alternative label: 顔戸（名古屋鉄道 広見線）
broader: g004723
in scheme: scheme
notation: 004723
scope note: 運営会社: 名古屋鉄道。路線名: 広見線。鉄道区分: 普通鉄道（12）。事業者種別: 民営鉄道（4）。

井土ヶ谷
type: Concept
alternative label: 井土ヶ谷（京浜急行電鉄 本線）
broader: g004724
in scheme: scheme
notation: 004724
scope note: 運営会社: 京浜急行電鉄。路線名: 本線。鉄道区分: 普通鉄道（12）。事業者種別: 民営鉄道（4）。

明智
type: Concept
alternative label: 明智（名古屋鉄道 広見線）
broader: g004725
in scheme: scheme
notation: 004725
scope note: 運営会社: 名古屋鉄道。路線名: 広見線。鉄道区分: 普通鉄道（12）。事業者種別: 民営鉄道（4）。

日本ライン今渡
type: Concept
alternative label: 日本ライン今渡（名古屋鉄道 広見線）
broader: g004726
in scheme: scheme
notation: 004726
scope note: 運営会社: 名古屋鉄道。路線名: 広見線。鉄道区分: 普通鉄道（12）。事業者種別: 民営鉄道（4）。

雲州平田
type: Concept
alternative label: 雲州平田（一畑電車 北松江線）
broader: g004727
in scheme: scheme
notation: 004727
scope note: 運営会社: 一畑電車。路線名: 北松江線。鉄道区分: 普通鉄道（12）。事業者種別: 民営鉄道（4）。

大江山口内宮
type: Concept
alternative label: 大江山口内宮（WILLER TRAINS 宮福線）
broader: g004728
in scheme: scheme
notation: 004728
scope note: 運営会社: WILLER TRAINS。路線名: 宮福線。鉄道区分: 普通鉄道（12）。事業者種別: 第三セクター（5）。

高座渋谷
type: Concept
alternative label: 高座渋谷（小田急電鉄 江ノ島線）
broader: g004729
in scheme: scheme
notation: 004729
scope note: 運営会社: 小田急電鉄。路線名: 江ノ島線。鉄道区分: 普通鉄道（12）。事業者種別: 民営鉄道（4）。

袖ヶ浦
type: Concept
alternative label: 袖ヶ浦（東日本旅客鉄道 内房線）
broader: g004730
in scheme: scheme
notation: 004730
scope note: 運営会社: 東日本旅客鉄道。路線名: 内房線。鉄道区分: 普通鉄道JR（11）。事業者種別: JR在来線（2）。

荒島
type: Concept
alternative label: 荒島（西日本旅客鉄道 山陰線）
broader: g004731
in scheme: scheme
notation: 004731
scope note: 運営会社: 西日本旅客鉄道。路線名: 山陰線。鉄道区分: 普通鉄道JR（11）。事業者種別: JR在来線（2）。

阿夫利神社
type: Concept
alternative label: 阿夫利神社（大山観光電鉄 大山鋼索線）
broader: g004732
in scheme: scheme
notation: 004732
scope note: 運営会社: 大山観光電鉄。路線名: 大山鋼索線。鉄道区分: 鋼索鉄道（13）。事業者種別: 民営鉄道（4）。

博労町
type: Concept
alternative label: 博労町（西日本旅客鉄道 境線）
broader: g004733
in scheme: scheme
notation: 004733
scope note: 運営会社: 西日本旅客鉄道。路線名: 境線。鉄道区分: 普通鉄道JR（11）。事業者種別: JR在来線（2）。

御嵩口
type: Concept
alternative label: 御嵩口（名古屋鉄道 広見線）
broader: g004734
in scheme: scheme
notation: 004734
scope note: 運営会社: 名古屋鉄道。路線名: 広見線。鉄道区分: 普通鉄道（12）。事業者種別: 民営鉄道（4）。

東山公園
type: Concept
alternative label: 東山公園（西日本旅客鉄道 山陰線）
broader: g004735
in scheme: scheme
notation: 004735
scope note: 運営会社: 西日本旅客鉄道。路線名: 山陰線。鉄道区分: 普通鉄道JR（11）。事業者種別: JR在来線（2）。

玉造温泉
type: Concept
alternative label: 玉造温泉（西日本旅客鉄道 山陰線）
broader: g004736
in scheme: scheme
notation: 004736
scope note: 運営会社: 西日本旅客鉄道。路線名: 山陰線。鉄道区分: 普通鉄道JR（11）。事業者種別: JR在来線（2）。

蒔田
type: Concept
alternative label: 蒔田（横浜市 1号線）
broader: g004737
in scheme: scheme
notation: 004737
scope note: 運営会社: 横浜市。路線名: 1号線。鉄道区分: 普通鉄道（12）。事業者種別: 公営鉄道（3）。

伯耆大山
type: Concept
alternative label: 伯耆大山（西日本旅客鉄道 山陰線）
broader: g004738
in scheme: scheme
notation: 004738
scope note: 運営会社: 西日本旅客鉄道。路線名: 山陰線。鉄道区分: 普通鉄道JR（11）。事業者種別: JR在来線（2）。

伯耆大山
type: Concept
alternative label: 伯耆大山（西日本旅客鉄道 伯備線）
broader: g004738
in scheme: scheme
notation: 004739
scope note: 運営会社: 西日本旅客鉄道。路線名: 伯備線。鉄道区分: 普通鉄道JR（11）。事業者種別: JR在来線（2）。

北神戸
type: Concept
alternative label: 北神戸（養老鉄道 養老線）
broader: g004740
in scheme: scheme
notation: 004740
scope note: 運営会社: 養老鉄道。路線名: 養老線。鉄道区分: 普通鉄道（12）。事業者種別: 民営鉄道（4）。

東戸塚
type: Concept
alternative label: 東戸塚（東日本旅客鉄道 東海道線）
broader: g004741
in scheme: scheme
notation: 004741
scope note: 運営会社: 東日本旅客鉄道。路線名: 東海道線。鉄道区分: 普通鉄道JR（11）。事業者種別: JR在来線（2）。

弥生台
type: Concept
alternative label: 弥生台（相模鉄道 相鉄いずみ野線）
broader: g004742
in scheme: scheme
notation: 004742
scope note: 運営会社: 相模鉄道。路線名: 相鉄いずみ野線。鉄道区分: 普通鉄道（12）。事業者種別: 民営鉄道（4）。

大山寺
type: Concept
alternative label: 大山寺（大山観光電鉄 大山鋼索線）
broader: g004743
in scheme: scheme
notation: 004743
scope note: 運営会社: 大山観光電鉄。路線名: 大山鋼索線。鉄道区分: 鋼索鉄道（13）。事業者種別: 民営鉄道（4）。

御嵩
type: Concept
alternative label: 御嵩（名古屋鉄道 広見線）
broader: g004744
in scheme: scheme
notation: 004744
scope note: 運営会社: 名古屋鉄道。路線名: 広見線。鉄道区分: 普通鉄道（12）。事業者種別: 民営鉄道（4）。

いずみ野
type: Concept
alternative label: いずみ野（相模鉄道 相鉄いずみ野線）
broader: g004745
in scheme: scheme
notation: 004745
scope note: 運営会社: 相模鉄道。路線名: 相鉄いずみ野線。鉄道区分: 普通鉄道（12）。事業者種別: 民営鉄道（4）。

千代
type: Concept
alternative label: 千代（東海旅客鉄道 飯田線）
broader: g004746
in scheme: scheme
notation: 004746
scope note: 運営会社: 東海旅客鉄道。路線名: 飯田線。鉄道区分: 普通鉄道JR（11）。事業者種別: JR在来線（2）。

東郡家
type: Concept
alternative label: 東郡家（西日本旅客鉄道 因美線）
broader: g004747
in scheme: scheme
notation: 004747
scope note: 運営会社: 西日本旅客鉄道。路線名: 因美線。鉄道区分: 普通鉄道JR（11）。事業者種別: JR在来線（2）。

安来
type: Concept
alternative label: 安来（西日本旅客鉄道 山陰線）
broader: g004748
in scheme: scheme
notation: 004748
scope note: 運営会社: 西日本旅客鉄道。路線名: 山陰線。鉄道区分: 普通鉄道JR（11）。事業者種別: JR在来線（2）。

大山ケーブル
type: Concept
alternative label: 大山ケーブル（大山観光電鉄 大山鋼索線）
broader: g004749
in scheme: scheme
notation: 004749
scope note: 運営会社: 大山観光電鉄。路線名: 大山鋼索線。鉄道区分: 鋼索鉄道（13）。事業者種別: 民営鉄道（4）。

揖屋
type: Concept
alternative label: 揖屋（西日本旅客鉄道 山陰線）
broader: g004750
in scheme: scheme
notation: 004750
scope note: 運営会社: 西日本旅客鉄道。路線名: 山陰線。鉄道区分: 普通鉄道JR（11）。事業者種別: JR在来線（2）。

茂原
type: Concept
alternative label: 茂原（東日本旅客鉄道 外房線）
broader: g004751
in scheme: scheme
notation: 004751
scope note: 運営会社: 東日本旅客鉄道。路線名: 外房線。鉄道区分: 普通鉄道JR（11）。事業者種別: JR在来線（2）。

山手
type: Concept
alternative label: 山手（東日本旅客鉄道 根岸線）
broader: g004752
in scheme: scheme
notation: 004752
scope note: 運営会社: 東日本旅客鉄道。路線名: 根岸線。鉄道区分: 普通鉄道JR（11）。事業者種別: JR在来線（2）。

坂祝
type: Concept
alternative label: 坂祝（東海旅客鉄道 高山線）
broader: g004753
in scheme: scheme
notation: 004753
scope note: 運営会社: 東海旅客鉄道。路線名: 高山線。鉄道区分: 普通鉄道JR（11）。事業者種別: JR在来線（2）。

下部温泉
type: Concept
alternative label: 下部温泉（東海旅客鉄道 身延線）
broader: g004754
in scheme: scheme
notation: 004754
scope note: 運営会社: 東海旅客鉄道。路線名: 身延線。鉄道区分: 普通鉄道JR（11）。事業者種別: JR在来線（2）。

虎姫
type: Concept
alternative label: 虎姫（西日本旅客鉄道 北陸線）
broader: g004755
in scheme: scheme
notation: 004755
scope note: 運営会社: 西日本旅客鉄道。路線名: 北陸線。鉄道区分: 普通鉄道JR（11）。事業者種別: JR在来線（2）。

弘明寺
type: Concept
alternative label: 弘明寺（京浜急行電鉄 本線）
broader: g004756
in scheme: scheme
notation: 004756
scope note: 運営会社: 京浜急行電鉄。路線名: 本線。鉄道区分: 普通鉄道（12）。事業者種別: 民営鉄道（4）。

馬立
type: Concept
alternative label: 馬立（小湊鐵道 小湊鐵道線）
broader: g004757
in scheme: scheme
notation: 004757
scope note: 運営会社: 小湊鐵道。路線名: 小湊鐵道線。鉄道区分: 普通鉄道（12）。事業者種別: 民営鉄道（4）。

米子
type: Concept
alternative label: 米子（西日本旅客鉄道 境線）
broader: g004758
in scheme: scheme
notation: 004758
scope note: 運営会社: 西日本旅客鉄道。路線名: 境線。鉄道区分: 普通鉄道JR（11）。事業者種別: JR在来線（2）。

米子
type: Concept
alternative label: 米子（西日本旅客鉄道 山陰線）
broader: g004758
in scheme: scheme
notation: 004759
scope note: 運営会社: 西日本旅客鉄道。路線名: 山陰線。鉄道区分: 普通鉄道JR（11）。事業者種別: JR在来線（2）。

新可児
type: Concept
alternative label: 新可児（名古屋鉄道 広見線）
broader: g004760
in scheme: scheme
notation: 004760
scope note: 運営会社: 名古屋鉄道。路線名: 広見線。鉄道区分: 普通鉄道（12）。事業者種別: 民営鉄道（4）。

弘明寺
type: Concept
alternative label: 弘明寺（横浜市 1号線）
broader: g004761
in scheme: scheme
notation: 004761
scope note: 運営会社: 横浜市。路線名: 1号線。鉄道区分: 普通鉄道（12）。事業者種別: 公営鉄道（3）。

可児
type: Concept
alternative label: 可児（東海旅客鉄道 太多線）
broader: g004762
in scheme: scheme
notation: 004762
scope note: 運営会社: 東海旅客鉄道。路線名: 太多線。鉄道区分: 普通鉄道JR（11）。事業者種別: JR在来線（2）。

旅伏
type: Concept
alternative label: 旅伏（一畑電車 北松江線）
broader: g004763
in scheme: scheme
notation: 004763
scope note: 運営会社: 一畑電車。路線名: 北松江線。鉄道区分: 普通鉄道（12）。事業者種別: 民営鉄道（4）。

来待
type: Concept
alternative label: 来待（西日本旅客鉄道 山陰線）
broader: g004764
in scheme: scheme
notation: 004764
scope note: 運営会社: 西日本旅客鉄道。路線名: 山陰線。鉄道区分: 普通鉄道JR（11）。事業者種別: JR在来線（2）。

社家
type: Concept
alternative label: 社家（東日本旅客鉄道 相模線）
broader: g004765
in scheme: scheme
notation: 004765
scope note: 運営会社: 東日本旅客鉄道。路線名: 相模線。鉄道区分: 普通鉄道JR（11）。事業者種別: JR在来線（2）。

広神戸
type: Concept
alternative label: 広神戸（養老鉄道 養老線）
broader: g004766
in scheme: scheme
notation: 004766
scope note: 運営会社: 養老鉄道。路線名: 養老線。鉄道区分: 普通鉄道（12）。事業者種別: 民営鉄道（4）。

金野
type: Concept
alternative label: 金野（東海旅客鉄道 飯田線）
broader: g004767
in scheme: scheme
notation: 004767
scope note: 運営会社: 東海旅客鉄道。路線名: 飯田線。鉄道区分: 普通鉄道JR（11）。事業者種別: JR在来線（2）。

飯沼
type: Concept
alternative label: 飯沼（明知鉄道 明知線）
broader: g004768
in scheme: scheme
notation: 004768
scope note: 運営会社: 明知鉄道。路線名: 明知線。鉄道区分: 普通鉄道（12）。事業者種別: 第三セクター（5）。

波高島
type: Concept
alternative label: 波高島（東海旅客鉄道 身延線）
broader: g004769
in scheme: scheme
notation: 004769
scope note: 運営会社: 東海旅客鉄道。路線名: 身延線。鉄道区分: 普通鉄道JR（11）。事業者種別: JR在来線（2）。

可児川
type: Concept
alternative label: 可児川（名古屋鉄道 広見線）
broader: g004770
in scheme: scheme
notation: 004770
scope note: 運営会社: 名古屋鉄道。路線名: 広見線。鉄道区分: 普通鉄道（12）。事業者種別: 民営鉄道（4）。

愛甲石田
type: Concept
alternative label: 愛甲石田（小田急電鉄 小田原線）
broader: g004771
in scheme: scheme
notation: 004771
scope note: 運営会社: 小田急電鉄。路線名: 小田原線。鉄道区分: 普通鉄道（12）。事業者種別: 民営鉄道（4）。

根岸
type: Concept
alternative label: 根岸（東日本旅客鉄道 根岸線）
broader: g004772
in scheme: scheme
notation: 004772
scope note: 運営会社: 東日本旅客鉄道。路線名: 根岸線。鉄道区分: 普通鉄道JR（11）。事業者種別: JR在来線（2）。

いずみ中央
type: Concept
alternative label: いずみ中央（相模鉄道 相鉄いずみ野線）
broader: g004773
in scheme: scheme
notation: 004773
scope note: 運営会社: 相模鉄道。路線名: 相鉄いずみ野線。鉄道区分: 普通鉄道（12）。事業者種別: 民営鉄道（4）。

巌根
type: Concept
alternative label: 巌根（東日本旅客鉄道 内房線）
broader: g004774
in scheme: scheme
notation: 004774
scope note: 運営会社: 東日本旅客鉄道。路線名: 内房線。鉄道区分: 普通鉄道JR（11）。事業者種別: JR在来線（2）。

立場
type: Concept
alternative label: 立場（横浜市 1号線）
broader: g004775
in scheme: scheme
notation: 004775
scope note: 運営会社: 横浜市。路線名: 1号線。鉄道区分: 普通鉄道（12）。事業者種別: 公営鉄道（3）。

八鹿
type: Concept
alternative label: 八鹿（西日本旅客鉄道 山陰線）
broader: g004776
in scheme: scheme
notation: 004776
scope note: 運営会社: 西日本旅客鉄道。路線名: 山陰線。鉄道区分: 普通鉄道JR（11）。事業者種別: JR在来線（2）。

美江寺
type: Concept
alternative label: 美江寺（樽見鉄道 樽見線）
broader: g004777
in scheme: scheme
notation: 004777
scope note: 運営会社: 樽見鉄道。路線名: 樽見線。鉄道区分: 普通鉄道（12）。事業者種別: 第三セクター（5）。

二俣
type: Concept
alternative label: 二俣（WILLER TRAINS 宮福線）
broader: g004778
in scheme: scheme
notation: 004778
scope note: 運営会社: WILLER TRAINS。路線名: 宮福線。鉄道区分: 普通鉄道（12）。事業者種別: 第三セクター（5）。

郡家
type: Concept
alternative label: 郡家（西日本旅客鉄道 因美線）
broader: g004779
in scheme: scheme
notation: 004779
scope note: 運営会社: 西日本旅客鉄道。路線名: 因美線。鉄道区分: 普通鉄道JR（11）。事業者種別: JR在来線（2）。

郡家
type: Concept
alternative label: 郡家（若桜鉄道 若桜線）
broader: g004779
in scheme: scheme
notation: 004780
scope note: 運営会社: 若桜鉄道。路線名: 若桜線。鉄道区分: 普通鉄道（12）。事業者種別: 第三セクター（5）。

美談
type: Concept
alternative label: 美談（一畑電車 北松江線）
broader: g004781
in scheme: scheme
notation: 004781
scope note: 運営会社: 一畑電車。路線名: 北松江線。鉄道区分: 普通鉄道（12）。事業者種別: 民営鉄道（4）。

長後
type: Concept
alternative label: 長後（小田急電鉄 江ノ島線）
broader: g004782
in scheme: scheme
notation: 004782
scope note: 運営会社: 小田急電鉄。路線名: 江ノ島線。鉄道区分: 普通鉄道（12）。事業者種別: 民営鉄道（4）。

名鉄岐阜
type: Concept
alternative label: 名鉄岐阜（名古屋鉄道 各務原線）
broader: g004783
in scheme: scheme
notation: 004783
scope note: 運営会社: 名古屋鉄道。路線名: 各務原線。鉄道区分: 普通鉄道（12）。事業者種別: 民営鉄道（4）。

田神
type: Concept
alternative label: 田神（名古屋鉄道 各務原線）
broader: g004784
in scheme: scheme
notation: 004784
scope note: 運営会社: 名古屋鉄道。路線名: 各務原線。鉄道区分: 普通鉄道（12）。事業者種別: 民営鉄道（4）。

釜戸
type: Concept
alternative label: 釜戸（東海旅客鉄道 中央線）
broader: g004785
in scheme: scheme
notation: 004785
scope note: 運営会社: 東海旅客鉄道。路線名: 中央線。鉄道区分: 普通鉄道JR（11）。事業者種別: JR在来線（2）。

中田
type: Concept
alternative label: 中田（横浜市 1号線）
broader: g004786
in scheme: scheme
notation: 004786
scope note: 運営会社: 横浜市。路線名: 1号線。鉄道区分: 普通鉄道（12）。事業者種別: 公営鉄道（3）。

名鉄岐阜
type: Concept
alternative label: 名鉄岐阜（名古屋鉄道 名古屋本線）
broader: g004783
in scheme: scheme
notation: 004787
scope note: 運営会社: 名古屋鉄道。路線名: 名古屋本線。鉄道区分: 普通鉄道（12）。事業者種別: 民営鉄道（4）。

岐阜
type: Concept
alternative label: 岐阜（東海旅客鉄道 高山線）
broader: g004788
in scheme: scheme
notation: 004788
scope note: 運営会社: 東海旅客鉄道。路線名: 高山線。鉄道区分: 普通鉄道JR（11）。事業者種別: JR在来線（2）。

岐阜
type: Concept
alternative label: 岐阜（東海旅客鉄道 東海道線）
broader: g004788
in scheme: scheme
notation: 004789
scope note: 運営会社: 東海旅客鉄道。路線名: 東海道線。鉄道区分: 普通鉄道JR（11）。事業者種別: JR在来線（2）。

上大岡
type: Concept
alternative label: 上大岡（京浜急行電鉄 本線）
broader: g004790
in scheme: scheme
notation: 004790
scope note: 運営会社: 京浜急行電鉄。路線名: 本線。鉄道区分: 普通鉄道（12）。事業者種別: 民営鉄道（4）。

上大岡
type: Concept
alternative label: 上大岡（横浜市 1号線）
broader: g004790
in scheme: scheme
notation: 004791
scope note: 運営会社: 横浜市。路線名: 1号線。鉄道区分: 普通鉄道（12）。事業者種別: 公営鉄道（3）。

真倉
type: Concept
alternative label: 真倉（西日本旅客鉄道 舞鶴線）
broader: g004792
in scheme: scheme
notation: 004792
scope note: 運営会社: 西日本旅客鉄道。路線名: 舞鶴線。鉄道区分: 普通鉄道JR（11）。事業者種別: JR在来線（2）。

宍道
type: Concept
alternative label: 宍道（西日本旅客鉄道 山陰線）
broader: g004793
in scheme: scheme
notation: 004793
scope note: 運営会社: 西日本旅客鉄道。路線名: 山陰線。鉄道区分: 普通鉄道JR（11）。事業者種別: JR在来線（2）。

宍道
type: Concept
alternative label: 宍道（西日本旅客鉄道 木次線）
broader: g004793
in scheme: scheme
notation: 004794
scope note: 運営会社: 西日本旅客鉄道。路線名: 木次線。鉄道区分: 普通鉄道JR（11）。事業者種別: JR在来線（2）。

門沢橋
type: Concept
alternative label: 門沢橋（東日本旅客鉄道 相模線）
broader: g004795
in scheme: scheme
notation: 004795
scope note: 運営会社: 東日本旅客鉄道。路線名: 相模線。鉄道区分: 普通鉄道JR（11）。事業者種別: JR在来線（2）。

踊場
type: Concept
alternative label: 踊場（横浜市 1号線）
broader: g004796
in scheme: scheme
notation: 004796
scope note: 運営会社: 横浜市。路線名: 1号線。鉄道区分: 普通鉄道（12）。事業者種別: 公営鉄道（3）。

ゆめが丘
type: Concept
alternative label: ゆめが丘（相模鉄道 相鉄いずみ野線）
broader: g004797
in scheme: scheme
notation: 004797
scope note: 運営会社: 相模鉄道。路線名: 相鉄いずみ野線。鉄道区分: 普通鉄道（12）。事業者種別: 民営鉄道（4）。

八頭高校前
type: Concept
alternative label: 八頭高校前（若桜鉄道 若桜線）
broader: g004798
in scheme: scheme
notation: 004798
scope note: 運営会社: 若桜鉄道。路線名: 若桜線。鉄道区分: 普通鉄道（12）。事業者種別: 第三セクター（5）。

加納
type: Concept
alternative label: 加納（名古屋鉄道 名古屋本線）
broader: g004799
in scheme: scheme
notation: 004799
scope note: 運営会社: 名古屋鉄道。路線名: 名古屋本線。鉄道区分: 普通鉄道（12）。事業者種別: 民営鉄道（4）。

西可児
type: Concept
alternative label: 西可児（名古屋鉄道 広見線）
broader: g004800
in scheme: scheme
notation: 004800
scope note: 運営会社: 名古屋鉄道。路線名: 広見線。鉄道区分: 普通鉄道（12）。事業者種別: 民営鉄道（4）。

西岐阜
type: Concept
alternative label: 西岐阜（東海旅客鉄道 東海道線）
broader: g004801
in scheme: scheme
notation: 004801
scope note: 運営会社: 東海旅客鉄道。路線名: 東海道線。鉄道区分: 普通鉄道JR（11）。事業者種別: JR在来線（2）。

大寺
type: Concept
alternative label: 大寺（一畑電車 北松江線）
broader: g004802
in scheme: scheme
notation: 004802
scope note: 運営会社: 一畑電車。路線名: 北松江線。鉄道区分: 普通鉄道（12）。事業者種別: 民営鉄道（4）。

八積
type: Concept
alternative label: 八積（東日本旅客鉄道 外房線）
broader: g004803
in scheme: scheme
notation: 004803
scope note: 運営会社: 東日本旅客鉄道。路線名: 外房線。鉄道区分: 普通鉄道JR（11）。事業者種別: JR在来線（2）。

各務ケ原
type: Concept
alternative label: 各務ケ原（東海旅客鉄道 高山線）
broader: g004804
in scheme: scheme
notation: 004804
scope note: 運営会社: 東海旅客鉄道。路線名: 高山線。鉄道区分: 普通鉄道JR（11）。事業者種別: JR在来線（2）。

下飯田
type: Concept
alternative label: 下飯田（横浜市 1号線）
broader: g004805
in scheme: scheme
notation: 004805
scope note: 運営会社: 横浜市。路線名: 1号線。鉄道区分: 普通鉄道（12）。事業者種別: 公営鉄道（3）。

苧ヶ瀬
type: Concept
alternative label: 苧ヶ瀬（名古屋鉄道 各務原線）
broader: g004806
in scheme: scheme
notation: 004806
scope note: 運営会社: 名古屋鉄道。路線名: 各務原線。鉄道区分: 普通鉄道（12）。事業者種別: 民営鉄道（4）。

蘇原
type: Concept
alternative label: 蘇原（東海旅客鉄道 高山線）
broader: g004807
in scheme: scheme
notation: 004807
scope note: 運営会社: 東海旅客鉄道。路線名: 高山線。鉄道区分: 普通鉄道JR（11）。事業者種別: JR在来線（2）。

下永谷
type: Concept
alternative label: 下永谷（横浜市 1号線）
broader: g004808
in scheme: scheme
notation: 004808
scope note: 運営会社: 横浜市。路線名: 1号線。鉄道区分: 普通鉄道（12）。事業者種別: 公営鉄道（3）。

名電各務原
type: Concept
alternative label: 名電各務原（名古屋鉄道 各務原線）
broader: g004809
in scheme: scheme
notation: 004809
scope note: 運営会社: 名古屋鉄道。路線名: 各務原線。鉄道区分: 普通鉄道（12）。事業者種別: 民営鉄道（4）。

舞岡
type: Concept
alternative label: 舞岡（横浜市 1号線）
broader: g004810
in scheme: scheme
notation: 004810
scope note: 運営会社: 横浜市。路線名: 1号線。鉄道区分: 普通鉄道（12）。事業者種別: 公営鉄道（3）。

唐笠
type: Concept
alternative label: 唐笠（東海旅客鉄道 飯田線）
broader: g004811
in scheme: scheme
notation: 004811
scope note: 運営会社: 東海旅客鉄道。路線名: 飯田線。鉄道区分: 普通鉄道JR（11）。事業者種別: JR在来線（2）。

長森
type: Concept
alternative label: 長森（東海旅客鉄道 高山線）
broader: g004812
in scheme: scheme
notation: 004812
scope note: 運営会社: 東海旅客鉄道。路線名: 高山線。鉄道区分: 普通鉄道JR（11）。事業者種別: JR在来線（2）。

茶所
type: Concept
alternative label: 茶所（名古屋鉄道 名古屋本線）
broader: g004813
in scheme: scheme
notation: 004813
scope note: 運営会社: 名古屋鉄道。路線名: 名古屋本線。鉄道区分: 普通鉄道（12）。事業者種別: 民営鉄道（4）。

細畑
type: Concept
alternative label: 細畑（名古屋鉄道 各務原線）
broader: g004814
in scheme: scheme
notation: 004814
scope note: 運営会社: 名古屋鉄道。路線名: 各務原線。鉄道区分: 普通鉄道（12）。事業者種別: 民営鉄道（4）。

上永谷
type: Concept
alternative label: 上永谷（横浜市 1号線）
broader: g004815
in scheme: scheme
notation: 004815
scope note: 運営会社: 横浜市。路線名: 1号線。鉄道区分: 普通鉄道（12）。事業者種別: 公営鉄道（3）。

港南中央
type: Concept
alternative label: 港南中央（横浜市 1号線）
broader: g004816
in scheme: scheme
notation: 004816
scope note: 運営会社: 横浜市。路線名: 1号線。鉄道区分: 普通鉄道（12）。事業者種別: 公営鉄道（3）。

羽場
type: Concept
alternative label: 羽場（名古屋鉄道 各務原線）
broader: g004817
in scheme: scheme
notation: 004817
scope note: 運営会社: 名古屋鉄道。路線名: 各務原線。鉄道区分: 普通鉄道（12）。事業者種別: 民営鉄道（4）。

戸塚
type: Concept
alternative label: 戸塚（横浜市 1号線）
broader: g004818
in scheme: scheme
notation: 004818
scope note: 運営会社: 横浜市。路線名: 1号線。鉄道区分: 普通鉄道（12）。事業者種別: 公営鉄道（3）。

六軒
type: Concept
alternative label: 六軒（名古屋鉄道 各務原線）
broader: g004819
in scheme: scheme
notation: 004819
scope note: 運営会社: 名古屋鉄道。路線名: 各務原線。鉄道区分: 普通鉄道（12）。事業者種別: 民営鉄道（4）。

各務原市役所前
type: Concept
alternative label: 各務原市役所前（名古屋鉄道 各務原線）
broader: g004820
in scheme: scheme
notation: 004820
scope note: 運営会社: 名古屋鉄道。路線名: 各務原線。鉄道区分: 普通鉄道（12）。事業者種別: 民営鉄道（4）。

磯子
type: Concept
alternative label: 磯子（東日本旅客鉄道 根岸線）
broader: g004821
in scheme: scheme
notation: 004821
scope note: 運営会社: 東日本旅客鉄道。路線名: 根岸線。鉄道区分: 普通鉄道JR（11）。事業者種別: JR在来線（2）。

市民公園前
type: Concept
alternative label: 市民公園前（名古屋鉄道 各務原線）
broader: g004822
in scheme: scheme
notation: 004822
scope note: 運営会社: 名古屋鉄道。路線名: 各務原線。鉄道区分: 普通鉄道（12）。事業者種別: 民営鉄道（4）。

那加
type: Concept
alternative label: 那加（東海旅客鉄道 高山線）
broader: g004823
in scheme: scheme
notation: 004823
scope note: 運営会社: 東海旅客鉄道。路線名: 高山線。鉄道区分: 普通鉄道JR（11）。事業者種別: JR在来線（2）。

戸塚
type: Concept
alternative label: 戸塚（東日本旅客鉄道 東海道線）
broader: g004818
in scheme: scheme
notation: 004824
scope note: 運営会社: 東日本旅客鉄道。路線名: 東海道線。鉄道区分: 普通鉄道JR（11）。事業者種別: JR在来線（2）。

切通
type: Concept
alternative label: 切通（名古屋鉄道 各務原線）
broader: g004825
in scheme: scheme
notation: 004825
scope note: 運営会社: 名古屋鉄道。路線名: 各務原線。鉄道区分: 普通鉄道（12）。事業者種別: 民営鉄道（4）。

上総牛久
type: Concept
alternative label: 上総牛久（小湊鐵道 小湊鐵道線）
broader: g004826
in scheme: scheme
notation: 004826
scope note: 運営会社: 小湊鐵道。路線名: 小湊鐵道線。鉄道区分: 普通鉄道（12）。事業者種別: 民営鉄道（4）。

二十軒
type: Concept
alternative label: 二十軒（名古屋鉄道 各務原線）
broader: g004827
in scheme: scheme
notation: 004827
scope note: 運営会社: 名古屋鉄道。路線名: 各務原線。鉄道区分: 普通鉄道（12）。事業者種別: 民営鉄道（4）。

新那加
type: Concept
alternative label: 新那加（名古屋鉄道 各務原線）
broader: g004828
in scheme: scheme
notation: 004828
scope note: 運営会社: 名古屋鉄道。路線名: 各務原線。鉄道区分: 普通鉄道（12）。事業者種別: 民営鉄道（4）。

三柿野
type: Concept
alternative label: 三柿野（名古屋鉄道 各務原線）
broader: g004829
in scheme: scheme
notation: 004829
scope note: 運営会社: 名古屋鉄道。路線名: 各務原線。鉄道区分: 普通鉄道（12）。事業者種別: 民営鉄道（4）。

鵜沼宿
type: Concept
alternative label: 鵜沼宿（名古屋鉄道 各務原線）
broader: g004830
in scheme: scheme
notation: 004830
scope note: 運営会社: 名古屋鉄道。路線名: 各務原線。鉄道区分: 普通鉄道（12）。事業者種別: 民営鉄道（4）。

阿木
type: Concept
alternative label: 阿木（明知鉄道 明知線）
broader: g004831
in scheme: scheme
notation: 004831
scope note: 運営会社: 明知鉄道。路線名: 明知線。鉄道区分: 普通鉄道（12）。事業者種別: 第三セクター（5）。

新加納
type: Concept
alternative label: 新加納（名古屋鉄道 各務原線）
broader: g004832
in scheme: scheme
notation: 004832
scope note: 運営会社: 名古屋鉄道。路線名: 各務原線。鉄道区分: 普通鉄道（12）。事業者種別: 民営鉄道（4）。

高田橋
type: Concept
alternative label: 高田橋（名古屋鉄道 各務原線）
broader: g004833
in scheme: scheme
notation: 004833
scope note: 運営会社: 名古屋鉄道。路線名: 各務原線。鉄道区分: 普通鉄道（12）。事業者種別: 民営鉄道（4）。

手力
type: Concept
alternative label: 手力（名古屋鉄道 各務原線）
broader: g004834
in scheme: scheme
notation: 004834
scope note: 運営会社: 名古屋鉄道。路線名: 各務原線。鉄道区分: 普通鉄道（12）。事業者種別: 民営鉄道（4）。

近江今津
type: Concept
alternative label: 近江今津（西日本旅客鉄道 湖西線）
broader: g004835
in scheme: scheme
notation: 004835
scope note: 運営会社: 西日本旅客鉄道。路線名: 湖西線。鉄道区分: 普通鉄道JR（11）。事業者種別: JR在来線（2）。

鵜沼
type: Concept
alternative label: 鵜沼（東海旅客鉄道 高山線）
broader: g004836
in scheme: scheme
notation: 004836
scope note: 運営会社: 東海旅客鉄道。路線名: 高山線。鉄道区分: 普通鉄道JR（11）。事業者種別: JR在来線（2）。

河原
type: Concept
alternative label: 河原（西日本旅客鉄道 因美線）
broader: g004837
in scheme: scheme
notation: 004837
scope note: 運営会社: 西日本旅客鉄道。路線名: 因美線。鉄道区分: 普通鉄道JR（11）。事業者種別: JR在来線（2）。

新鵜沼
type: Concept
alternative label: 新鵜沼（名古屋鉄道 各務原線）
broader: g004838
in scheme: scheme
notation: 004838
scope note: 運営会社: 名古屋鉄道。路線名: 各務原線。鉄道区分: 普通鉄道（12）。事業者種別: 民営鉄道（4）。

新鵜沼
type: Concept
alternative label: 新鵜沼（名古屋鉄道 犬山線）
broader: g004838
in scheme: scheme
notation: 004839
scope note: 運営会社: 名古屋鉄道。路線名: 犬山線。鉄道区分: 普通鉄道（12）。事業者種別: 民営鉄道（4）。

湘南台
type: Concept
alternative label: 湘南台（小田急電鉄 江ノ島線）
broader: g004842
in scheme: scheme
notation: 004840
scope note: 運営会社: 小田急電鉄。路線名: 江ノ島線。鉄道区分: 普通鉄道（12）。事業者種別: 民営鉄道（4）。

穂積
type: Concept
alternative label: 穂積（東海旅客鉄道 東海道線）
broader: g004841
in scheme: scheme
notation: 004841
scope note: 運営会社: 東海旅客鉄道。路線名: 東海道線。鉄道区分: 普通鉄道JR（11）。事業者種別: JR在来線（2）。

湘南台
type: Concept
alternative label: 湘南台（横浜市 1号線）
broader: g004842
in scheme: scheme
notation: 004842
scope note: 運営会社: 横浜市。路線名: 1号線。鉄道区分: 普通鉄道（12）。事業者種別: 公営鉄道（3）。

湘南台
type: Concept
alternative label: 湘南台（相模鉄道 相鉄いずみ野線）
broader: g004842
in scheme: scheme
notation: 004843
scope note: 運営会社: 相模鉄道。路線名: 相鉄いずみ野線。鉄道区分: 普通鉄道（12）。事業者種別: 民営鉄道（4）。

伊勢原
type: Concept
alternative label: 伊勢原（小田急電鉄 小田原線）
broader: g004844
in scheme: scheme
notation: 004844
scope note: 運営会社: 小田急電鉄。路線名: 小田原線。鉄道区分: 普通鉄道（12）。事業者種別: 民営鉄道（4）。

大江高校前
type: Concept
alternative label: 大江高校前（WILLER TRAINS 宮福線）
broader: g004845
in scheme: scheme
notation: 004845
scope note: 運営会社: WILLER TRAINS。路線名: 宮福線。鉄道区分: 普通鉄道（12）。事業者種別: 第三セクター（5）。

十九条
type: Concept
alternative label: 十九条（樽見鉄道 樽見線）
broader: g004846
in scheme: scheme
notation: 004846
scope note: 運営会社: 樽見鉄道。路線名: 樽見線。鉄道区分: 普通鉄道（12）。事業者種別: 第三セクター（5）。

因幡船岡
type: Concept
alternative label: 因幡船岡（若桜鉄道 若桜線）
broader: g004847
in scheme: scheme
notation: 004847
scope note: 運営会社: 若桜鉄道。路線名: 若桜線。鉄道区分: 普通鉄道（12）。事業者種別: 第三セクター（5）。

川跡
type: Concept
alternative label: 川跡（一畑電車 大社線）
broader: g004848
in scheme: scheme
notation: 004848
scope note: 運営会社: 一畑電車。路線名: 大社線。鉄道区分: 普通鉄道（12）。事業者種別: 民営鉄道（4）。

川跡
type: Concept
alternative label: 川跡（一畑電車 北松江線）
broader: g004848
in scheme: scheme
notation: 004849
scope note: 運営会社: 一畑電車。路線名: 北松江線。鉄道区分: 普通鉄道（12）。事業者種別: 民営鉄道（4）。

倉見
type: Concept
alternative label: 倉見（東日本旅客鉄道 相模線）
broader: g004850
in scheme: scheme
notation: 004850
scope note: 運営会社: 東日本旅客鉄道。路線名: 相模線。鉄道区分: 普通鉄道JR（11）。事業者種別: JR在来線（2）。

東赤坂
type: Concept
alternative label: 東赤坂（養老鉄道 養老線）
broader: g004851
in scheme: scheme
notation: 004851
scope note: 運営会社: 養老鉄道。路線名: 養老線。鉄道区分: 普通鉄道（12）。事業者種別: 民営鉄道（4）。

屏風浦
type: Concept
alternative label: 屏風浦（京浜急行電鉄 本線）
broader: g004852
in scheme: scheme
notation: 004852
scope note: 運営会社: 京浜急行電鉄。路線名: 本線。鉄道区分: 普通鉄道（12）。事業者種別: 民営鉄道（4）。

下切
type: Concept
alternative label: 下切（東海旅客鉄道 太多線）
broader: g004853
in scheme: scheme
notation: 004853
scope note: 運営会社: 東海旅客鉄道。路線名: 太多線。鉄道区分: 普通鉄道JR（11）。事業者種別: JR在来線（2）。

荘原
type: Concept
alternative label: 荘原（西日本旅客鉄道 山陰線）
broader: g004854
in scheme: scheme
notation: 004854
scope note: 運営会社: 西日本旅客鉄道。路線名: 山陰線。鉄道区分: 普通鉄道JR（11）。事業者種別: JR在来線（2）。

出雲大社前
type: Concept
alternative label: 出雲大社前（一畑電車 大社線）
broader: g004855
in scheme: scheme
notation: 004855
scope note: 運営会社: 一畑電車。路線名: 大社線。鉄道区分: 普通鉄道（12）。事業者種別: 民営鉄道（4）。

祇園
type: Concept
alternative label: 祇園（東日本旅客鉄道 久留里線）
broader: g004856
in scheme: scheme
notation: 004856
scope note: 運営会社: 東日本旅客鉄道。路線名: 久留里線。鉄道区分: 普通鉄道JR（11）。事業者種別: JR在来線（2）。

上総清川
type: Concept
alternative label: 上総清川（東日本旅客鉄道 久留里線）
broader: g004857
in scheme: scheme
notation: 004857
scope note: 運営会社: 東日本旅客鉄道。路線名: 久留里線。鉄道区分: 普通鉄道JR（11）。事業者種別: JR在来線（2）。

高浜
type: Concept
alternative label: 高浜（一畑電車 大社線）
broader: g004858
in scheme: scheme
notation: 004858
scope note: 運営会社: 一畑電車。路線名: 大社線。鉄道区分: 普通鉄道（12）。事業者種別: 民営鉄道（4）。

犬山遊園
type: Concept
alternative label: 犬山遊園（名古屋鉄道 犬山線）
broader: g004859
in scheme: scheme
notation: 004859
scope note: 運営会社: 名古屋鉄道。路線名: 犬山線。鉄道区分: 普通鉄道（12）。事業者種別: 民営鉄道（4）。

東清川
type: Concept
alternative label: 東清川（東日本旅客鉄道 久留里線）
broader: g004860
in scheme: scheme
notation: 004860
scope note: 運営会社: 東日本旅客鉄道。路線名: 久留里線。鉄道区分: 普通鉄道JR（11）。事業者種別: JR在来線（2）。

善師野
type: Concept
alternative label: 善師野（名古屋鉄道 広見線）
broader: g004861
in scheme: scheme
notation: 004861
scope note: 運営会社: 名古屋鉄道。路線名: 広見線。鉄道区分: 普通鉄道（12）。事業者種別: 民営鉄道（4）。

岐南
type: Concept
alternative label: 岐南（名古屋鉄道 名古屋本線）
broader: g004862
in scheme: scheme
notation: 004862
scope note: 運営会社: 名古屋鉄道。路線名: 名古屋本線。鉄道区分: 普通鉄道（12）。事業者種別: 民営鉄道（4）。

遥堪
type: Concept
alternative label: 遥堪（一畑電車 大社線）
broader: g004863
in scheme: scheme
notation: 004863
scope note: 運営会社: 一畑電車。路線名: 大社線。鉄道区分: 普通鉄道（12）。事業者種別: 民営鉄道（4）。

浜山公園北口
type: Concept
alternative label: 浜山公園北口（一畑電車 大社線）
broader: g004864
in scheme: scheme
notation: 004864
scope note: 運営会社: 一畑電車。路線名: 大社線。鉄道区分: 普通鉄道（12）。事業者種別: 民営鉄道（4）。

大江
type: Concept
alternative label: 大江（WILLER TRAINS 宮福線）
broader: g004865
in scheme: scheme
notation: 004865
scope note: 運営会社: WILLER TRAINS。路線名: 宮福線。鉄道区分: 普通鉄道（12）。事業者種別: 第三セクター（5）。

隼
type: Concept
alternative label: 隼（若桜鉄道 若桜線）
broader: g004866
in scheme: scheme
notation: 004866
scope note: 運営会社: 若桜鉄道。路線名: 若桜線。鉄道区分: 普通鉄道（12）。事業者種別: 第三セクター（5）。

上総川間
type: Concept
alternative label: 上総川間（小湊鐵道 小湊鐵道線）
broader: g004867
in scheme: scheme
notation: 004867
scope note: 運営会社: 小湊鐵道。路線名: 小湊鐵道線。鉄道区分: 普通鉄道（12）。事業者種別: 民営鉄道（4）。

武志
type: Concept
alternative label: 武志（一畑電車 北松江線）
broader: g004868
in scheme: scheme
notation: 004868
scope note: 運営会社: 一畑電車。路線名: 北松江線。鉄道区分: 普通鉄道（12）。事業者種別: 民営鉄道（4）。

岸本
type: Concept
alternative label: 岸本（西日本旅客鉄道 伯備線）
broader: g004869
in scheme: scheme
notation: 004869
scope note: 運営会社: 西日本旅客鉄道。路線名: 伯備線。鉄道区分: 普通鉄道JR（11）。事業者種別: JR在来線（2）。

飯羽間
type: Concept
alternative label: 飯羽間（明知鉄道 明知線）
broader: g004870
in scheme: scheme
notation: 004870
scope note: 運営会社: 明知鉄道。路線名: 明知線。鉄道区分: 普通鉄道（12）。事業者種別: 第三セクター（5）。

横屋
type: Concept
alternative label: 横屋（樽見鉄道 樽見線）
broader: g004871
in scheme: scheme
notation: 004871
scope note: 運営会社: 樽見鉄道。路線名: 樽見線。鉄道区分: 普通鉄道（12）。事業者種別: 第三セクター（5）。

新杉田
type: Concept
alternative label: 新杉田（東日本旅客鉄道 根岸線）
broader: g004872
in scheme: scheme
notation: 004872
scope note: 運営会社: 東日本旅客鉄道。路線名: 根岸線。鉄道区分: 普通鉄道JR（11）。事業者種別: JR在来線（2）。

美濃赤坂
type: Concept
alternative label: 美濃赤坂（東海旅客鉄道 東海道線）
broader: g004873
in scheme: scheme
notation: 004873
scope note: 運営会社: 東海旅客鉄道。路線名: 東海道線。鉄道区分: 普通鉄道JR（11）。事業者種別: JR在来線（2）。

横田
type: Concept
alternative label: 横田（東日本旅客鉄道 久留里線）
broader: g004874
in scheme: scheme
notation: 004874
scope note: 運営会社: 東日本旅客鉄道。路線名: 久留里線。鉄道区分: 普通鉄道JR（11）。事業者種別: JR在来線（2）。

東横田
type: Concept
alternative label: 東横田（東日本旅客鉄道 久留里線）
broader: g004875
in scheme: scheme
notation: 004875
scope note: 運営会社: 東日本旅客鉄道。路線名: 久留里線。鉄道区分: 普通鉄道JR（11）。事業者種別: JR在来線（2）。

新杉田
type: Concept
alternative label: 新杉田（横浜シーサイドライン 金沢シーサイドライン）
broader: g004872
in scheme: scheme
notation: 004876
scope note: 運営会社: 横浜シーサイドライン。路線名: 金沢シーサイドライン。鉄道区分: 案内軌条式（24）。事業者種別: 第三セクター（5）。

杉田
type: Concept
alternative label: 杉田（京浜急行電鉄 本線）
broader: g004877
in scheme: scheme
notation: 004877
scope note: 運営会社: 京浜急行電鉄。路線名: 本線。鉄道区分: 普通鉄道（12）。事業者種別: 民営鉄道（4）。

六会日大前
type: Concept
alternative label: 六会日大前（小田急電鉄 江ノ島線）
broader: g004878
in scheme: scheme
notation: 004878
scope note: 運営会社: 小田急電鉄。路線名: 江ノ島線。鉄道区分: 普通鉄道（12）。事業者種別: 民営鉄道（4）。

直江
type: Concept
alternative label: 直江（西日本旅客鉄道 山陰線）
broader: g004879
in scheme: scheme
notation: 004879
scope note: 運営会社: 西日本旅客鉄道。路線名: 山陰線。鉄道区分: 普通鉄道JR（11）。事業者種別: JR在来線（2）。

宮山
type: Concept
alternative label: 宮山（東日本旅客鉄道 相模線）
broader: g004880
in scheme: scheme
notation: 004880
scope note: 運営会社: 東日本旅客鉄道。路線名: 相模線。鉄道区分: 普通鉄道JR（11）。事業者種別: JR在来線（2）。

姫
type: Concept
alternative label: 姫（東海旅客鉄道 太多線）
broader: g004881
in scheme: scheme
notation: 004881
scope note: 運営会社: 東海旅客鉄道。路線名: 太多線。鉄道区分: 普通鉄道JR（11）。事業者種別: JR在来線（2）。

木更津
type: Concept
alternative label: 木更津（東日本旅客鉄道 久留里線）
broader: g004882
in scheme: scheme
notation: 004882
scope note: 運営会社: 東日本旅客鉄道。路線名: 久留里線。鉄道区分: 普通鉄道JR（11）。事業者種別: JR在来線（2）。

木更津
type: Concept
alternative label: 木更津（東日本旅客鉄道 内房線）
broader: g004882
in scheme: scheme
notation: 004883
scope note: 運営会社: 東日本旅客鉄道。路線名: 内房線。鉄道区分: 普通鉄道JR（11）。事業者種別: JR在来線（2）。

上総鶴舞
type: Concept
alternative label: 上総鶴舞（小湊鐵道 小湊鐵道線）
broader: g004884
in scheme: scheme
notation: 004884
scope note: 運営会社: 小湊鐵道。路線名: 小湊鐵道線。鉄道区分: 普通鉄道（12）。事業者種別: 民営鉄道（4）。

鶴巻温泉
type: Concept
alternative label: 鶴巻温泉（小田急電鉄 小田原線）
broader: g004885
in scheme: scheme
notation: 004885
scope note: 運営会社: 小田急電鉄。路線名: 小田原線。鉄道区分: 普通鉄道（12）。事業者種別: 民営鉄道（4）。

南部市場
type: Concept
alternative label: 南部市場（横浜シーサイドライン 金沢シーサイドライン）
broader: g004886
in scheme: scheme
notation: 004886
scope note: 運営会社: 横浜シーサイドライン。路線名: 金沢シーサイドライン。鉄道区分: 案内軌条式（24）。事業者種別: 第三セクター（5）。

南宍道
type: Concept
alternative label: 南宍道（西日本旅客鉄道 木次線）
broader: g004887
in scheme: scheme
notation: 004887
scope note: 運営会社: 西日本旅客鉄道。路線名: 木次線。鉄道区分: 普通鉄道JR（11）。事業者種別: JR在来線（2）。

犬山
type: Concept
alternative label: 犬山（名古屋鉄道 犬山線）
broader: g004888
in scheme: scheme
notation: 004888
scope note: 運営会社: 名古屋鉄道。路線名: 犬山線。鉄道区分: 普通鉄道（12）。事業者種別: 民営鉄道（4）。

犬山
type: Concept
alternative label: 犬山（名古屋鉄道 広見線）
broader: g004888
in scheme: scheme
notation: 004889
scope note: 運営会社: 名古屋鉄道。路線名: 広見線。鉄道区分: 普通鉄道（12）。事業者種別: 民営鉄道（4）。

犬山
type: Concept
alternative label: 犬山（名古屋鉄道 小牧線）
broader: g004888
in scheme: scheme
notation: 004890
scope note: 運営会社: 名古屋鉄道。路線名: 小牧線。鉄道区分: 普通鉄道（12）。事業者種別: 民営鉄道（4）。

塩之沢
type: Concept
alternative label: 塩之沢（東海旅客鉄道 身延線）
broader: g004891
in scheme: scheme
notation: 004891
scope note: 運営会社: 東海旅客鉄道。路線名: 身延線。鉄道区分: 普通鉄道JR（11）。事業者種別: JR在来線（2）。

極楽
type: Concept
alternative label: 極楽（明知鉄道 明知線）
broader: g004892
in scheme: scheme
notation: 004892
scope note: 運営会社: 明知鉄道。路線名: 明知線。鉄道区分: 普通鉄道（12）。事業者種別: 第三セクター（5）。

富岡前
type: Concept
alternative label: 富岡前（名古屋鉄道 広見線）
broader: g004893
in scheme: scheme
notation: 004893
scope note: 運営会社: 名古屋鉄道。路線名: 広見線。鉄道区分: 普通鉄道（12）。事業者種別: 民営鉄道（4）。

洋光台
type: Concept
alternative label: 洋光台（東日本旅客鉄道 根岸線）
broader: g004894
in scheme: scheme
notation: 004894
scope note: 運営会社: 東日本旅客鉄道。路線名: 根岸線。鉄道区分: 普通鉄道JR（11）。事業者種別: JR在来線（2）。

長浜
type: Concept
alternative label: 長浜（西日本旅客鉄道 北陸線）
broader: g004895
in scheme: scheme
notation: 004895
scope note: 運営会社: 西日本旅客鉄道。路線名: 北陸線。鉄道区分: 普通鉄道JR（11）。事業者種別: JR在来線（2）。

鳥浜
type: Concept
alternative label: 鳥浜（横浜シーサイドライン 金沢シーサイドライン）
broader: g004896
in scheme: scheme
notation: 004896
scope note: 運営会社: 横浜シーサイドライン。路線名: 金沢シーサイドライン。鉄道区分: 案内軌条式（24）。事業者種別: 第三セクター（5）。

東大垣
type: Concept
alternative label: 東大垣（樽見鉄道 樽見線）
broader: g004897
in scheme: scheme
notation: 004897
scope note: 運営会社: 樽見鉄道。路線名: 樽見線。鉄道区分: 普通鉄道（12）。事業者種別: 第三セクター（5）。

門島
type: Concept
alternative label: 門島（東海旅客鉄道 飯田線）
broader: g004898
in scheme: scheme
notation: 004898
scope note: 運営会社: 東海旅客鉄道。路線名: 飯田線。鉄道区分: 普通鉄道JR（11）。事業者種別: JR在来線（2）。

北大垣
type: Concept
alternative label: 北大垣（養老鉄道 養老線）
broader: g004899
in scheme: scheme
notation: 004899
scope note: 運営会社: 養老鉄道。路線名: 養老線。鉄道区分: 普通鉄道（12）。事業者種別: 民営鉄道（4）。

港南台
type: Concept
alternative label: 港南台（東日本旅客鉄道 根岸線）
broader: g004900
in scheme: scheme
notation: 004900
scope note: 運営会社: 東日本旅客鉄道。路線名: 根岸線。鉄道区分: 普通鉄道JR（11）。事業者種別: JR在来線（2）。

上総一ノ宮
type: Concept
alternative label: 上総一ノ宮（東日本旅客鉄道 外房線）
broader: g004901
in scheme: scheme
notation: 004901
scope note: 運営会社: 東日本旅客鉄道。路線名: 外房線。鉄道区分: 普通鉄道JR（11）。事業者種別: JR在来線（2）。

笠松
type: Concept
alternative label: 笠松（名古屋鉄道 竹鼻線）
broader: g004902
in scheme: scheme
notation: 004902
scope note: 運営会社: 名古屋鉄道。路線名: 竹鼻線。鉄道区分: 普通鉄道（12）。事業者種別: 民営鉄道（4）。

笠松
type: Concept
alternative label: 笠松（名古屋鉄道 名古屋本線）
broader: g004902
in scheme: scheme
notation: 004903
scope note: 運営会社: 名古屋鉄道。路線名: 名古屋本線。鉄道区分: 普通鉄道（12）。事業者種別: 民営鉄道（4）。

安部
type: Concept
alternative label: 安部（若桜鉄道 若桜線）
broader: g004904
in scheme: scheme
notation: 004904
scope note: 運営会社: 若桜鉄道。路線名: 若桜線。鉄道区分: 普通鉄道（12）。事業者種別: 第三セクター（5）。

犬山口
type: Concept
alternative label: 犬山口（名古屋鉄道 犬山線）
broader: g004905
in scheme: scheme
notation: 004905
scope note: 運営会社: 名古屋鉄道。路線名: 犬山線。鉄道区分: 普通鉄道（12）。事業者種別: 民営鉄道（4）。

渋沢
type: Concept
alternative label: 渋沢（小田急電鉄 小田原線）
broader: g004906
in scheme: scheme
notation: 004906
scope note: 運営会社: 小田急電鉄。路線名: 小田原線。鉄道区分: 普通鉄道（12）。事業者種別: 民営鉄道（4）。

荒尾
type: Concept
alternative label: 荒尾（東海旅客鉄道 東海道線）
broader: g004907
in scheme: scheme
notation: 004907
scope note: 運営会社: 東海旅客鉄道。路線名: 東海道線。鉄道区分: 普通鉄道JR（11）。事業者種別: JR在来線（2）。

国英
type: Concept
alternative label: 国英（西日本旅客鉄道 因美線）
broader: g004908
in scheme: scheme
notation: 004908
scope note: 運営会社: 西日本旅客鉄道。路線名: 因美線。鉄道区分: 普通鉄道JR（11）。事業者種別: JR在来線（2）。

東海大学前
type: Concept
alternative label: 東海大学前（小田急電鉄 小田原線）
broader: g004909
in scheme: scheme
notation: 004909
scope note: 運営会社: 小田急電鉄。路線名: 小田原線。鉄道区分: 普通鉄道（12）。事業者種別: 民営鉄道（4）。

並木北
type: Concept
alternative label: 並木北（横浜シーサイドライン 金沢シーサイドライン）
broader: g004910
in scheme: scheme
notation: 004910
scope note: 運営会社: 横浜シーサイドライン。路線名: 金沢シーサイドライン。鉄道区分: 案内軌条式（24）。事業者種別: 第三セクター（5）。

公庄
type: Concept
alternative label: 公庄（WILLER TRAINS 宮福線）
broader: g004911
in scheme: scheme
notation: 004911
scope note: 運営会社: WILLER TRAINS。路線名: 宮福線。鉄道区分: 普通鉄道（12）。事業者種別: 第三セクター（5）。

養父
type: Concept
alternative label: 養父（西日本旅客鉄道 山陰線）
broader: g004912
in scheme: scheme
notation: 004912
scope note: 運営会社: 西日本旅客鉄道。路線名: 山陰線。鉄道区分: 普通鉄道JR（11）。事業者種別: JR在来線（2）。

秦野
type: Concept
alternative label: 秦野（小田急電鉄 小田原線）
broader: g004913
in scheme: scheme
notation: 004913
scope note: 運営会社: 小田急電鉄。路線名: 小田原線。鉄道区分: 普通鉄道（12）。事業者種別: 民営鉄道（4）。

垂井
type: Concept
alternative label: 垂井（東海旅客鉄道 東海道線）
broader: g004914
in scheme: scheme
notation: 004914
scope note: 運営会社: 東海旅客鉄道。路線名: 東海道線。鉄道区分: 普通鉄道JR（11）。事業者種別: JR在来線（2）。

瑞浪
type: Concept
alternative label: 瑞浪（東海旅客鉄道 中央線）
broader: g004915
in scheme: scheme
notation: 004915
scope note: 運営会社: 東海旅客鉄道。路線名: 中央線。鉄道区分: 普通鉄道JR（11）。事業者種別: JR在来線（2）。

大津町
type: Concept
alternative label: 大津町（一畑電車 北松江線）
broader: g004916
in scheme: scheme
notation: 004916
scope note: 運営会社: 一畑電車。路線名: 北松江線。鉄道区分: 普通鉄道（12）。事業者種別: 民営鉄道（4）。

西笠松
type: Concept
alternative label: 西笠松（名古屋鉄道 竹鼻線）
broader: g004917
in scheme: scheme
notation: 004917
scope note: 運営会社: 名古屋鉄道。路線名: 竹鼻線。鉄道区分: 普通鉄道（12）。事業者種別: 民営鉄道（4）。

岩村
type: Concept
alternative label: 岩村（明知鉄道 明知線）
broader: g004918
in scheme: scheme
notation: 004918
scope note: 運営会社: 明知鉄道。路線名: 明知線。鉄道区分: 普通鉄道（12）。事業者種別: 第三セクター（5）。

本郷台
type: Concept
alternative label: 本郷台（東日本旅客鉄道 根岸線）
broader: g004919
in scheme: scheme
notation: 004919
scope note: 運営会社: 東日本旅客鉄道。路線名: 根岸線。鉄道区分: 普通鉄道JR（11）。事業者種別: JR在来線（2）。

寒川
type: Concept
alternative label: 寒川（東日本旅客鉄道 相模線）
broader: g004920
in scheme: scheme
notation: 004920
scope note: 運営会社: 東日本旅客鉄道。路線名: 相模線。鉄道区分: 普通鉄道JR（11）。事業者種別: JR在来線（2）。

上総久保
type: Concept
alternative label: 上総久保（小湊鐵道 小湊鐵道線）
broader: g004921
in scheme: scheme
notation: 004921
scope note: 運営会社: 小湊鐵道。路線名: 小湊鐵道線。鉄道区分: 普通鉄道（12）。事業者種別: 民営鉄道（4）。

室
type: Concept
alternative label: 室（養老鉄道 養老線）
broader: g004922
in scheme: scheme
notation: 004922
scope note: 運営会社: 養老鉄道。路線名: 養老線。鉄道区分: 普通鉄道（12）。事業者種別: 民営鉄道（4）。

大垣
type: Concept
alternative label: 大垣（東海旅客鉄道 東海道線）
broader: g004923
in scheme: scheme
notation: 004923
scope note: 運営会社: 東海旅客鉄道。路線名: 東海道線。鉄道区分: 普通鉄道JR（11）。事業者種別: JR在来線（2）。

大垣
type: Concept
alternative label: 大垣（樽見鉄道 樽見線）
broader: g004923
in scheme: scheme
notation: 004924
scope note: 運営会社: 樽見鉄道。路線名: 樽見線。鉄道区分: 普通鉄道（12）。事業者種別: 第三セクター（5）。

木津用水
type: Concept
alternative label: 木津用水（名古屋鉄道 犬山線）
broader: g004925
in scheme: scheme
notation: 004925
scope note: 運営会社: 名古屋鉄道。路線名: 犬山線。鉄道区分: 普通鉄道（12）。事業者種別: 民営鉄道（4）。

馬来田
type: Concept
alternative label: 馬来田（東日本旅客鉄道 久留里線）
broader: g004926
in scheme: scheme
notation: 004926
scope note: 運営会社: 東日本旅客鉄道。路線名: 久留里線。鉄道区分: 普通鉄道JR（11）。事業者種別: JR在来線（2）。

京急富岡
type: Concept
alternative label: 京急富岡（京浜急行電鉄 本線）
broader: g004927
in scheme: scheme
notation: 004927
scope note: 運営会社: 京浜急行電鉄。路線名: 本線。鉄道区分: 普通鉄道（12）。事業者種別: 民営鉄道（4）。

大垣
type: Concept
alternative label: 大垣（養老鉄道 養老線）
broader: g004923
in scheme: scheme
notation: 004928
scope note: 運営会社: 養老鉄道。路線名: 養老線。鉄道区分: 普通鉄道（12）。事業者種別: 民営鉄道（4）。

谷峨
type: Concept
alternative label: 谷峨（東海旅客鉄道 御殿場線）
broader: g004929
in scheme: scheme
notation: 004929
scope note: 運営会社: 東海旅客鉄道。路線名: 御殿場線。鉄道区分: 普通鉄道JR（11）。事業者種別: JR在来線（2）。

並木中央
type: Concept
alternative label: 並木中央（横浜シーサイドライン 金沢シーサイドライン）
broader: g004930
in scheme: scheme
notation: 004930
scope note: 運営会社: 横浜シーサイドライン。路線名: 金沢シーサイドライン。鉄道区分: 案内軌条式（24）。事業者種別: 第三セクター（5）。

柳津
type: Concept
alternative label: 柳津（名古屋鉄道 竹鼻線）
broader: g004931
in scheme: scheme
notation: 004931
scope note: 運営会社: 名古屋鉄道。路線名: 竹鼻線。鉄道区分: 普通鉄道（12）。事業者種別: 民営鉄道（4）。

木曽川堤
type: Concept
alternative label: 木曽川堤（名古屋鉄道 名古屋本線）
broader: g004932
in scheme: scheme
notation: 004932
scope note: 運営会社: 名古屋鉄道。路線名: 名古屋本線。鉄道区分: 普通鉄道（12）。事業者種別: 民営鉄道（4）。

徳丸
type: Concept
alternative label: 徳丸（若桜鉄道 若桜線）
broader: g004933
in scheme: scheme
notation: 004933
scope note: 運営会社: 若桜鉄道。路線名: 若桜線。鉄道区分: 普通鉄道（12）。事業者種別: 第三セクター（5）。

関ヶ原
type: Concept
alternative label: 関ヶ原（東海旅客鉄道 東海道線）
broader: g004934
in scheme: scheme
notation: 004934
scope note: 運営会社: 東海旅客鉄道。路線名: 東海道線。鉄道区分: 普通鉄道JR（11）。事業者種別: JR在来線（2）。

八東
type: Concept
alternative label: 八東（若桜鉄道 若桜線）
broader: g004935
in scheme: scheme
notation: 004935
scope note: 運営会社: 若桜鉄道。路線名: 若桜線。鉄道区分: 普通鉄道（12）。事業者種別: 第三セクター（5）。

出雲科学館パークタウン前
type: Concept
alternative label: 出雲科学館パークタウン前（一畑電車 北松江線）
broader: g004936
in scheme: scheme
notation: 004936
scope note: 運営会社: 一畑電車。路線名: 北松江線。鉄道区分: 普通鉄道（12）。事業者種別: 民営鉄道（4）。

善行
type: Concept
alternative label: 善行（小田急電鉄 江ノ島線）
broader: g004937
in scheme: scheme
notation: 004937
scope note: 運営会社: 小田急電鉄。路線名: 江ノ島線。鉄道区分: 普通鉄道（12）。事業者種別: 民営鉄道（4）。

根本
type: Concept
alternative label: 根本（東海旅客鉄道 太多線）
broader: g004938
in scheme: scheme
notation: 004938
scope note: 運営会社: 東海旅客鉄道。路線名: 太多線。鉄道区分: 普通鉄道JR（11）。事業者種別: JR在来線（2）。

身延
type: Concept
alternative label: 身延（東海旅客鉄道 身延線）
broader: g004939
in scheme: scheme
notation: 004939
scope note: 運営会社: 東海旅客鉄道。路線名: 身延線。鉄道区分: 普通鉄道JR（11）。事業者種別: JR在来線（2）。

電鉄出雲市
type: Concept
alternative label: 電鉄出雲市（一畑電車 北松江線）
broader: g004940
in scheme: scheme
notation: 004940
scope note: 運営会社: 一畑電車。路線名: 北松江線。鉄道区分: 普通鉄道（12）。事業者種別: 民営鉄道（4）。

山北
type: Concept
alternative label: 山北（東海旅客鉄道 御殿場線）
broader: g004941
in scheme: scheme
notation: 004941
scope note: 運営会社: 東海旅客鉄道。路線名: 御殿場線。鉄道区分: 普通鉄道JR（11）。事業者種別: JR在来線（2）。

丹比
type: Concept
alternative label: 丹比（若桜鉄道 若桜線）
broader: g004942
in scheme: scheme
notation: 004942
scope note: 運営会社: 若桜鉄道。路線名: 若桜線。鉄道区分: 普通鉄道（12）。事業者種別: 第三セクター（5）。

出雲市
type: Concept
alternative label: 出雲市（西日本旅客鉄道 山陰線）
broader: g004943
in scheme: scheme
notation: 004943
scope note: 運営会社: 西日本旅客鉄道。路線名: 山陰線。鉄道区分: 普通鉄道JR（11）。事業者種別: JR在来線（2）。

能見台
type: Concept
alternative label: 能見台（京浜急行電鉄 本線）
broader: g004944
in scheme: scheme
notation: 004944
scope note: 運営会社: 京浜急行電鉄。路線名: 本線。鉄道区分: 普通鉄道（12）。事業者種別: 民営鉄道（4）。

西大垣
type: Concept
alternative label: 西大垣（養老鉄道 養老線）
broader: g004945
in scheme: scheme
notation: 004945
scope note: 運営会社: 養老鉄道。路線名: 養老線。鉄道区分: 普通鉄道（12）。事業者種別: 民営鉄道（4）。

土岐市
type: Concept
alternative label: 土岐市（東海旅客鉄道 中央線）
broader: g004946
in scheme: scheme
notation: 004946
scope note: 運営会社: 東海旅客鉄道。路線名: 中央線。鉄道区分: 普通鉄道JR（11）。事業者種別: JR在来線（2）。

扶桑
type: Concept
alternative label: 扶桑（名古屋鉄道 犬山線）
broader: g004947
in scheme: scheme
notation: 004947
scope note: 運営会社: 名古屋鉄道。路線名: 犬山線。鉄道区分: 普通鉄道（12）。事業者種別: 民営鉄道（4）。

下天津
type: Concept
alternative label: 下天津（WILLER TRAINS 宮福線）
broader: g004948
in scheme: scheme
notation: 004948
scope note: 運営会社: WILLER TRAINS。路線名: 宮福線。鉄道区分: 普通鉄道（12）。事業者種別: 第三セクター（5）。

駿河小山
type: Concept
alternative label: 駿河小山（東海旅客鉄道 御殿場線）
broader: g004949
in scheme: scheme
notation: 004949
scope note: 運営会社: 東海旅客鉄道。路線名: 御殿場線。鉄道区分: 普通鉄道JR（11）。事業者種別: JR在来線（2）。

近江長岡
type: Concept
alternative label: 近江長岡（東海旅客鉄道 東海道線）
broader: g004950
in scheme: scheme
notation: 004950
scope note: 運営会社: 東海旅客鉄道。路線名: 東海道線。鉄道区分: 普通鉄道JR（11）。事業者種別: JR在来線（2）。

幸浦
type: Concept
alternative label: 幸浦（横浜シーサイドライン 金沢シーサイドライン）
broader: g004951
in scheme: scheme
notation: 004951
scope note: 運営会社: 横浜シーサイドライン。路線名: 金沢シーサイドライン。鉄道区分: 案内軌条式（24）。事業者種別: 第三セクター（5）。

東山北
type: Concept
alternative label: 東山北（東海旅客鉄道 御殿場線）
broader: g004952
in scheme: scheme
notation: 004952
scope note: 運営会社: 東海旅客鉄道。路線名: 御殿場線。鉄道区分: 普通鉄道JR（11）。事業者種別: JR在来線（2）。

香川
type: Concept
alternative label: 香川（東日本旅客鉄道 相模線）
broader: g004953
in scheme: scheme
notation: 004953
scope note: 運営会社: 東日本旅客鉄道。路線名: 相模線。鉄道区分: 普通鉄道JR（11）。事業者種別: JR在来線（2）。

田村
type: Concept
alternative label: 田村（西日本旅客鉄道 北陸線）
broader: g004954
in scheme: scheme
notation: 004954
scope note: 運営会社: 西日本旅客鉄道。路線名: 北陸線。鉄道区分: 普通鉄道JR（11）。事業者種別: JR在来線（2）。

新旭
type: Concept
alternative label: 新旭（西日本旅客鉄道 湖西線）
broader: g004955
in scheme: scheme
notation: 004955
scope note: 運営会社: 西日本旅客鉄道。路線名: 湖西線。鉄道区分: 普通鉄道JR（11）。事業者種別: JR在来線（2）。

花白温泉
type: Concept
alternative label: 花白温泉（明知鉄道 明知線）
broader: g004956
in scheme: scheme
notation: 004956
scope note: 運営会社: 明知鉄道。路線名: 明知線。鉄道区分: 普通鉄道（12）。事業者種別: 第三セクター（5）。

下郡
type: Concept
alternative label: 下郡（東日本旅客鉄道 久留里線）
broader: g004957
in scheme: scheme
notation: 004957
scope note: 運営会社: 東日本旅客鉄道。路線名: 久留里線。鉄道区分: 普通鉄道JR（11）。事業者種別: JR在来線（2）。

鷹狩
type: Concept
alternative label: 鷹狩（西日本旅客鉄道 因美線）
broader: g004958
in scheme: scheme
notation: 004958
scope note: 運営会社: 西日本旅客鉄道。路線名: 因美線。鉄道区分: 普通鉄道JR（11）。事業者種別: JR在来線（2）。

大船
type: Concept
alternative label: 大船（東日本旅客鉄道 東海道線）
broader: g004961
in scheme: scheme
notation: 004959
scope note: 運営会社: 東日本旅客鉄道。路線名: 東海道線。鉄道区分: 普通鉄道JR（11）。事業者種別: JR在来線（2）。

大船
type: Concept
alternative label: 大船（東日本旅客鉄道 根岸線）
broader: g004961
in scheme: scheme
notation: 004960
scope note: 運営会社: 東日本旅客鉄道。路線名: 根岸線。鉄道区分: 普通鉄道JR（11）。事業者種別: JR在来線（2）。

大船
type: Concept
alternative label: 大船（東日本旅客鉄道 横須賀線）
broader: g004961
in scheme: scheme
notation: 004961
scope note: 運営会社: 東日本旅客鉄道。路線名: 横須賀線。鉄道区分: 普通鉄道JR（11）。事業者種別: JR在来線（2）。

産業振興センター
type: Concept
alternative label: 産業振興センター（横浜シーサイドライン 金沢シーサイドライン）
broader: g004962
in scheme: scheme
notation: 004962
scope note: 運営会社: 横浜シーサイドライン。路線名: 金沢シーサイドライン。鉄道区分: 案内軌条式（24）。事業者種別: 第三セクター（5）。

高滝
type: Concept
alternative label: 高滝（小湊鐵道 小湊鐵道線）
broader: g004963
in scheme: scheme
notation: 004963
scope note: 運営会社: 小湊鐵道。路線名: 小湊鐵道線。鉄道区分: 普通鉄道（12）。事業者種別: 民営鉄道（4）。

大船
type: Concept
alternative label: 大船（湘南モノレール 江の島線）
broader: g004961
in scheme: scheme
notation: 004964
scope note: 運営会社: 湘南モノレール。路線名: 江の島線。鉄道区分: 懸垂式鉄道（14）。事業者種別: 民営鉄道（4）。

羽黒
type: Concept
alternative label: 羽黒（名古屋鉄道 小牧線）
broader: g004965
in scheme: scheme
notation: 004965
scope note: 運営会社: 名古屋鉄道。路線名: 小牧線。鉄道区分: 普通鉄道（12）。事業者種別: 民営鉄道（4）。

黒田
type: Concept
alternative label: 黒田（名古屋鉄道 名古屋本線）
broader: g004966
in scheme: scheme
notation: 004966
scope note: 運営会社: 名古屋鉄道。路線名: 名古屋本線。鉄道区分: 普通鉄道（12）。事業者種別: 民営鉄道（4）。

山岡
type: Concept
alternative label: 山岡（明知鉄道 明知線）
broader: g004967
in scheme: scheme
notation: 004967
scope note: 運営会社: 明知鉄道。路線名: 明知線。鉄道区分: 普通鉄道（12）。事業者種別: 第三セクター（5）。

福浦
type: Concept
alternative label: 福浦（横浜シーサイドライン 金沢シーサイドライン）
broader: g004968
in scheme: scheme
notation: 004968
scope note: 運営会社: 横浜シーサイドライン。路線名: 金沢シーサイドライン。鉄道区分: 案内軌条式（24）。事業者種別: 第三セクター（5）。

小泉
type: Concept
alternative label: 小泉（東海旅客鉄道 太多線）
broader: g004969
in scheme: scheme
notation: 004969
scope note: 運営会社: 東海旅客鉄道。路線名: 太多線。鉄道区分: 普通鉄道JR（11）。事業者種別: JR在来線（2）。

田本
type: Concept
alternative label: 田本（東海旅客鉄道 飯田線）
broader: g004970
in scheme: scheme
notation: 004970
scope note: 運営会社: 東海旅客鉄道。路線名: 飯田線。鉄道区分: 普通鉄道JR（11）。事業者種別: JR在来線（2）。

梅迫
type: Concept
alternative label: 梅迫（西日本旅客鉄道 舞鶴線）
broader: g004971
in scheme: scheme
notation: 004971
scope note: 運営会社: 西日本旅客鉄道。路線名: 舞鶴線。鉄道区分: 普通鉄道JR（11）。事業者種別: JR在来線（2）。

伯耆溝口
type: Concept
alternative label: 伯耆溝口（西日本旅客鉄道 伯備線）
broader: g004972
in scheme: scheme
notation: 004972
scope note: 運営会社: 西日本旅客鉄道。路線名: 伯備線。鉄道区分: 普通鉄道JR（11）。事業者種別: JR在来線（2）。

藤沢本町
type: Concept
alternative label: 藤沢本町（小田急電鉄 江ノ島線）
broader: g004973
in scheme: scheme
notation: 004973
scope note: 運営会社: 小田急電鉄。路線名: 江ノ島線。鉄道区分: 普通鉄道（12）。事業者種別: 民営鉄道（4）。

木曽川
type: Concept
alternative label: 木曽川（東海旅客鉄道 東海道線）
broader: g004974
in scheme: scheme
notation: 004974
scope note: 運営会社: 東海旅客鉄道。路線名: 東海道線。鉄道区分: 普通鉄道JR（11）。事業者種別: JR在来線（2）。

南宿
type: Concept
alternative label: 南宿（名古屋鉄道 竹鼻線）
broader: g004975
in scheme: scheme
notation: 004975
scope note: 運営会社: 名古屋鉄道。路線名: 竹鼻線。鉄道区分: 普通鉄道（12）。事業者種別: 民営鉄道（4）。

東浪見
type: Concept
alternative label: 東浪見（東日本旅客鉄道 外房線）
broader: g004976
in scheme: scheme
notation: 004976
scope note: 運営会社: 東日本旅客鉄道。路線名: 外房線。鉄道区分: 普通鉄道JR（11）。事業者種別: JR在来線（2）。

松田
type: Concept
alternative label: 松田（東海旅客鉄道 御殿場線）
broader: g004977
in scheme: scheme
notation: 004977
scope note: 運営会社: 東海旅客鉄道。路線名: 御殿場線。鉄道区分: 普通鉄道JR（11）。事業者種別: JR在来線（2）。

富士見町
type: Concept
alternative label: 富士見町（湘南モノレール 江の島線）
broader: g004978
in scheme: scheme
notation: 004978
scope note: 運営会社: 湘南モノレール。路線名: 江の島線。鉄道区分: 懸垂式鉄道（14）。事業者種別: 民営鉄道（4）。

若桜
type: Concept
alternative label: 若桜（若桜鉄道 若桜線）
broader: g004979
in scheme: scheme
notation: 004979
scope note: 運営会社: 若桜鉄道。路線名: 若桜線。鉄道区分: 普通鉄道（12）。事業者種別: 第三セクター（5）。

柏森
type: Concept
alternative label: 柏森（名古屋鉄道 犬山線）
broader: g004980
in scheme: scheme
notation: 004980
scope note: 運営会社: 名古屋鉄道。路線名: 犬山線。鉄道区分: 普通鉄道（12）。事業者種別: 民営鉄道（4）。

新松田
type: Concept
alternative label: 新松田（小田急電鉄 小田原線）
broader: g004981
in scheme: scheme
notation: 004981
scope note: 運営会社: 小田急電鉄。路線名: 小田原線。鉄道区分: 普通鉄道（12）。事業者種別: 民営鉄道（4）。

柏原
type: Concept
alternative label: 柏原（東海旅客鉄道 東海道線）
broader: g004982
in scheme: scheme
notation: 004982
scope note: 運営会社: 東海旅客鉄道。路線名: 東海道線。鉄道区分: 普通鉄道JR（11）。事業者種別: JR在来線（2）。

加茂中
type: Concept
alternative label: 加茂中（西日本旅客鉄道 木次線）
broader: g004983
in scheme: scheme
notation: 004983
scope note: 運営会社: 西日本旅客鉄道。路線名: 木次線。鉄道区分: 普通鉄道JR（11）。事業者種別: JR在来線（2）。

市大医学部
type: Concept
alternative label: 市大医学部（横浜シーサイドライン 金沢シーサイドライン）
broader: g004984
in scheme: scheme
notation: 004984
scope note: 運営会社: 横浜シーサイドライン。路線名: 金沢シーサイドライン。鉄道区分: 案内軌条式（24）。事業者種別: 第三セクター（5）。

美濃青柳
type: Concept
alternative label: 美濃青柳（養老鉄道 養老線）
broader: g004985
in scheme: scheme
notation: 004985
scope note: 運営会社: 養老鉄道。路線名: 養老線。鉄道区分: 普通鉄道（12）。事業者種別: 民営鉄道（4）。

金沢文庫
type: Concept
alternative label: 金沢文庫（京浜急行電鉄 本線）
broader: g004986
in scheme: scheme
notation: 004986
scope note: 運営会社: 京浜急行電鉄。路線名: 本線。鉄道区分: 普通鉄道（12）。事業者種別: 民営鉄道（4）。

用瀬
type: Concept
alternative label: 用瀬（西日本旅客鉄道 因美線）
broader: g004987
in scheme: scheme
notation: 004987
scope note: 運営会社: 西日本旅客鉄道。路線名: 因美線。鉄道区分: 普通鉄道JR（11）。事業者種別: JR在来線（2）。

海の公園柴口
type: Concept
alternative label: 海の公園柴口（横浜シーサイドライン 金沢シーサイドライン）
broader: g004988
in scheme: scheme
notation: 004988
scope note: 運営会社: 横浜シーサイドライン。路線名: 金沢シーサイドライン。鉄道区分: 案内軌条式（24）。事業者種別: 第三セクター（5）。

新木曽川
type: Concept
alternative label: 新木曽川（名古屋鉄道 名古屋本線）
broader: g004989
in scheme: scheme
notation: 004989
scope note: 運営会社: 名古屋鉄道。路線名: 名古屋本線。鉄道区分: 普通鉄道（12）。事業者種別: 民営鉄道（4）。

上夜久野
type: Concept
alternative label: 上夜久野（西日本旅客鉄道 山陰線）
broader: g004990
in scheme: scheme
notation: 004990
scope note: 運営会社: 西日本旅客鉄道。路線名: 山陰線。鉄道区分: 普通鉄道JR（11）。事業者種別: JR在来線（2）。

和田山
type: Concept
alternative label: 和田山（西日本旅客鉄道 山陰線）
broader: g004991
in scheme: scheme
notation: 004991
scope note: 運営会社: 西日本旅客鉄道。路線名: 山陰線。鉄道区分: 普通鉄道JR（11）。事業者種別: JR在来線（2）。

和田山
type: Concept
alternative label: 和田山（西日本旅客鉄道 播但線）
broader: g004991
in scheme: scheme
notation: 004992
scope note: 運営会社: 西日本旅客鉄道。路線名: 播但線。鉄道区分: 普通鉄道JR（11）。事業者種別: JR在来線（2）。

八景島
type: Concept
alternative label: 八景島（横浜シーサイドライン 金沢シーサイドライン）
broader: g004993
in scheme: scheme
notation: 004993
scope note: 運営会社: 横浜シーサイドライン。路線名: 金沢シーサイドライン。鉄道区分: 案内軌条式（24）。事業者種別: 第三セクター（5）。

須賀
type: Concept
alternative label: 須賀（名古屋鉄道 竹鼻線）
broader: g004994
in scheme: scheme
notation: 004994
scope note: 運営会社: 名古屋鉄道。路線名: 竹鼻線。鉄道区分: 普通鉄道（12）。事業者種別: 民営鉄道（4）。

北茅ヶ崎
type: Concept
alternative label: 北茅ヶ崎（東日本旅客鉄道 相模線）
broader: g004995
in scheme: scheme
notation: 004995
scope note: 運営会社: 東日本旅客鉄道。路線名: 相模線。鉄道区分: 普通鉄道JR（11）。事業者種別: JR在来線（2）。

藤沢
type: Concept
alternative label: 藤沢（東日本旅客鉄道 東海道線）
broader: g004997
in scheme: scheme
notation: 004996
scope note: 運営会社: 東日本旅客鉄道。路線名: 東海道線。鉄道区分: 普通鉄道JR（11）。事業者種別: JR在来線（2）。

藤沢
type: Concept
alternative label: 藤沢（小田急電鉄 江ノ島線）
broader: g004997
in scheme: scheme
notation: 004997
scope note: 運営会社: 小田急電鉄。路線名: 江ノ島線。鉄道区分: 普通鉄道（12）。事業者種別: 民営鉄道（4）。

北鎌倉
type: Concept
alternative label: 北鎌倉（東日本旅客鉄道 横須賀線）
broader: g004998
in scheme: scheme
notation: 004998
scope note: 運営会社: 東日本旅客鉄道。路線名: 横須賀線。鉄道区分: 普通鉄道JR（11）。事業者種別: JR在来線（2）。

湘南町屋
type: Concept
alternative label: 湘南町屋（湘南モノレール 江の島線）
broader: g004999
in scheme: scheme
notation: 004999
scope note: 運営会社: 湘南モノレール。路線名: 江の島線。鉄道区分: 懸垂式鉄道（14）。事業者種別: 民営鉄道（4）。

牧
type: Concept
alternative label: 牧（WILLER TRAINS 宮福線）
broader: g005000
in scheme: scheme
notation: 005000
scope note: 運営会社: WILLER TRAINS。路線名: 宮福線。鉄道区分: 普通鉄道（12）。事業者種別: 第三セクター（5）。

藤沢
type: Concept
alternative label: 藤沢（江ノ島電鉄 江ノ島電鉄線）
broader: g004997
in scheme: scheme
notation: 005001
scope note: 運営会社: 江ノ島電鉄。路線名: 江ノ島電鉄線。鉄道区分: 普通鉄道（12）。事業者種別: 民営鉄道（4）。

里見
type: Concept
alternative label: 里見（小湊鐵道 小湊鐵道線）
broader: g005002
in scheme: scheme
notation: 005002
scope note: 運営会社: 小湊鐵道。路線名: 小湊鐵道線。鉄道区分: 普通鉄道（12）。事業者種別: 民営鉄道（4）。

海の公園南口
type: Concept
alternative label: 海の公園南口（横浜シーサイドライン 金沢シーサイドライン）
broader: g005003
in scheme: scheme
notation: 005003
scope note: 運営会社: 横浜シーサイドライン。路線名: 金沢シーサイドライン。鉄道区分: 案内軌条式（24）。事業者種別: 第三セクター（5）。

辻堂
type: Concept
alternative label: 辻堂（東日本旅客鉄道 東海道線）
broader: g005004
in scheme: scheme
notation: 005004
scope note: 運営会社: 東日本旅客鉄道。路線名: 東海道線。鉄道区分: 普通鉄道JR（11）。事業者種別: JR在来線（2）。

温田
type: Concept
alternative label: 温田（東海旅客鉄道 飯田線）
broader: g005005
in scheme: scheme
notation: 005005
scope note: 運営会社: 東海旅客鉄道。路線名: 飯田線。鉄道区分: 普通鉄道JR（11）。事業者種別: JR在来線（2）。

坂田
type: Concept
alternative label: 坂田（西日本旅客鉄道 北陸線）
broader: g005006
in scheme: scheme
notation: 005006
scope note: 運営会社: 西日本旅客鉄道。路線名: 北陸線。鉄道区分: 普通鉄道JR（11）。事業者種別: JR在来線（2）。

西出雲
type: Concept
alternative label: 西出雲（西日本旅客鉄道 山陰線）
broader: g005007
in scheme: scheme
notation: 005007
scope note: 運営会社: 西日本旅客鉄道。路線名: 山陰線。鉄道区分: 普通鉄道JR（11）。事業者種別: JR在来線（2）。

玉ノ井
type: Concept
alternative label: 玉ノ井（名古屋鉄道 尾西線）
broader: g005008
in scheme: scheme
notation: 005008
scope note: 運営会社: 名古屋鉄道。路線名: 尾西線。鉄道区分: 普通鉄道（12）。事業者種別: 民営鉄道（4）。

多治見
type: Concept
alternative label: 多治見（東海旅客鉄道 太多線）
broader: g005009
in scheme: scheme
notation: 005009
scope note: 運営会社: 東海旅客鉄道。路線名: 太多線。鉄道区分: 普通鉄道JR（11）。事業者種別: JR在来線（2）。

多治見
type: Concept
alternative label: 多治見（東海旅客鉄道 中央線）
broader: g005009
in scheme: scheme
notation: 005010
scope note: 運営会社: 東海旅客鉄道。路線名: 中央線。鉄道区分: 普通鉄道JR（11）。事業者種別: JR在来線（2）。

江南
type: Concept
alternative label: 江南（名古屋鉄道 犬山線）
broader: g005011
in scheme: scheme
notation: 005011
scope note: 運営会社: 名古屋鉄道。路線名: 犬山線。鉄道区分: 普通鉄道（12）。事業者種別: 民営鉄道（4）。

幡屋
type: Concept
alternative label: 幡屋（西日本旅客鉄道 木次線）
broader: g005012
in scheme: scheme
notation: 005012
scope note: 運営会社: 西日本旅客鉄道。路線名: 木次線。鉄道区分: 普通鉄道JR（11）。事業者種別: JR在来線（2）。

相模金子
type: Concept
alternative label: 相模金子（東海旅客鉄道 御殿場線）
broader: g005013
in scheme: scheme
notation: 005013
scope note: 運営会社: 東海旅客鉄道。路線名: 御殿場線。鉄道区分: 普通鉄道JR（11）。事業者種別: JR在来線（2）。

君津
type: Concept
alternative label: 君津（東日本旅客鉄道 内房線）
broader: g005014
in scheme: scheme
notation: 005014
scope note: 運営会社: 東日本旅客鉄道。路線名: 内房線。鉄道区分: 普通鉄道JR（11）。事業者種別: JR在来線（2）。

湘南深沢
type: Concept
alternative label: 湘南深沢（湘南モノレール 江の島線）
broader: g005015
in scheme: scheme
notation: 005015
scope note: 運営会社: 湘南モノレール。路線名: 江の島線。鉄道区分: 懸垂式鉄道（14）。事業者種別: 民営鉄道（4）。

不破一色
type: Concept
alternative label: 不破一色（名古屋鉄道 竹鼻線）
broader: g005016
in scheme: scheme
notation: 005016
scope note: 運営会社: 名古屋鉄道。路線名: 竹鼻線。鉄道区分: 普通鉄道（12）。事業者種別: 民営鉄道（4）。

石上
type: Concept
alternative label: 石上（江ノ島電鉄 江ノ島電鉄線）
broader: g005017
in scheme: scheme
notation: 005017
scope note: 運営会社: 江ノ島電鉄。路線名: 江ノ島電鉄線。鉄道区分: 普通鉄道（12）。事業者種別: 民営鉄道（4）。

足柄
type: Concept
alternative label: 足柄（東海旅客鉄道 御殿場線）
broader: g005018
in scheme: scheme
notation: 005018
scope note: 運営会社: 東海旅客鉄道。路線名: 御殿場線。鉄道区分: 普通鉄道JR（11）。事業者種別: JR在来線（2）。

金沢八景
type: Concept
alternative label: 金沢八景（横浜シーサイドライン 金沢シーサイドライン）
broader: g005020
in scheme: scheme
notation: 005019
scope note: 運営会社: 横浜シーサイドライン。路線名: 金沢シーサイドライン。鉄道区分: 案内軌条式（24）。事業者種別: 第三セクター（5）。

金沢八景
type: Concept
alternative label: 金沢八景（京浜急行電鉄 逗子線）
broader: g005020
in scheme: scheme
notation: 005020
scope note: 運営会社: 京浜急行電鉄。路線名: 逗子線。鉄道区分: 普通鉄道（12）。事業者種別: 民営鉄道（4）。

金沢八景
type: Concept
alternative label: 金沢八景（京浜急行電鉄 本線）
broader: g005020
in scheme: scheme
notation: 005021
scope note: 運営会社: 京浜急行電鉄。路線名: 本線。鉄道区分: 普通鉄道（12）。事業者種別: 民営鉄道（4）。

本鵠沼
type: Concept
alternative label: 本鵠沼（小田急電鉄 江ノ島線）
broader: g005022
in scheme: scheme
notation: 005022
scope note: 運営会社: 小田急電鉄。路線名: 江ノ島線。鉄道区分: 普通鉄道（12）。事業者種別: 民営鉄道（4）。

茅ヶ崎
type: Concept
alternative label: 茅ヶ崎（東日本旅客鉄道 相模線）
broader: g005023
in scheme: scheme
notation: 005023
scope note: 運営会社: 東日本旅客鉄道。路線名: 相模線。鉄道区分: 普通鉄道JR（11）。事業者種別: JR在来線（2）。

茅ヶ崎
type: Concept
alternative label: 茅ヶ崎（東日本旅客鉄道 東海道線）
broader: g005023
in scheme: scheme
notation: 005024
scope note: 運営会社: 東日本旅客鉄道。路線名: 東海道線。鉄道区分: 普通鉄道JR（11）。事業者種別: JR在来線（2）。

野島公園
type: Concept
alternative label: 野島公園（横浜シーサイドライン 金沢シーサイドライン）
broader: g005025
in scheme: scheme
notation: 005025
scope note: 運営会社: 横浜シーサイドライン。路線名: 金沢シーサイドライン。鉄道区分: 案内軌条式（24）。事業者種別: 第三セクター（5）。

青堀
type: Concept
alternative label: 青堀（東日本旅客鉄道 内房線）
broader: g005026
in scheme: scheme
notation: 005026
scope note: 運営会社: 東日本旅客鉄道。路線名: 内房線。鉄道区分: 普通鉄道JR（11）。事業者種別: JR在来線（2）。

楽田
type: Concept
alternative label: 楽田（名古屋鉄道 小牧線）
broader: g005027
in scheme: scheme
notation: 005027
scope note: 運営会社: 名古屋鉄道。路線名: 小牧線。鉄道区分: 普通鉄道（12）。事業者種別: 民営鉄道（4）。

上川口
type: Concept
alternative label: 上川口（西日本旅客鉄道 山陰線）
broader: g005028
in scheme: scheme
notation: 005028
scope note: 運営会社: 西日本旅客鉄道。路線名: 山陰線。鉄道区分: 普通鉄道JR（11）。事業者種別: JR在来線（2）。

淵垣
type: Concept
alternative label: 淵垣（西日本旅客鉄道 舞鶴線）
broader: g005029
in scheme: scheme
notation: 005029
scope note: 運営会社: 西日本旅客鉄道。路線名: 舞鶴線。鉄道区分: 普通鉄道JR（11）。事業者種別: JR在来線（2）。

小櫃
type: Concept
alternative label: 小櫃（東日本旅客鉄道 久留里線）
broader: g005030
in scheme: scheme
notation: 005030
scope note: 運営会社: 東日本旅客鉄道。路線名: 久留里線。鉄道区分: 普通鉄道JR（11）。事業者種別: JR在来線（2）。

甲斐大島
type: Concept
alternative label: 甲斐大島（東海旅客鉄道 身延線）
broader: g005031
in scheme: scheme
notation: 005031
scope note: 運営会社: 東海旅客鉄道。路線名: 身延線。鉄道区分: 普通鉄道JR（11）。事業者種別: JR在来線（2）。